id_mutation,date_mutation,numero_disposition,nature_mutation,valeur_fonciere,adresse_numero,adresse_suffixe,adresse_nom_voie,adresse_code_voie,code_postal,code_commune,nom_commune,code_departement,ancien_code_commune,ancien_nom_commune,id_parcelle,ancien_id_parcelle,numero_volume,lot1_numero,lot1_surface_carrez,lot2_numero,lot2_surface_carrez,lot3_numero,lot3_surface_carrez,lot4_numero,lot4_surface_carrez,lot5_numero,lot5_surface_carrez,nombre_lots,code_type_local,type_local,surface_reelle_bati,nombre_pieces_principales,code_nature_culture,nature_culture,code_nature_culture_speciale,nature_culture_speciale,surface_terrain,longitude,latitude
2021-385323,2021-03-24,000001,Vente,34944,,,LES BOIS D ILLIERS,B006,28120,28282,Nonvilliers-Grandhoux,28,,,28282000ZW0008,,,,,,,,,,,,,0,,,,,T,terres,,,49920,1.127895,48.34845
2021-385327,2021-03-26,000001,Vente,98100,12,,LE BOUT DES BRUYERES,B015,28120,28282,Nonvilliers-Grandhoux,28,,,28282000ZM0073,,,,,,,,,,,,,0,1,Maison,76,2,S,sols,,,2840,1.174043,48.318048
2021-385327,2021-03-26,000001,Vente,98100,,,LE BOUT DES BRUYERES,B015,28120,28282,Nonvilliers-Grandhoux,28,,,28282000ZM0074,,,,,,,,,,,,,0,,,,,J,jardins,,,610,1.173456,48.317882
2021-385327,2021-03-26,000001,Vente,98100,,,LE BOUT DES BRUYERES,B015,28120,28282,Nonvilliers-Grandhoux,28,,,28282000ZM0075,,,,,,,,,,,,,0,,,,,T,terres,,,1985,1.173493,48.318324
2021-387688,2021-06-18,000001,Vente,194000,1,,GR GRANDE RUE,0050,28120,28282,Nonvilliers-Grandhoux,28,,,282820000D0075,,,,,,,,,,,,,0,1,Maison,200,5,AG,terrains d'agrément,,,975,1.17544,48.342011
2021-387688,2021-06-18,000001,Vente,194000,1,,GR GRANDE RUE,0050,28120,28282,Nonvilliers-Grandhoux,28,,,282820000D0075,,,,,,,,,,,,,0,3,Dépendance,,0,AG,terrains d'agrément,,,975,1.17544,48.342011
2021-387688,2021-06-18,000001,Vente,194000,1,,GR GRANDE RUE,0050,28120,28282,Nonvilliers-Grandhoux,28,,,282820000D0075,,,,,,,,,,,,,0,1,Maison,200,5,S,sols,,,110,1.17544,48.342011
2021-387688,2021-06-18,000001,Vente,194000,1,,GR GRANDE RUE,0050,28120,28282,Nonvilliers-Grandhoux,28,,,282820000D0075,,,,,,,,,,,,,0,3,Dépendance,,0,S,sols,,,110,1.17544,48.342011
2021-387688,2021-06-18,000001,Vente,194000,1,,GR GRANDE RUE,0050,28120,28282,Nonvilliers-Grandhoux,28,,,282820000D0076,,,,,,,,,,,,,0,,,,,AG,terrains d'agrément,,,685,1.175287,48.34204
2021-387688,2021-06-18,000001,Vente,194000,1,,GR GRANDE RUE,0050,28120,28282,Nonvilliers-Grandhoux,28,,,282820000D0076,,,,,,,,,,,,,0,,,,,S,sols,,,60,1.175287,48.34204
2021-388522,2021-06-22,000001,Vente,256000,1,A,RUE SAINT GILLES,0072,28120,28282,Nonvilliers-Grandhoux,28,,,28282000ZO0224,,,,,,,,,,,,,0,4,Local industriel. commercial ou assimilé,,0,S,sols,,,4,1.150486,48.323442
2021-388522,2021-06-22,000001,Vente,256000,1,,RUE SAINT GILLES,0072,28120,28282,Nonvilliers-Grandhoux,28,,,28282000ZO0225,,,,,,,,,,,,,0,1,Maison,102,4,S,sols,,,676,1.150568,48.323377
2021-388522,2021-06-22,000001,Vente,256000,1,,RUE SAINT GILLES,0072,28120,28282,Nonvilliers-Grandhoux,28,,,28282000ZO0225,,,,,,,,,,,,,0,3,Dépendance,,0,S,sols,,,676,1.150568,48.323377
2021-388522,2021-06-22,000001,Vente,256000,1,,RUE SAINT GILLES,0072,28120,28282,Nonvilliers-Grandhoux,28,,,28282000ZO0225,,,,,,,,,,,,,0,3,Dépendance,,0,S,sols,,,676,1.150568,48.323377
2021-388522,2021-06-22,000001,Vente,256000,1,,RUE SAINT GILLES,0072,28120,28282,Nonvilliers-Grandhoux,28,,,28282000ZO0226,,,,,,,,,,,,,0,,,,,J,jardins,,,520,1.15058,48.323127
2021-388920,2021-07-01,000001,Vente,30000,7,,LA TANNERIE,B079,28120,28282,Nonvilliers-Grandhoux,28,,,28282000ZT0004,,,,,,,,,,,,,0,1,Maison,50,2,J,jardins,,,950,1.128175,48.346807
2021-388920,2021-07-01,000001,Vente,30000,7,,LA TANNERIE,B079,28120,28282,Nonvilliers-Grandhoux,28,,,28282000ZT0004,,,,,,,,,,,,,0,3,Dépendance,,0,J,jardins,,,950,1.128175,48.346807
2021-389253,2021-07-15,000001,Vente,100600,7,,RUE SAINT VINCENT,0080,28120,28282,Nonvilliers-Grandhoux,28,,,28282000ZO0248,,,,,,,,,,,,,0,1,Maison,69,3,S,sols,,,684,1.151793,48.32358
2021-390490,2021-09-04,000001,Vente,130000,14,,RUE EUGENIE  BLOT,0030,28120,28282,Nonvilliers-Grandhoux,28,,,28282000ZI0057,,,,,,,,,,,,,0,3,Dépendance,,0,S,sols,,,348,1.172603,48.34113
2021-390490,2021-09-04,000001,Vente,130000,14,,RUE EUGENIE  BLOT,0030,28120,28282,Nonvilliers-Grandhoux,28,,,28282000ZI0057,,,,,,,,,,,,,0,3,Dépendance,,0,AG,terrains d'agrément,,,914,1.172603,48.34113
2021-390490,2021-09-04,000001,Vente,130000,14,,RUE EUGENIE  BLOT,0030,28120,28282,Nonvilliers-Grandhoux,28,,,28282000ZI0057,,,,,,,,,,,,,0,1,Maison,82,4,AG,terrains d'agrément,,,914,1.172603,48.34113
2021-390490,2021-09-04,000001,Vente,130000,14,,RUE EUGENIE  BLOT,0030,28120,28282,Nonvilliers-Grandhoux,28,,,28282000ZI0057,,,,,,,,,,,,,0,1,Maison,82,4,S,sols,,,348,1.172603,48.34113
2021-390490,2021-09-04,000001,Vente,130000,14,,RUE EUGENIE  BLOT,0030,28120,28282,Nonvilliers-Grandhoux,28,,,28282000ZI0057,,,,,,,,,,,,,0,1,Maison,82,4,S,sols,,,32,1.172603,48.34113
2021-390490,2021-09-04,000001,Vente,130000,14,,RUE EUGENIE  BLOT,0030,28120,28282,Nonvilliers-Grandhoux,28,,,28282000ZI0057,,,,,,,,,,,,,0,3,Dépendance,,0,S,sols,,,32,1.172603,48.34113
2021-390568,2021-09-10,000001,Vente,50200,14,,GR GRANDE RUE,0050,28120,28282,Nonvilliers-Grandhoux,28,,,282820000D0404,,,,,,,,,,,,,0,3,Dépendance,,0,S,sols,,,346,1.171154,48.343325
2021-390568,2021-09-10,000001,Vente,50200,14,,GR GRANDE RUE,0050,28120,28282,Nonvilliers-Grandhoux,28,,,282820000D0404,,,,,,,,,,,,,0,3,Dépendance,,0,S,sols,,,346,1.171154,48.343325
2021-390568,2021-09-10,000001,Vente,50200,14,,GR GRANDE RUE,0050,28120,28282,Nonvilliers-Grandhoux,28,,,282820000D0404,,,,,,,,,,,,,0,1,Maison,56,2,S,sols,,,346,1.171154,48.343325
2021-391075,2021-09-14,000001,Vente,1000,,,LES MARINIERES,B058,28120,28282,Nonvilliers-Grandhoux,28,,,28282000ZR0053,,,,,,,,,,,,,0,,,,,BT,taillis simples,,,5435,1.134762,48.327685
2021-391442,2021-09-10,000001,Vente,95000,5,,LA PLANCHE A 4 PIEDS,B088,28120,28282,Nonvilliers-Grandhoux,28,,,28282000ZO0261,,,,,,,,,,,,,0,1,Maison,72,3,P,prés,,,610,1.146243,48.319347
2021-391442,2021-09-10,000001,Vente,95000,5,,LA PLANCHE A 4 PIEDS,B088,28120,28282,Nonvilliers-Grandhoux,28,,,28282000ZO0261,,,,,,,,,,,,,0,1,Maison,72,3,S,sols,,,570,1.146243,48.319347
2021-391893,2021-10-14,000001,Vente,98000,,,LE BOIS D'AMOUR,B004,28120,28282,Nonvilliers-Grandhoux,28,,,28282000ZH0036,,,,,,,,,,,,,0,,,,,J,jardins,,,405,1.187157,48.344084
2021-391893,2021-10-14,000001,Vente,98000,4,,LE BOIS D'AMOUR,B004,28120,28282,Nonvilliers-Grandhoux,28,,,28282000ZH0078,,,,,,,,,,,,,0,1,Maison,85,3,S,sols,,,297,1.187445,48.344151
2021-392033,2021-10-01,000001,Vente,80000,1,,LE THENERAY,B080,28120,28282,Nonvilliers-Grandhoux,28,,,28282000ZN0059,,,,,,,,,,,,,0,,,,,S,sols,,,1330,1.154073,48.333934
2021-392033,2021-10-01,000001,Vente,80000,1,,LE THENERAY,B080,28120,28282,Nonvilliers-Grandhoux,28,,,28282000ZN0060,,,,,,,,,,,,,0,,,,,S,sols,,,265,1.153451,48.333762
2021-392033,2021-10-01,000001,Vente,80000,1,,LE THENERAY,B080,28120,28282,Nonvilliers-Grandhoux,28,,,28282000ZN0061,,,,,,,,,,,,,0,,,,,P,prés,,,645,1.153338,48.333899
2021-392033,2021-10-01,000001,Vente,80000,1,,LE THENERAY,B080,28120,28282,Nonvilliers-Grandhoux,28,,,28282000ZN0064,,,,,,,,,,,,,0,,,,,J,jardins,,,1125,1.152568,48.33363
2021-392033,2021-10-01,000001,Vente,80000,1,,LE THENERAY,B080,28120,28282,Nonvilliers-Grandhoux,28,,,28282000ZN0087,,,,,,,,,,,,,0,,,,,S,sols,,,1968,1.153125,48.333699
2021-392374,2021-10-09,000001,Vente,125000,7,,GR GRANDE RUE,0050,28120,28282,Nonvilliers-Grandhoux,28,,,282820000D0053,,,,,,,,,,,,,0,3,Dépendance,,0,S,sols,,,1155,1.172227,48.342646
2021-392374,2021-10-09,000001,Vente,125000,7,,GR GRANDE RUE,0050,28120,28282,Nonvilliers-Grandhoux,28,,,282820000D0053,,,,,,,,,,,,,0,3,Dépendance,,0,S,sols,,,1155,1.172227,48.342646
2021-392374,2021-10-09,000001,Vente,125000,7,,GR GRANDE RUE,0050,28120,28282,Nonvilliers-Grandhoux,28,,,282820000D0053,,,,,,,,,,,,,0,1,Maison,162,5,S,sols,,,1155,1.172227,48.342646
2021-392374,2021-10-09,000001,Vente,125000,7,,GR GRANDE RUE,0050,28120,28282,Nonvilliers-Grandhoux,28,,,282820000D0053,,,,,,,,,,,,,0,3,Dépendance,,0,S,sols,,,1155,1.172227,48.342646
2021-392374,2021-10-09,000001,Vente,125000,7,,GR GRANDE RUE,0050,28120,28282,Nonvilliers-Grandhoux,28,,,282820000D0053,,,,,,,,,,,,,0,3,Dépendance,,0,S,sols,,,1155,1.172227,48.342646
2021-392374,2021-10-09,000001,Vente,125000,,,GR GRANDE RUE,0050,28120,28282,Nonvilliers-Grandhoux,28,,,282820000D0399,,,,,,,,,,,,,0,,,,,J,jardins,,,7,1.17219,48.342744
2021-392374,2021-10-09,000001,Vente,125000,,,NONVILLIERS,B063,28120,28282,Nonvilliers-Grandhoux,28,,,282820000D0400,,,,,,,,,,,,,0,,,,,S,sols,,,96,1.171895,48.342451
2021-392374,2021-10-09,000001,Vente,125000,,,RUE EUGENIE  BLOT,0030,28120,28282,Nonvilliers-Grandhoux,28,,,282820000D0430,,,,,,,,,,,,,0,,,,,AG,terrains d'agrément,,,400,1.172335,48.34247
2021-392442,2021-10-13,000001,Vente,3800,,,LES NOUETTES,B064,28120,28282,Nonvilliers-Grandhoux,28,,,28282000ZO0045,,,,,,,,,,,,,0,,,,,T,terres,,,4190,1.152682,48.318713
2021-392442,2021-10-13,000001,Vente,3800,,,LES NOUETTES,B064,28120,28282,Nonvilliers-Grandhoux,28,,,28282000ZO0045,,,,,,,,,,,,,0,,,,,T,terres,,,4190,1.152682,48.318713
2021-392442,2021-10-13,000001,Vente,3800,,,LES NOUETTES,B064,28120,28282,Nonvilliers-Grandhoux,28,,,28282000ZO0135,,,,,,,,,,,,,0,,,,,T,terres,,,6050,1.151561,48.319167
2021-392442,2021-10-13,000001,Vente,3800,,,LES NOUETTES,B064,28120,28282,Nonvilliers-Grandhoux,28,,,28282000ZO0135,,,,,,,,,,,,,0,,,,,P,prés,,,15180,1.151561,48.319167
2021-392452,2021-10-13,000001,Vente,15869,,,LA MARE DU HAUT MAUDUIT,B057,28120,28282,Nonvilliers-Grandhoux,28,,,28282000ZO0150,,,,,,,,,,,,,0,,,,,T,terres,,,5585,1.160806,48.319988
2021-392452,2021-10-13,000001,Vente,15869,,,LA MARE DU HAUT MAUDUIT,B057,28120,28282,Nonvilliers-Grandhoux,28,,,28282000ZO0150,,,,,,,,,,,,,0,,,,,T,terres,,,17085,1.160806,48.319988
2021-392454,2021-10-13,000001,Vente,14274,,,LES CARRIERES,B017,28120,28282,Nonvilliers-Grandhoux,28,,,28282000ZN0045,,,,,,,,,,,,,0,,,,,T,terres,,,11900,1.158621,48.328027
2021-392454,2021-10-13,000001,Vente,14274,,,LA MARE DU HAUT MAUDUIT,B057,28120,28282,Nonvilliers-Grandhoux,28,,,28282000ZO0149,,,,,,,,,,,,,0,,,,,T,terres,,,11500,1.159068,48.320178
2021-392455,2021-10-13,000002,Vente,3386,,,LES CARRIERES,B017,28120,28282,Nonvilliers-Grandhoux,28,,,28282000ZN0048,,,,,,,,,,,,,0,,,,,T,terres,,,5550,1.1602,48.327475
2021-392456,2021-10-13,000003,Vente,5216,,,LES CARRIERES,B017,28120,28282,Nonvilliers-Grandhoux,28,,,28282000ZN0047,,,,,,,,,,,,,0,,,,,T,terres,,,8550,1.159972,48.327976
2021-392456,2021-10-13,000004,Vente,5216,,,LES CARRIERES,B017,28120,28282,Nonvilliers-Grandhoux,28,,,28282000ZN0046,,,,,,,,,,,,,0,,,,,T,terres,,,8550,1.159388,48.328005
2021-392458,2021-10-13,000001,Vente,4000,,,LES FROUTS,B038,28120,28282,Nonvilliers-Grandhoux,28,,,28282000ZO0146,,,,,,,,,,,,,0,,,,,S,sols,,,189,1.150586,48.318874
2021-392458,2021-10-13,000001,Vente,4000,,,LES FROUTS,B038,28120,28282,Nonvilliers-Grandhoux,28,,,28282000ZO0153,,,,,,,,,,,,,0,,,,,T,terres,,,13738,1.150214,48.319295
2021-392458,2021-10-13,000001,Vente,4000,,,LES FROUTS,B038,28120,28282,Nonvilliers-Grandhoux,28,,,28282000ZO0154,,,,,,,,,,,,,0,,,,,T,terres,,,13927,1.14986,48.317572
2021-392462,2021-10-15,000001,Vente,110000,8,,RUE EUGENIE  BLOT,0030,28120,28282,Nonvilliers-Grandhoux,28,,,28282000ZI0054,,,,,,,,,,,,,0,3,Dépendance,,0,S,sols,,,170,1.172721,48.341499
2021-392462,2021-10-15,000001,Vente,110000,8,,RUE EUGENIE  BLOT,0030,28120,28282,Nonvilliers-Grandhoux,28,,,28282000ZI0054,,,,,,,,,,,,,0,3,Dépendance,,0,J,jardins,,,935,1.172721,48.341499
2021-392462,2021-10-15,000001,Vente,110000,8,,RUE EUGENIE  BLOT,0030,28120,28282,Nonvilliers-Grandhoux,28,,,28282000ZI0054,,,,,,,,,,,,,0,1,Maison,87,4,J,jardins,,,935,1.172721,48.341499
2021-392462,2021-10-15,000001,Vente,110000,8,,RUE EUGENIE  BLOT,0030,28120,28282,Nonvilliers-Grandhoux,28,,,28282000ZI0054,,,,,,,,,,,,,0,1,Maison,87,4,S,sols,,,170,1.172721,48.341499
2021-392706,2021-10-30,000001,Vente,4600,,,LE BOIS D ANONVILLE,B005,28120,28282,Nonvilliers-Grandhoux,28,,,282820000E0154,,,,,,,,,,,,,0,,,,,BT,taillis simples,,,7980,1.127018,48.330488
2021-393206,2021-11-27,000001,Vente,117500,,,LA HABILTERIE MONDOUCET,B047,28120,28282,Nonvilliers-Grandhoux,28,,,28282000ZR0027,,,,,,,,,,,,,0,,,,,T,terres,,,14170,1.142344,48.32529
2021-393206,2021-11-27,000001,Vente,117500,,,LA HABILTERIE MONDOUCET,B047,28120,28282,Nonvilliers-Grandhoux,28,,,28282000ZR0028,,,,,,,,,,,,,0,,,,,T,terres,,,13870,1.142845,48.324886
2021-393471,2021-11-27,000001,Vente,175000,,,LE THENERAY,B080,28120,28282,Nonvilliers-Grandhoux,28,,,28282000ZN0044,,,,,,,,,,,,,0,,,,,T,terres,,,60050,1.149392,48.336626
2021-393471,2021-11-27,000001,Vente,175000,,,LE THENERAY,B080,28120,28282,Nonvilliers-Grandhoux,28,,,28282000ZN0044,,,,,,,,,,,,,0,,,,,T,terres,,,39140,1.149392,48.336626
2021-393471,2021-11-27,000001,Vente,175000,,,LE THENERAY,B080,28120,28282,Nonvilliers-Grandhoux,28,,,28282000ZN0044,,,,,,,,,,,,,0,,,,,T,terres,,,120100,1.149392,48.336626
2021-393471,2021-11-27,000001,Vente,175000,,,LE THENERAY,B080,28120,28282,Nonvilliers-Grandhoux,28,,,28282000ZN0053,,,,,,,,,,,,,0,,,,,T,terres,,,8785,1.147726,48.334842
2021-393471,2021-11-27,000001,Vente,175000,,,LE THENERAY,B080,28120,28282,Nonvilliers-Grandhoux,28,,,28282000ZN0076,,,,,,,,,,,,,0,,,,,T,terres,,,10923,1.149226,48.333723
2021-393471,2021-11-27,000001,Vente,175000,,,LE THENERAY,B080,28120,28282,Nonvilliers-Grandhoux,28,,,28282000ZN0076,,,,,,,,,,,,,0,,,,,T,terres,,,10923,1.149226,48.333723
2021-393471,2021-11-27,000001,Vente,175000,,,LE THENERAY,B080,28120,28282,Nonvilliers-Grandhoux,28,,,28282000ZN0076,,,,,,,,,,,,,0,,,,,T,terres,,,10924,1.149226,48.333723
2021-393471,2021-11-27,000001,Vente,175000,,,LE THENERAY,B080,28120,28282,Nonvilliers-Grandhoux,28,,,28282000ZN0078,,,,,,,,,,,,,0,,,,,T,terres,,,1040,1.148545,48.334254
2021-393471,2021-11-27,000001,Vente,175000,,,LE THENERAY,B080,28120,28282,Nonvilliers-Grandhoux,28,,,28282000ZN0080,,,,,,,,,,,,,0,,,,,T,terres,,,2440,1.149167,48.334256
2021-393471,2021-11-27,000001,Vente,175000,,,LES CREUSES,B031,28120,28282,Nonvilliers-Grandhoux,28,,,28282000ZS0033,,,,,,,,,,,,,0,,,,,T,terres,,,20000,1.146376,48.332317
2021-394334,2021-12-28,000001,Vente,150000,12,,RUE EUGENIE  BLOT,0030,28120,28282,Nonvilliers-Grandhoux,28,,,28282000ZI0056,,,,,,,,,,,,,0,1,Maison,78,3,AG,terrains d'agrément,,,677,1.172769,48.341277
2021-394334,2021-12-28,000001,Vente,150000,12,,RUE EUGENIE  BLOT,0030,28120,28282,Nonvilliers-Grandhoux,28,,,28282000ZI0056,,,,,,,,,,,,,0,1,Maison,78,3,S,sols,,,500,1.172769,48.341277
2021-394334,2021-12-28,000001,Vente,150000,12,,RUE EUGENIE  BLOT,0030,28120,28282,Nonvilliers-Grandhoux,28,,,28282000ZI0056,,,,,,,,,,,,,0,3,Dépendance,,0,S,sols,,,500,1.172769,48.341277
2021-394334,2021-12-28,000001,Vente,150000,12,,RUE EUGENIE  BLOT,0030,28120,28282,Nonvilliers-Grandhoux,28,,,28282000ZI0056,,,,,,,,,,,,,0,3,Dépendance,,0,AG,terrains d'agrément,,,677,1.172769,48.341277
2021-394618,2021-12-29,000002,Vente,2304,,,RUE SAINT VINCENT,0080,28120,28282,Nonvilliers-Grandhoux,28,,,28282000ZO0302,,,,,,,,,,,,,0,,,,,P,prés,,,288,1.151541,48.323957
2021-394632,2021-12-29,000001,Vente,28480,,,RUE SAINT VINCENT,0080,28120,28282,Nonvilliers-Grandhoux,28,,,28282000ZO0303,,,,,,,,,,,,,0,,,,,P,prés,,,3163,1.1513,48.32412
2021-394632,2021-12-29,000001,Vente,28480,,,RUE SAINT VINCENT,0080,28120,28282,Nonvilliers-Grandhoux,28,,,28282000ZO0305,,,,,,,,,,,,,0,,,,,P,prés,,,397,1.151061,48.32431
2021-395384,2021-01-13,000001,Vente,149000,10,,RUE EUGENIE  BLOT,0030,28120,28282,Nonvilliers-Grandhoux,28,,,28282000ZI0055,,,,,,,,,,,,,0,1,Maison,76,4,S,sols,,,702,1.173025,48.341354
2021-395432,2021-01-28,000001,Vente,25000,5,,LA FLEURIE,B034,28120,28282,Nonvilliers-Grandhoux,28,,,28282000ZH0070,,,,,,,,,,,,,0,,,,,T,terres,,,1773,1.167426,48.344008
2021-395452,2021-01-19,000001,Vente,17408,,,LA MARE DU HAUT MAUDUIT,B057,28120,28282,Nonvilliers-Grandhoux,28,,,28282000ZO0033,,,,,,,,,,,,,0,,,,,T,terres,,,21760,1.161882,48.316824
