id_mutation,date_mutation,numero_disposition,nature_mutation,valeur_fonciere,adresse_numero,adresse_suffixe,adresse_nom_voie,adresse_code_voie,code_postal,code_commune,nom_commune,code_departement,ancien_code_commune,ancien_nom_commune,id_parcelle,ancien_id_parcelle,numero_volume,lot1_numero,lot1_surface_carrez,lot2_numero,lot2_surface_carrez,lot3_numero,lot3_surface_carrez,lot4_numero,lot4_surface_carrez,lot5_numero,lot5_surface_carrez,nombre_lots,code_type_local,type_local,surface_reelle_bati,nombre_pieces_principales,code_nature_culture,nature_culture,code_nature_culture_speciale,nature_culture_speciale,surface_terrain,longitude,latitude
2021-384021,2021-01-25,000001,Vente,6700,,,PIECE SAINT JUSTE,B059,28130,28357,Saint-Piat,28,,,28357000AD0224,,,,,,,,,,,,,0,,,,,BP,peupleraies,,,23560,1.586803,48.551474
2021-384387,2021-02-17,000001,Vente,158656,5,,RUE AU CHARD,0032,28130,28357,Saint-Piat,28,,,28357000AD0115,,,,,,,,,,,,,0,1,Maison,88,4,S,sols,,,835,1.582166,48.550516
2021-384579,2021-02-26,000001,Vente,115000,3,B,RUE DES PLANTES,0130,28130,28357,Saint-Piat,28,,,28357000AB0142,,,,,,,,,,,,,0,2,Appartement,48,3,S,sols,,,111,1.577811,48.557034
2021-384579,2021-02-26,000001,Vente,115000,3,,RUE DES PLANTES,0130,28130,28357,Saint-Piat,28,,,28357000AB0144,,,,,,,,,,,,,0,,,,,S,sols,,,216,1.577936,48.556888
2021-384579,2021-02-26,000001,Vente,115000,3,,RUE DES PLANTES,0130,28130,28357,Saint-Piat,28,,,28357000AB0146,,,,,,,,,,,,,0,,,,,S,sols,,,23,1.578011,48.556849
2021-384589,2021-03-10,000001,Vente,95500,12,,RUE DE LIGNY,0098,28130,28357,Saint-Piat,28,,,28357000AB0160,,,,,,,,,,,,,0,,,,,AB,terrains a bâtir,,,430,1.57589,48.557914
2021-384589,2021-03-10,000001,Vente,95500,12,,RUE DE LIGNY,0098,28130,28357,Saint-Piat,28,,,28357000AB0161,,,,,,,,,,,,,0,,,,,AB,terrains a bâtir,,,424,1.576104,48.557982
2021-384925,2021-03-12,000001,Vente,225000,53,,RUE ROBERT POISSON,0160,28130,28357,Saint-Piat,28,,,28357000AI0076,,,,,,,,,,,,,0,1,Maison,176,6,S,sols,,,849,1.581941,48.536265
2021-384949,2021-02-26,000001,Vente,89500,,,LES PETITES RUELLES,B058,28130,28357,Saint-Piat,28,,,28357000AI0127,,,,,,,,,,,,,0,4,Local industriel. commercial ou assimilé,132,0,S,sols,,,455,1.585056,48.535229
2021-385537,2021-04-14,000001,Vente,162253,76,,RUE DE LA REPUBLIQUE,0150,28130,28357,Saint-Piat,28,,,28357000AE0055,,,,,,,,,,,,,0,1,Maison,126,3,S,sols,,,183,1.582071,48.54545
2021-385540,2021-04-07,000001,Vente,292500,20,,RUE DES DOLMENS,0038,28130,28357,Saint-Piat,28,,,28357000AA0107,,,,,,,,,,,,,0,1,Maison,147,3,S,sols,,,500,1.58453,48.565541
2021-385540,2021-04-07,000001,Vente,292500,20,,RUE DES DOLMENS,0038,28130,28357,Saint-Piat,28,,,28357000AA0107,,,,,,,,,,,,,0,1,Maison,147,3,AG,terrains d'agrément,,,620,1.58453,48.565541
2021-385588,2021-03-26,000001,Vente,255000,18,,RUE DE LIGNY,0098,28130,28357,Saint-Piat,28,,,28357000AB0084,,,,,,,,,,,,,0,1,Maison,315,8,S,sols,,,500,1.575109,48.557584
2021-385588,2021-03-26,000001,Vente,255000,18,,RUE DE LIGNY,0098,28130,28357,Saint-Piat,28,,,28357000AB0084,,,,,,,,,,,,,0,1,Maison,315,8,AG,terrains d'agrément,,,588,1.575109,48.557584
2021-385588,2021-03-26,000001,Vente,255000,18,,RUE DE LIGNY,0098,28130,28357,Saint-Piat,28,,,28357000AB0084,,,,,,,,,,,,,0,1,Maison,315,8,AG,terrains d'agrément,SPORT,Terrain de sport,602,1.575109,48.557584
2021-385705,2021-04-16,000001,Vente,10000,,,LA VIGNE AUX VACHES,B097,28130,28357,Saint-Piat,28,,,28357000ZO0044,,,,,,,,,,,,,0,,,,,T,terres,,,7734,1.587495,48.534315
2021-385705,2021-04-16,000001,Vente,10000,,,LA VIGNE AUX VACHES,B097,28130,28357,Saint-Piat,28,,,28357000ZO0044,,,,,,,,,,,,,0,,,,,T,terres,,,3585,1.587495,48.534315
2021-386296,2021-04-30,000001,Vente,295000,86,,RUE DE LA REPUBLIQUE,0150,28130,28357,Saint-Piat,28,,,28357000AE0063,,,,,,,,,,,,,0,1,Maison,78,3,AG,terrains d'agrément,,,1131,1.581739,48.544465
2021-386296,2021-04-30,000001,Vente,295000,86,,RUE DE LA REPUBLIQUE,0150,28130,28357,Saint-Piat,28,,,28357000AE0063,,,,,,,,,,,,,0,1,Maison,78,3,S,sols,,,800,1.581739,48.544465
2021-386457,2021-05-12,000001,Vente,291000,,,IMP LIONEL MAUGARS,0112,28130,28357,Saint-Piat,28,,,28357000AI0100,,,,,,,,,,,,,0,,,,,S,sols,,,1158,1.584687,48.537317
2021-386457,2021-05-12,000001,Vente,291000,5,,IMP LIONEL MAUGARS,0112,28130,28357,Saint-Piat,28,,,28357000AI0102,,,,,,,,,,,,,0,1,Maison,140,6,AG,terrains d'agrément,,,501,1.584104,48.537512
2021-386457,2021-05-12,000001,Vente,291000,5,,IMP LIONEL MAUGARS,0112,28130,28357,Saint-Piat,28,,,28357000AI0102,,,,,,,,,,,,,0,1,Maison,140,6,S,sols,,,500,1.584104,48.537512
2021-387247,2021-05-21,000001,Vente,330000,16,,RUE DES DOLMENS,0038,28130,28357,Saint-Piat,28,,,28357000AA0119,,,,,,,,,,,,,0,1,Maison,28,1,S,sols,,,700,1.58456,48.564825
2021-387247,2021-05-21,000001,Vente,330000,16,,RUE DES DOLMENS,0038,28130,28357,Saint-Piat,28,,,28357000AA0119,,,,,,,,,,,,,0,1,Maison,216,6,AG,terrains d'agrément,,,316,1.58456,48.564825
2021-387247,2021-05-21,000001,Vente,330000,16,,RUE DES DOLMENS,0038,28130,28357,Saint-Piat,28,,,28357000AA0119,,,,,,,,,,,,,0,1,Maison,216,6,S,sols,,,700,1.58456,48.564825
2021-387247,2021-05-21,000001,Vente,330000,16,,RUE DES DOLMENS,0038,28130,28357,Saint-Piat,28,,,28357000AA0119,,,,,,,,,,,,,0,1,Maison,28,1,AG,terrains d'agrément,,,316,1.58456,48.564825
2021-387293,2021-06-03,000001,Vente,96300,12,,RUE DE LIGNY,0098,28130,28357,Saint-Piat,28,,,28357000AB0159,,,,,,,,,,,,,0,1,Maison,215,12,S,sols,,,241,1.576715,48.558062
2021-387680,2021-05-29,000001,Vente,184000,39,,RUE AU CHARD,0032,28130,28357,Saint-Piat,28,,,28357000AC0064,,,,,,,,,,,,,0,1,Maison,93,4,S,sols,,,847,1.580359,48.554287
2021-388735,2021-07-20,000001,Vente,55000,,,TERRES DES GLANDS,B092,28130,28357,Saint-Piat,28,,,28357000ZP0050,,,,,,,,,,,,,0,,,,,T,terres,,,545,1.601925,48.535834
2021-388735,2021-07-20,000001,Vente,55000,,,TERRES DES GLANDS,B092,28130,28357,Saint-Piat,28,,,28357000ZP0050,,,,,,,,,,,,,0,,,,,T,terres,,,3898,1.601925,48.535834
2021-388735,2021-07-20,000001,Vente,55000,,,TERRES DES GLANDS,B092,28130,28357,Saint-Piat,28,,,28357000ZP0050,,,,,,,,,,,,,0,,,,,T,terres,,,3494,1.601925,48.535834
2021-388834,2021-07-20,000001,Vente,28564.5,,,TERRES DES GLANDS,B092,28130,28357,Saint-Piat,28,,,28357000ZP0024,,,,,,,,,,,,,0,,,,,T,terres,,,827,1.596513,48.54088
2021-388834,2021-07-20,000001,Vente,28564.5,,,TERRES DES GLANDS,B092,28130,28357,Saint-Piat,28,,,28357000ZP0024,,,,,,,,,,,,,0,,,,,T,terres,,,1227,1.596513,48.54088
2021-389268,2021-07-13,000001,Vente,445000,6,,RUE VERTE,0195,28130,28357,Saint-Piat,28,,,28357000AE0138,,,,,,,,,,,,,0,3,Dépendance,,0,S,sols,,,1000,1.585317,48.545984
2021-389268,2021-07-13,000001,Vente,445000,6,,RUE VERTE,0195,28130,28357,Saint-Piat,28,,,28357000AE0138,,,,,,,,,,,,,0,1,Maison,172,6,S,sols,,,1000,1.585317,48.545984
2021-389268,2021-07-13,000001,Vente,445000,6,,RUE VERTE,0195,28130,28357,Saint-Piat,28,,,28357000AE0138,,,,,,,,,,,,,0,3,Dépendance,,0,AG,terrains d'agrément,,,2632,1.585317,48.545984
2021-389268,2021-07-13,000001,Vente,445000,6,,RUE VERTE,0195,28130,28357,Saint-Piat,28,,,28357000AE0138,,,,,,,,,,,,,0,3,Dépendance,,0,AG,terrains d'agrément,,,2632,1.585317,48.545984
2021-389268,2021-07-13,000001,Vente,445000,6,,RUE VERTE,0195,28130,28357,Saint-Piat,28,,,28357000AE0138,,,,,,,,,,,,,0,1,Maison,172,6,AG,terrains d'agrément,,,2632,1.585317,48.545984
2021-389268,2021-07-13,000001,Vente,445000,6,,RUE VERTE,0195,28130,28357,Saint-Piat,28,,,28357000AE0138,,,,,,,,,,,,,0,1,Maison,20,1,AG,terrains d'agrément,,,2632,1.585317,48.545984
2021-389268,2021-07-13,000001,Vente,445000,6,,RUE VERTE,0195,28130,28357,Saint-Piat,28,,,28357000AE0138,,,,,,,,,,,,,0,3,Dépendance,,0,S,sols,,,1000,1.585317,48.545984
2021-389268,2021-07-13,000001,Vente,445000,6,,RUE VERTE,0195,28130,28357,Saint-Piat,28,,,28357000AE0138,,,,,,,,,,,,,0,1,Maison,20,1,S,sols,,,1000,1.585317,48.545984
2021-389268,2021-07-13,000001,Vente,445000,,,SAINT PIAT,B086,28130,28357,Saint-Piat,28,,,28357000AE0139,,,,,,,,,,,,,0,,,,,P,prés,,,103,1.584129,48.545947
2021-389358,2021-07-06,000001,Vente,167500,44,,RUE DES MARTELS,0110,28130,28357,Saint-Piat,28,,,28357000AI0020,,,,,,,,,,,,,0,1,Maison,79,5,S,sols,,,500,1.578823,48.538541
2021-389358,2021-07-06,000001,Vente,167500,44,,RUE DES MARTELS,0110,28130,28357,Saint-Piat,28,,,28357000AI0020,,,,,,,,,,,,,0,1,Maison,79,5,BT,taillis simples,,,1242,1.578823,48.538541
2021-389358,2021-07-06,000001,Vente,167500,44,,RUE DES MARTELS,0110,28130,28357,Saint-Piat,28,,,28357000AI0020,,,,,,,,,,,,,0,1,Maison,79,5,AG,terrains d'agrément,,,500,1.578823,48.538541
2021-389398,2021-07-08,000001,Vente,110000,21,,ALL DES GATINES,0065,28130,28357,Saint-Piat,28,,,28357000AD0084,,,,,,,,,,,,,0,1,Maison,48,3,S,sols,,,500,1.581368,48.549196
2021-389398,2021-07-08,000001,Vente,110000,21,,ALL DES GATINES,0065,28130,28357,Saint-Piat,28,,,28357000AD0084,,,,,,,,,,,,,0,1,Maison,48,3,AG,terrains d'agrément,,,500,1.581368,48.549196
2021-389398,2021-07-08,000001,Vente,110000,21,,ALL DES GATINES,0065,28130,28357,Saint-Piat,28,,,28357000AD0084,,,,,,,,,,,,,0,3,Dépendance,,0,AG,terrains d'agrément,,,500,1.581368,48.549196
2021-389398,2021-07-08,000001,Vente,110000,21,,ALL DES GATINES,0065,28130,28357,Saint-Piat,28,,,28357000AD0084,,,,,,,,,,,,,0,3,Dépendance,,0,S,sols,,,500,1.581368,48.549196
2021-389398,2021-07-08,000001,Vente,110000,21,,ALL DES GATINES,0065,28130,28357,Saint-Piat,28,,,28357000AD0084,,,,,,,,,,,,,0,1,Maison,48,3,BT,taillis simples,,,743,1.581368,48.549196
2021-389398,2021-07-08,000001,Vente,110000,21,,ALL DES GATINES,0065,28130,28357,Saint-Piat,28,,,28357000AD0084,,,,,,,,,,,,,0,3,Dépendance,,0,BT,taillis simples,,,743,1.581368,48.549196
2021-389714,2021-07-30,000001,Vente,250000,4,,RUE DE LA MARE A SERGENT,0106,28130,28357,Saint-Piat,28,,,28357000AB0078,,,,,,,,,,,,,0,3,Dépendance,,0,S,sols,,,577,1.577091,48.558378
2021-389714,2021-07-30,000001,Vente,250000,4,,RUE DE LA MARE A SERGENT,0106,28130,28357,Saint-Piat,28,,,28357000AB0078,,,,,,,,,,,,,0,1,Maison,115,4,S,sols,,,577,1.577091,48.558378
2021-389942,2021-08-03,000001,Vente,200000,11,,RUE DU LUXEMBOURG,0100,28130,28357,Saint-Piat,28,,,28357000AE0100,,,,,,,,,,,,,0,4,Local industriel. commercial ou assimilé,,,S,sols,,,1421,1.586639,48.547697
2021-389942,2021-08-03,000001,Vente,200000,,,RUE DU LUXEMBOURG,0100,28130,28357,Saint-Piat,28,,,28357000AE0101,,,,,,,,,,,,,0,,,,,S,sols,,,199,1.58675,48.54734
2021-389942,2021-08-03,000001,Vente,200000,,,RUE DU LUXEMBOURG,0100,28130,28357,Saint-Piat,28,,,28357000AE0102,,,,,,,,,,,,,0,,,,,S,sols,,,13,1.586796,48.547293
2021-389942,2021-08-03,000001,Vente,200000,,,RUE DU LUXEMBOURG,0100,28130,28357,Saint-Piat,28,,,28357000AE0103,,,,,,,,,,,,,0,,,,,S,sols,,,20,1.586731,48.547263
2021-389942,2021-08-03,000001,Vente,200000,,,RUE DU LUXEMBOURG,0100,28130,28357,Saint-Piat,28,,,28357000AE0104,,,,,,,,,,,,,0,,,,,S,sols,,,37,1.586697,48.547233
2021-389942,2021-08-03,000001,Vente,200000,,,RUE DU LUXEMBOURG,0100,28130,28357,Saint-Piat,28,,,28357000AE0105,,,,,,,,,,,,,0,,,,,S,sols,,,30,1.586566,48.547243
2021-389942,2021-08-03,000001,Vente,200000,,,RUE DU LUXEMBOURG,0100,28130,28357,Saint-Piat,28,,,28357000AE0106,,,,,,,,,,,,,0,,,,,S,sols,,,20,1.586595,48.547264
2021-389942,2021-08-03,000001,Vente,200000,,,RUE DU LUXEMBOURG,0100,28130,28357,Saint-Piat,28,,,28357000AE0107,,,,,,,,,,,,,0,,,,,S,sols,,,221,1.5866,48.547342
2021-389942,2021-08-03,000001,Vente,200000,,,RUE DU LUXEMBOURG,0100,28130,28357,Saint-Piat,28,,,28357000AE0108,,,,,,,,,,,,,0,,,,,S,sols,,,380,1.586385,48.547414
2021-389942,2021-08-03,000001,Vente,200000,,,RUE DU LUXEMBOURG,0100,28130,28357,Saint-Piat,28,,,28357000AE0109,,,,,,,,,,,,,0,,,,,S,sols,,,31,1.586412,48.547273
2021-389942,2021-08-03,000001,Vente,200000,,,RUE DU LUXEMBOURG,0100,28130,28357,Saint-Piat,28,,,28357000AE0110,,,,,,,,,,,,,0,,,,,S,sols,,,28,1.586349,48.54726
2021-389942,2021-08-03,000001,Vente,200000,,,RUE DU LUXEMBOURG,0100,28130,28357,Saint-Piat,28,,,28357000AE0111,,,,,,,,,,,,,0,,,,,S,sols,,,634,1.586435,48.547145
2021-389942,2021-08-03,000001,Vente,200000,,,RUE DU LUXEMBOURG,0100,28130,28357,Saint-Piat,28,,,28357000AE0112,,,,,,,,,,,,,0,,,,,S,sols,,,6,1.586263,48.547184
2021-389942,2021-08-03,000001,Vente,200000,,,RUE DU LUXEMBOURG,0100,28130,28357,Saint-Piat,28,,,28357000AE0113,,,,,,,,,,,,,0,,,,,S,sols,,,113,1.586222,48.547194
2021-389942,2021-08-03,000001,Vente,200000,,,RUE DU LUXEMBOURG,0100,28130,28357,Saint-Piat,28,,,28357000AE0114,,,,,,,,,,,,,0,,,,,S,sols,,,2,1.586234,48.547269
2021-389942,2021-08-03,000001,Vente,200000,,,RUE DU LUXEMBOURG,0100,28130,28357,Saint-Piat,28,,,28357000AE0115,,,,,,,,,,,,,0,,,,,S,sols,,,130,1.586235,48.547388
2021-389942,2021-08-03,000001,Vente,200000,,,RUE DU LUXEMBOURG,0100,28130,28357,Saint-Piat,28,,,28357000AE0116,,,,,,,,,,,,,0,,,,,S,sols,,,401,1.58603,48.547364
2021-390646,2021-09-10,000001,Vente,273450,19,B,ALL DES GATINES,0065,28130,28357,Saint-Piat,28,,,28357000AD0083,,,,,,,,,,,,,0,1,Maison,102,5,S,sols,,,700,1.581411,48.548944
2021-390646,2021-09-10,000001,Vente,273450,19,B,ALL DES GATINES,0065,28130,28357,Saint-Piat,28,,,28357000AD0083,,,,,,,,,,,,,0,1,Maison,102,5,AG,terrains d'agrément,,,800,1.581411,48.548944
2021-390646,2021-09-10,000001,Vente,273450,19,B,ALL DES GATINES,0065,28130,28357,Saint-Piat,28,,,28357000AD0083,,,,,,,,,,,,,0,1,Maison,102,5,BT,taillis simples,,,1650,1.581411,48.548944
2021-390647,2021-09-03,000001,Vente,335000,3,,RUE DES DOLMENS,0038,28130,28357,Saint-Piat,28,,,28357000AA0002,,,,,,,,,,,,,0,1,Maison,140,6,S,sols,,,951,1.58239,48.562921
2021-390650,2021-09-03,000001,Vente,357000,,,AV PASTEUR,0120,28130,28357,Saint-Piat,28,,,28357000AD0132,,,,,,,,,,,,,0,,,,,S,sols,,,12,1.58281,48.549243
2021-390650,2021-09-03,000001,Vente,357000,1,B,AV PASTEUR,0120,28130,28357,Saint-Piat,28,,,28357000AD0133,,,,,,,,,,,,,0,1,Maison,148,7,AG,terrains d'agrément,,,588,1.582785,48.549067
2021-390650,2021-09-03,000001,Vente,357000,1,B,AV PASTEUR,0120,28130,28357,Saint-Piat,28,,,28357000AD0133,,,,,,,,,,,,,0,3,Dépendance,,0,AG,terrains d'agrément,,,588,1.582785,48.549067
2021-390650,2021-09-03,000001,Vente,357000,1,B,AV PASTEUR,0120,28130,28357,Saint-Piat,28,,,28357000AD0133,,,,,,,,,,,,,0,1,Maison,148,7,S,sols,,,600,1.582785,48.549067
2021-390650,2021-09-03,000001,Vente,357000,1,B,AV PASTEUR,0120,28130,28357,Saint-Piat,28,,,28357000AD0133,,,,,,,,,,,,,0,3,Dépendance,,0,S,sols,,,600,1.582785,48.549067
2021-390782,2021-09-11,000001,Vente,530000,,,RUE DE LA REPUBLIQUE,0150,28130,28357,Saint-Piat,28,,,28357000AD0183,,,,,,,,,,,,,0,,,,,J,jardins,,,733,1.582531,48.546803
2021-390782,2021-09-11,000001,Vente,530000,64,,RUE DE LA REPUBLIQUE,0150,28130,28357,Saint-Piat,28,,,28357000AD0184,,,,,,,,,,,,,0,3,Dépendance,,0,S,sols,,,850,1.582655,48.546474
2021-390782,2021-09-11,000001,Vente,530000,64,,RUE DE LA REPUBLIQUE,0150,28130,28357,Saint-Piat,28,,,28357000AD0184,,,,,,,,,,,,,0,3,Dépendance,,0,S,sols,,,850,1.582655,48.546474
2021-390782,2021-09-11,000001,Vente,530000,64,,RUE DE LA REPUBLIQUE,0150,28130,28357,Saint-Piat,28,,,28357000AD0184,,,,,,,,,,,,,0,1,Maison,140,4,J,jardins,,,552,1.582655,48.546474
2021-390782,2021-09-11,000001,Vente,530000,64,,RUE DE LA REPUBLIQUE,0150,28130,28357,Saint-Piat,28,,,28357000AD0184,,,,,,,,,,,,,0,1,Maison,140,4,S,sols,,,850,1.582655,48.546474
2021-390782,2021-09-11,000001,Vente,530000,64,,RUE DE LA REPUBLIQUE,0150,28130,28357,Saint-Piat,28,,,28357000AD0184,,,,,,,,,,,,,0,3,Dépendance,,0,J,jardins,,,552,1.582655,48.546474
2021-390782,2021-09-11,000001,Vente,530000,64,,RUE DE LA REPUBLIQUE,0150,28130,28357,Saint-Piat,28,,,28357000AD0184,,,,,,,,,,,,,0,3,Dépendance,,0,J,jardins,,,552,1.582655,48.546474
2021-391164,2021-09-18,000001,Vente,185000,5,,RUE DU LAVOIR,0090,28130,28357,Saint-Piat,28,,,28357000AA0087,,,,,,,,,,,,,0,1,Maison,88,3,S,sols,,,640,1.585422,48.565942
2021-391164,2021-09-18,000001,Vente,185000,5,,RUE DU LAVOIR,0090,28130,28357,Saint-Piat,28,,,28357000AA0087,,,,,,,,,,,,,0,3,Dépendance,,0,S,sols,,,640,1.585422,48.565942
2021-391355,2021-09-30,000001,Vente,238700,33,,RUE AU CHARD,0032,28130,28357,Saint-Piat,28,,,28357000AC0068,,,,,,,,,,,,,0,1,Maison,118,6,S,sols,,,600,1.580331,48.553675
2021-391355,2021-09-30,000001,Vente,238700,33,,RUE AU CHARD,0032,28130,28357,Saint-Piat,28,,,28357000AC0068,,,,,,,,,,,,,0,1,Maison,118,6,AG,terrains d'agrément,,,1045,1.580331,48.553675
2021-391355,2021-09-30,000001,Vente,238700,33,,RUE AU CHARD,0032,28130,28357,Saint-Piat,28,,,28357000AC0068,,,,,,,,,,,,,0,1,Maison,118,6,BT,taillis simples,,,650,1.580331,48.553675
2021-391960,2021-09-30,000001,Vente,490500,,,SAINT PIAT,B086,28130,28357,Saint-Piat,28,,,28357000AE0142,,,,,,,,,,,,,0,,,,,P,prés,,,78,1.584001,48.545609
2021-391960,2021-09-30,000001,Vente,490500,10,,RUE VERTE,0195,28130,28357,Saint-Piat,28,,,28357000AE0143,,,,,,,,,,,,,0,3,Dépendance,,0,S,sols,,,1200,1.58547,48.545536
2021-391960,2021-09-30,000001,Vente,490500,10,,RUE VERTE,0195,28130,28357,Saint-Piat,28,,,28357000AE0143,,,,,,,,,,,,,0,1,Maison,250,6,S,sols,,,1200,1.58547,48.545536
2021-391960,2021-09-30,000001,Vente,490500,10,,RUE VERTE,0195,28130,28357,Saint-Piat,28,,,28357000AE0143,,,,,,,,,,,,,0,3,Dépendance,,0,AG,terrains d'agrément,,,4397,1.58547,48.545536
2021-391960,2021-09-30,000001,Vente,490500,10,,RUE VERTE,0195,28130,28357,Saint-Piat,28,,,28357000AE0143,,,,,,,,,,,,,0,1,Maison,250,6,AG,terrains d'agrément,,,4397,1.58547,48.545536
2021-392071,2021-10-14,000001,Vente,5000,,,CHANGE,B014,28130,28357,Saint-Piat,28,,,28357000AA0070,,,,,,,,,,,,,0,,,,,T,terres,,,2935,1.584814,48.567512
2021-392608,2021-10-15,000001,Vente,1,,,LES PETITES RUELLES,B058,28130,28357,Saint-Piat,28,,,28357000AI0134,,,,,,,,,,,,,0,,,,,AB,terrains a bâtir,,,66,1.585528,48.538591
2021-392608,2021-10-15,000001,Vente,1,,,LES PETITES RUELLES,B058,28130,28357,Saint-Piat,28,,,28357000AI0135,,,,,,,,,,,,,0,,,,,AB,terrains a bâtir,,,402,1.585921,48.538589
2021-392608,2021-10-15,000001,Vente,1,,,LES PETITES RUELLES,B058,28130,28357,Saint-Piat,28,,,28357000AI0140,,,,,,,,,,,,,0,,,,,AB,terrains a bâtir,,,253,1.586607,48.538232
2021-392608,2021-10-15,000001,Vente,1,,,LA LUMIERE,B041,28130,28357,Saint-Piat,28,,,28357000AK0165,,,,,,,,,,,,,0,,,,,AB,terrains a bâtir,,,1870,1.586516,48.538692
2021-392608,2021-10-15,000001,Vente,1,,,LA LUMIERE,B041,28130,28357,Saint-Piat,28,,,28357000AK0171,,,,,,,,,,,,,0,,,,,S,sols,,,126,1.585554,48.538947
2021-392608,2021-10-15,000001,Vente,1,,,LA LUMIERE,B041,28130,28357,Saint-Piat,28,,,28357000AK0177,,,,,,,,,,,,,0,,,,,AB,terrains a bâtir,,,341,1.586374,48.539137
2021-392608,2021-10-15,000001,Vente,1,,,LA LUMIERE,B041,28130,28357,Saint-Piat,28,,,28357000AK0178,,,,,,,,,,,,,0,,,,,AB,terrains a bâtir,,,60,1.585562,48.539401
2021-392608,2021-10-15,000001,Vente,1,,,LA LUMIERE,B041,28130,28357,Saint-Piat,28,,,28357000AK0179,,,,,,,,,,,,,0,,,,,S,sols,,,11,1.585581,48.539214
2021-392608,2021-10-15,000001,Vente,1,,,LA LUMIERE,B041,28130,28357,Saint-Piat,28,,,28357000AK0181,,,,,,,,,,,,,0,,,,,AB,terrains a bâtir,,,924,1.586178,48.539085
2021-392608,2021-10-15,000001,Vente,1,,,LA LUMIERE,B041,28130,28357,Saint-Piat,28,,,28357000AK0186,,,,,,,,,,,,,0,,,,,AB,terrains a bâtir,,,162,1.587122,48.538942
2021-392608,2021-10-15,000001,Vente,1,,,LA LUMIERE,B041,28130,28357,Saint-Piat,28,,,28357000AK0188,,,,,,,,,,,,,0,,,,,AG,terrains d'agrément,,,3372,1.58741,48.53855
2021-392858,2021-10-23,000001,Vente terrain à bâtir,69900,,,LES PETITES RUELLES,B058,28130,28357,Saint-Piat,28,,,28357000AI0141,,,,,,,,,,,,,0,,,,,AB,terrains a bâtir,,,544,1.586839,48.538237
2021-392858,2021-10-23,000001,Vente terrain à bâtir,69900,,,LA LUMIERE,B041,28130,28357,Saint-Piat,28,,,28357000AK0164,,,,,,,,,,,,,0,,,,,AB,terrains a bâtir,,,135,1.586908,48.538371
2021-392858,2021-10-23,000001,Vente terrain à bâtir,69900,,,LA LUMIERE,B041,28130,28357,Saint-Piat,28,,,28357000AK0191,,,,,,,,,,,,,0,,,,,AB,terrains a bâtir,,,59,1.586988,48.53828
2021-393856,2021-11-27,000001,Vente,196100,18,,AV DE LA GARE,0060,28130,28357,Saint-Piat,28,,,28357000AK0132,,,,,,,,,,,,,0,1,Maison,90,4,S,sols,,,800,1.590445,48.541786
