id_mutation,date_mutation,numero_disposition,nature_mutation,valeur_fonciere,adresse_numero,adresse_suffixe,adresse_nom_voie,adresse_code_voie,code_postal,code_commune,nom_commune,code_departement,ancien_code_commune,ancien_nom_commune,id_parcelle,ancien_id_parcelle,numero_volume,lot1_numero,lot1_surface_carrez,lot2_numero,lot2_surface_carrez,lot3_numero,lot3_surface_carrez,lot4_numero,lot4_surface_carrez,lot5_numero,lot5_surface_carrez,nombre_lots,code_type_local,type_local,surface_reelle_bati,nombre_pieces_principales,code_nature_culture,nature_culture,code_nature_culture_speciale,nature_culture_speciale,surface_terrain,longitude,latitude
2021-383929,2021-01-25,000001,Vente,53200,12,,RUE DES FLEURS,0025,28700,28366,Santeuil,28,,,283660000B0361,,,,,,,,,,,,,0,1,Maison,182,9,S,sols,,,331,1.757198,48.384576
2021-383929,2021-01-25,000001,Vente,53200,12,,RUE DES FLEURS,0025,28700,28366,Santeuil,28,,,283660000B0362,,,,,,,,,,,,,0,,,,,S,sols,,,477,1.757128,48.384421
2021-384489,2021-02-12,000001,Vente,158000,8,,CHE DE BARBAINVILLE,0008,28700,28366,Santeuil,28,,,28366000ZL0074,,,,,,,,,,,,,0,1,Maison,104,6,J,jardins,,,933,1.730357,48.387524
2021-384489,2021-02-12,000001,Vente,158000,8,,CHE DE BARBAINVILLE,0008,28700,28366,Santeuil,28,,,28366000ZL0074,,,,,,,,,,,,,0,1,Maison,104,6,S,sols,,,465,1.730357,48.387524
2021-385539,2021-04-01,000001,Vente,6000,,,SANTEUIL,B040,28700,28366,Santeuil,28,,,283660000A0789,,,,,,,,,,,,,0,,,,,T,terres,,,333,1.732901,48.388027
2021-385539,2021-04-01,000001,Vente,6000,,,SANTEUIL,B040,28700,28366,Santeuil,28,,,283660000A0791,,,,,,,,,,,,,0,,,,,T,terres,,,259,1.732917,48.388105
2021-386519,2021-04-28,000001,Vente,164000,22,,CHE DE BARBAINVILLE,0008,28700,28366,Santeuil,28,,,28366000ZL0098,,,,,,,,,,,,,0,1,Maison,77,4,S,sols,,,940,1.730695,48.388366
2021-387136,2021-05-27,000001,Vente,145000,30,,RUE DE CHARTRES,0015,28700,28366,Santeuil,28,,,283660000A0730,,,,,,,,,,,,,0,1,Maison,50,2,J,jardins,,,667,1.730359,48.390308
2021-387136,2021-05-27,000001,Vente,145000,30,,RUE DE CHARTRES,0015,28700,28366,Santeuil,28,,,283660000A0730,,,,,,,,,,,,,0,1,Maison,50,2,S,sols,,,428,1.730359,48.390308
2021-387170,2021-05-31,000001,Vente,232000,20,,RUE DES FLEURS,0025,28700,28366,Santeuil,28,,,283660000B0351,,,,,,,,,,,,,0,1,Maison,82,3,S,sols,,,857,1.758461,48.38396
2021-387883,2021-06-17,000001,Vente,200400,10,,RUE DE CHARTRES,0015,28700,28366,Santeuil,28,,,283660000A0721,,,,,,,,,,,,,0,1,Maison,143,5,S,sols,,,639,1.73348,48.388526
2021-387883,2021-06-17,000001,Vente,200400,10,,RUE DE CHARTRES,0015,28700,28366,Santeuil,28,,,283660000A0721,,,,,,,,,,,,,0,3,Dépendance,,0,S,sols,,,639,1.73348,48.388526
2021-387883,2021-06-17,000001,Vente,200400,10,,RUE DE CHARTRES,0015,28700,28366,Santeuil,28,,,283660000A0721,,,,,,,,,,,,,0,3,Dépendance,,0,S,sols,,,639,1.73348,48.388526
2021-388153,2021-07-03,000001,Vente,238410,11,,RUE DU CHATEAU D EAU,0016,28700,28366,Santeuil,28,,,28366000ZL0100,,,,,,,,,,,,,0,1,Maison,75,2,S,sols,,,1165,1.737958,48.387148
2021-388153,2021-07-03,000001,Vente,238410,9,,RUE DU CHATEAU D EAU,0016,28700,28366,Santeuil,28,,,28366000ZL0105,,,,,,,,,,,,,0,,,,,AG,terrains d'agrément,,,681,1.738297,48.386819
2021-388154,2021-07-03,000001,Vente,189000,15,,RUE DE CHARTRES,0015,28700,28366,Santeuil,28,,,283660000A0796,,,,,,,,,,,,,0,1,Maison,112,5,S,sols,,,334,1.732196,48.388852
2021-388154,2021-07-03,000001,Vente,189000,15,,RUE DE CHARTRES,0015,28700,28366,Santeuil,28,,,283660000A0796,,,,,,,,,,,,,0,3,Dépendance,,0,S,sols,,,334,1.732196,48.388852
2021-389876,2021-08-06,000001,Vente,233000,7,,RUE D ANGERVILLE,0005,28700,28366,Santeuil,28,,,283660000A0733,,,,,,,,,,,,,0,,,,,S,sols,,,60,1.735813,48.387457
2021-389876,2021-08-06,000001,Vente,233000,7,,RUE D ANGERVILLE,0005,28700,28366,Santeuil,28,,,283660000A0734,,,,,,,,,,,,,0,1,Maison,107,6,S,sols,,,669,1.735884,48.387316
2021-389877,2021-08-11,000001,Vente,219000,8,,RUE D ANGERVILLE,0005,28700,28366,Santeuil,28,,,283660000A0084,,,,,,,,,,,,,0,1,Maison,73,2,S,sols,,,366,1.735969,48.386945
2021-390653,2021-09-13,000001,Vente,85000,15,,RUE D ANGERVILLE,0005,28700,28366,Santeuil,28,,,283660000A0743,,,,,,,,,,,,,0,3,Dépendance,,0,S,sols,,,368,1.737244,48.386003
2021-390653,2021-09-13,000001,Vente,85000,15,,RUE D ANGERVILLE,0005,28700,28366,Santeuil,28,,,283660000A0743,,,,,,,,,,,,,0,1,Maison,60,3,S,sols,,,368,1.737244,48.386003
2021-390653,2021-09-13,000001,Vente,85000,,,LA GRENOUILLERE,B022,28700,28366,Santeuil,28,,,28366000ZP0023,,,,,,,,,,,,,0,,,,,S,sols,,,160,1.737356,48.38604
2021-392991,2021-11-15,000001,Vente,83600,12,,RUE DES FLEURS,0025,28700,28366,Santeuil,28,,,283660000B0361,,,,,,,,,,,,,0,1,Maison,182,9,S,sols,,,331,1.757198,48.384576
2021-392991,2021-11-15,000001,Vente,83600,12,,RUE DES FLEURS,0025,28700,28366,Santeuil,28,,,283660000B0362,,,,,,,,,,,,,0,,,,,S,sols,,,477,1.757128,48.384421
