id_mutation,date_mutation,numero_disposition,nature_mutation,valeur_fonciere,adresse_numero,adresse_suffixe,adresse_nom_voie,adresse_code_voie,code_postal,code_commune,nom_commune,code_departement,ancien_code_commune,ancien_nom_commune,id_parcelle,ancien_id_parcelle,numero_volume,lot1_numero,lot1_surface_carrez,lot2_numero,lot2_surface_carrez,lot3_numero,lot3_surface_carrez,lot4_numero,lot4_surface_carrez,lot5_numero,lot5_surface_carrez,nombre_lots,code_type_local,type_local,surface_reelle_bati,nombre_pieces_principales,code_nature_culture,nature_culture,code_nature_culture_speciale,nature_culture_speciale,surface_terrain,longitude,latitude
2021-413175,2021-03-18,000001,Echange,250,,,KERMARZIN,C581,29650,29014,Botsorhel,29,,,290140000A0776,,,,,,,,,,,,,0,,,,,T,terres,,,270,-3.631832,48.526839
2021-413175,2021-03-18,000002,Echange,250,,,KERMARZIN,C581,29650,29014,Botsorhel,29,,,290140000A0778,,,,,,,,,,,,,0,,,,,T,terres,,,117,-3.631762,48.526737
2021-413175,2021-03-18,000002,Echange,250,,,KERMARZIN,C581,29650,29014,Botsorhel,29,,,290140000A0781,,,,,,,,,,,,,0,,,,,T,terres,,,109,-3.631682,48.526925
2021-413266,2021-03-18,000001,Vente,75000,,,KERMARZIN,C581,29650,29014,Botsorhel,29,,,290140000A0776,,,,,,,,,,,,,0,,,,,T,terres,,,270,-3.631832,48.526839
2021-413266,2021-03-18,000001,Vente,75000,,,KERMARZIN,C581,29650,29014,Botsorhel,29,,,290140000A0777,,,,,,,,,,,,,0,,,,,T,terres,,,34,-3.631799,48.526752
2021-413266,2021-03-18,000001,Vente,75000,,,KERMARZIN,C581,29650,29014,Botsorhel,29,,,290140000A0780,,,,,,,,,,,,,0,,,,,T,terres,,,65,-3.631762,48.526882
2021-413266,2021-03-18,000001,Vente,75000,117,,VERDOLEN,D541,29650,29014,Botsorhel,29,,,290140000G0037,,,,,,,,,,,,,0,3,Dépendance,,0,S,sols,,,105,-3.631907,48.526897
2021-413266,2021-03-18,000001,Vente,75000,117,,VERDOLEN,D541,29650,29014,Botsorhel,29,,,290140000G0037,,,,,,,,,,,,,0,1,Maison,57,2,S,sols,,,105,-3.631907,48.526897
2021-414030,2021-04-20,000001,Vente,55000,6998,A,KERVEZ,C806,29650,29014,Botsorhel,29,,,290140000G0620,,,,,,,,,,,,,0,1,Maison,74,4,S,sols,,,665,-3.653712,48.531425
2021-414030,2021-04-20,000001,Vente,55000,,,KERVEZ,C806,29650,29014,Botsorhel,29,,,290140000G0623,,,,,,,,,,,,,0,,,,,S,sols,,,35,-3.653644,48.531576
2021-414030,2021-04-20,000001,Vente,55000,,,KERVEZ,C806,29650,29014,Botsorhel,29,,,290140000G0624,,,,,,,,,,,,,0,,,,,S,sols,,,88,-3.65373,48.531488
2021-414030,2021-04-20,000001,Vente,55000,,,KERVEZ,C806,29650,29014,Botsorhel,29,,,290140000G0625,,,,,,,,,,,,,0,,,,,P,prés,,,312,-3.653914,48.531503
2021-415100,2021-05-17,000001,Vente,260000,126,,KERMARZIN,C581,29650,29014,Botsorhel,29,,,290140000A0263,,,,,,,,,,,,,0,1,Maison,130,4,S,sols,,,1802,,
2021-415100,2021-05-17,000001,Vente,260000,,,KERMARZIN LIORS VIAN,C604,29650,29014,Botsorhel,29,,,290140000A0264,,,,,,,,,,,,,0,,,,,T,terres,,,1131,,
2021-415100,2021-05-17,000001,Vente,260000,,,KERMARZIN LIORS VIAN,C604,29650,29014,Botsorhel,29,,,290140000A0264,,,,,,,,,,,,,0,,,,,S,sols,,,645,,
2021-415100,2021-05-17,000001,Vente,260000,,,KERMARZIN LIORS AN TY,C602,29650,29014,Botsorhel,29,,,290140000A0265,,,,,,,,,,,,,0,,,,,T,terres,,,2798,,
2021-415100,2021-05-17,000001,Vente,260000,,,KERMARZIN LIORS AN TY,C602,29650,29014,Botsorhel,29,,,290140000A0265,,,,,,,,,,,,,0,,,,,S,sols,,,250,,
2021-415100,2021-05-17,000001,Vente,260000,,,KERMARZIN,C581,29650,29014,Botsorhel,29,,,290140000A0266,,,,,,,,,,,,,0,,,,,T,terres,,,11187,-3.622087,48.528759
2021-415100,2021-05-17,000001,Vente,260000,,,KERMARZIN ROZ AR GOFF,C659,29650,29014,Botsorhel,29,,,290140000A0268,,,,,,,,,,,,,0,,,,,T,terres,,,12876,-3.620666,48.528906
2021-415100,2021-05-17,000001,Vente,260000,,,KERMARZIN PARC HEVO,C636,29650,29014,Botsorhel,29,,,290140000A0269,,,,,,,,,,,,,0,,,,,T,terres,,,4669,,
2021-415100,2021-05-17,000001,Vente,260000,,,KERMARZIN PARC HEVO,C636,29650,29014,Botsorhel,29,,,290140000A0269,,,,,,,,,,,,,0,,,,,S,sols,,,200,,
2021-415100,2021-05-17,000001,Vente,260000,,,KERMARZIN LIORS GUILLOU,C603,29650,29014,Botsorhel,29,,,290140000A0270,,,,,,,,,,,,,0,,,,,T,terres,,,7839,-3.621635,48.52791
2021-415100,2021-05-17,000001,Vente,260000,,,KERMARZIN AR VENEC,C584,29650,29014,Botsorhel,29,,,290140000A0271,,,,,,,,,,,,,0,,,,,T,terres,,,6728,-3.620385,48.528183
2021-415100,2021-05-17,000001,Vente,260000,,,GOASSECH PARC AR PIS,B775,29650,29014,Botsorhel,29,,,290140000A0272,,,,,,,,,,,,,0,,,,,T,terres,,,3860,-3.619626,48.528227
2021-415100,2021-05-17,000001,Vente,260000,,,GOASSECH NERVIKIRCH,B773,29650,29014,Botsorhel,29,,,290140000A0294,,,,,,,,,,,,,0,,,,,T,terres,,,4519,-3.619006,48.527187
2021-415100,2021-05-17,000001,Vente,260000,,,KERMARZIN CREACH ALLEE BIA,C589,29650,29014,Botsorhel,29,,,290140000A0295,,,,,,,,,,,,,0,,,,,T,terres,,,5138,-3.620039,48.527477
2021-415100,2021-05-17,000001,Vente,260000,,,KERMARZIN CREACH ALLEE,C588,29650,29014,Botsorhel,29,,,290140000A0296,,,,,,,,,,,,,0,,,,,T,terres,,,8432,-3.619362,48.526604
2021-415100,2021-05-17,000001,Vente,260000,,,KERMARZIN NEVE HIR,C605,29650,29014,Botsorhel,29,,,290140000A0297,,,,,,,,,,,,,0,,,,,T,terres,,,6177,-3.620285,48.526789
2021-415100,2021-05-17,000001,Vente,260000,,,KERMARZIN PARC PIJAMIN,C647,29650,29014,Botsorhel,29,,,290140000A0298,,,,,,,,,,,,,0,,,,,T,terres,,,8851,-3.621029,48.527157
2021-415100,2021-05-17,000001,Vente,260000,,,KERMARZIN PARC MOAN,C639,29650,29014,Botsorhel,29,,,290140000A0299,,,,,,,,,,,,,0,,,,,T,terres,,,3194,-3.622016,48.527177
2021-415100,2021-05-17,000001,Vente,260000,,,KERMARZIN PARC IZELLA BRUG,C638,29650,29014,Botsorhel,29,,,290140000A0300,,,,,,,,,,,,,0,,,,,T,terres,,,9580,-3.621302,48.526282
2021-415100,2021-05-17,000001,Vente,260000,,,KERMARZIN PARC NEVEZ BRAS,C642,29650,29014,Botsorhel,29,,,290140000A0301,,,,,,,,,,,,,0,,,,,T,terres,,,7668,-3.620265,48.525525
2021-415100,2021-05-17,000001,Vente,260000,,,KERMARZIN PARC NEVEZ BRAS,C642,29650,29014,Botsorhel,29,,,290140000A0301,,,,,,,,,,,,,0,,,,,T,terres,,,7668,-3.620265,48.525525
2021-415100,2021-05-17,000001,Vente,260000,,,KERMARZIN PARC BRAS DOUR L,C629,29650,29014,Botsorhel,29,,,290140000A0302,,,,,,,,,,,,,0,,,,,T,terres,,,11192,-3.618599,48.525646
2021-415100,2021-05-17,000001,Vente,260000,,,GOASSECH CREACH ALLEE,B772,29650,29014,Botsorhel,29,,,290140000A0304,,,,,,,,,,,,,0,,,,,T,terres,,,4555,-3.61828,48.526449
2021-415100,2021-05-17,000001,Vente,260000,,,GOASSECH CREACH ALLEE,B772,29650,29014,Botsorhel,29,,,290140000A0305,,,,,,,,,,,,,0,,,,,BT,taillis simples,,,2657,-3.617719,48.526468
2021-415100,2021-05-17,000001,Vente,260000,,,KERMARZIN COAT PARC COZ DO,C587,29650,29014,Botsorhel,29,,,290140000A0314,,,,,,,,,,,,,0,,,,,BT,taillis simples,,,520,-3.617598,48.524951
2021-415100,2021-05-17,000001,Vente,260000,,,KERMARZIN PRAT DOUR LEZER,C654,29650,29014,Botsorhel,29,,,290140000A0315,,,,,,,,,,,,,0,,,,,BT,taillis simples,,,2252,-3.617626,48.524675
2021-415100,2021-05-17,000001,Vente,260000,,,KERMARZIN PARC COZ DOUR LE,C630,29650,29014,Botsorhel,29,,,290140000A0316,,,,,,,,,,,,,0,,,,,L,landes,,,7500,-3.618278,48.524778
2021-415100,2021-05-17,000001,Vente,260000,,,KERMARZIN PARC COZ DOUR LE,C630,29650,29014,Botsorhel,29,,,290140000A0316,,,,,,,,,,,,,0,,,,,T,terres,,,1940,-3.618278,48.524778
2021-415100,2021-05-17,000001,Vente,260000,,,KERMARZIN,C581,29650,29014,Botsorhel,29,,,290140000A0317,,,,,,,,,,,,,0,,,,,L,landes,,,1170,-3.618413,48.524296
2021-415100,2021-05-17,000001,Vente,260000,,,KERMARZIN PARC NEVEZ BRAS,C642,29650,29014,Botsorhel,29,,,290140000A0318,,,,,,,,,,,,,0,,,,,BT,taillis simples,,,1063,-3.619295,48.524581
2021-415100,2021-05-17,000001,Vente,260000,,,KERMARZIN PARC PEN AR MENE,C644,29650,29014,Botsorhel,29,,,290140000A0352,,,,,,,,,,,,,0,,,,,L,landes,,,7816,-3.626053,48.526283
2021-415100,2021-05-17,000001,Vente,260000,,,KERMARZIN AR VERGER,C585,29650,29014,Botsorhel,29,,,290140000A0356,,,,,,,,,,,,,0,,,,,T,terres,,,5175,-3.622783,48.527352
2021-415100,2021-05-17,000001,Vente,260000,,,KERMARZIN,C581,29650,29014,Botsorhel,29,,,290140000A0357,,,,,,,,,,,,,0,,,,,S,sols,,,639,-3.622963,48.527668
2021-415100,2021-05-17,000001,Vente,260000,,,KERMARZIN PARC NEVEZ,C641,29650,29014,Botsorhel,29,,,290140000A0358,,,,,,,,,,,,,0,,,,,T,terres,,,3528,-3.623578,48.527544
2021-415100,2021-05-17,000001,Vente,260000,,,KERMARZIN PARC NEVEZ,C641,29650,29014,Botsorhel,29,,,290140000A0358,,,,,,,,,,,,,0,,,,,VE,vergers,,,702,-3.623578,48.527544
2021-415100,2021-05-17,000001,Vente,260000,,,KERMARZIN PRAT BIAN,C652,29650,29014,Botsorhel,29,,,290140000A0363,,,,,,,,,,,,,0,,,,,P,prés,,,554,-3.62467,48.528008
2021-415100,2021-05-17,000001,Vente,260000,,,KERMARZIN PRAT BRAS,C653,29650,29014,Botsorhel,29,,,290140000A0364,,,,,,,,,,,,,0,,,,,L,landes,,,6400,-3.625593,48.527218
2021-415100,2021-05-17,000001,Vente,260000,,,KERMARZIN PRAT BRAS,C653,29650,29014,Botsorhel,29,,,290140000A0364,,,,,,,,,,,,,0,,,,,L,landes,,,13279,-3.625593,48.527218
2021-415100,2021-05-17,000001,Vente,260000,,,KERMARZIN PARC COZ PEN AR,C631,29650,29014,Botsorhel,29,,,290140000A0366,,,,,,,,,,,,,0,,,,,T,terres,,,5854,-3.627,48.526479
2021-415100,2021-05-17,000001,Vente,260000,,,KERMARZIN PRAT HERCH,C655,29650,29014,Botsorhel,29,,,290140000A0749,,,,,,,,,,,,,0,,,,,P,prés,,,5047,-3.624397,48.527585
2021-415100,2021-05-17,000001,Vente,260000,,,KERMARZIN GOAREM GREIS,C595,29650,29014,Botsorhel,29,,,290140000A0750,,,,,,,,,,,,,0,,,,,T,terres,,,7103,-3.626619,48.52558
2021-415100,2021-05-17,000001,Vente,260000,,,KERMARZIN GOAREM VRAS,C599,29650,29014,Botsorhel,29,,,290140000A0752,,,,,,,,,,,,,0,,,,,T,terres,,,5436,-3.62746,48.526524
2021-415984,2021-06-12,000001,Vente,137500,1981,B,CROAS CHRIST,B531,29650,29014,Botsorhel,29,,,290140000C0599,,,,,,,,,,,,,0,1,Maison,124,4,S,sols,,,500,-3.615004,48.499457
2021-415984,2021-06-12,000001,Vente,137500,1981,B,CROAS CHRIST,B531,29650,29014,Botsorhel,29,,,290140000C0599,,,,,,,,,,,,,0,1,Maison,124,4,J,jardins,,,1638,-3.615004,48.499457
2021-415992,2021-05-29,000002,Vente,142217,1,,RUE DE KERMARZIN,0013,29650,29014,Botsorhel,29,,,290140000G0754,,,,,,,,,,,,,0,,,,,J,jardins,,,1000,-3.639577,48.52631
2021-415992,2021-05-29,000002,Vente,142217,1,,RUE DE KERMARZIN,0013,29650,29014,Botsorhel,29,,,290140000G0754,,,,,,,,,,,,,0,,,,,S,sols,,,500,-3.639577,48.52631
2021-416014,2021-05-27,000001,Vente,2383,,,COSQUER KERAEL AR REK VRAS,B264,29650,29014,Botsorhel,29,,,290140000B0028,,,,,,,,,,,,,0,,,,,T,terres,,,6670,-3.633066,48.523258
2021-416014,2021-05-27,000001,Vente,2383,,,COSQUER KERAEL PARC MARI V,B280,29650,29014,Botsorhel,29,,,290140000B0029,,,,,,,,,,,,,0,,,,,T,terres,,,6900,-3.632472,48.523508
2021-418861,2021-07-20,000001,Vente,1500,,,LE BOURG AR ROZ,B138,29650,29014,Botsorhel,29,,,290140000G0086,,,,,,,,,,,,,0,,,,,T,terres,,,3170,-3.642696,48.526882
2021-420261,2021-09-14,000001,Vente,45,,,KERAMBELEC LIORS TACHEN,C094,29650,29014,Botsorhel,29,,,290140000A0883,,,,,,,,,,,,,0,,,,,S,sols,,,129,-3.636288,48.545746
2021-421329,2021-10-08,000001,Vente,80000,,,LE BOURG,B134,29650,29014,Botsorhel,29,,,290140000G0807,,,,,,,,,,,,,0,,,,,S,sols,,,113,-3.640138,48.528048
2021-421329,2021-10-08,000001,Vente,80000,1,,RUE DE BEL AIR,0001,29650,29014,Botsorhel,29,,,290140000G0843,,,,,,,,,,,,,0,1,Maison,80,3,S,sols,,,645,-3.640211,48.528093
2021-421329,2021-10-08,000001,Vente,80000,,,LE BOURG,B134,29650,29014,Botsorhel,29,,,290140000G0844,,,,,,,,,,,,,0,,,,,S,sols,,,2,-3.640309,48.528097
2021-421744,2021-10-14,000001,Vente,250000,93,,KERVERDER,C804,29650,29014,Botsorhel,29,,,290140000A0545,,,,,,,,,,,,,0,1,Maison,100,3,S,sols,,,1104,-3.636375,48.546054
2021-421744,2021-10-14,000001,Vente,250000,93,,KERVERDER,C804,29650,29014,Botsorhel,29,,,290140000A0545,,,,,,,,,,,,,0,3,Dépendance,,0,S,sols,,,1104,-3.636375,48.546054
2021-421744,2021-10-14,000001,Vente,250000,93,,KERVERDER,C804,29650,29014,Botsorhel,29,,,290140000A0545,,,,,,,,,,,,,0,3,Dépendance,,0,S,sols,,,1104,-3.636375,48.546054
2021-421744,2021-10-14,000001,Vente,250000,93,,KERVERDER,C804,29650,29014,Botsorhel,29,,,290140000A0545,,,,,,,,,,,,,0,3,Dépendance,,0,S,sols,,,1104,-3.636375,48.546054
2021-421744,2021-10-14,000001,Vente,250000,,,KERVERDER,C804,29650,29014,Botsorhel,29,,,290140000A0843,,,,,,,,,,,,,0,,,,,T,terres,,,37,-3.636533,48.546197
2021-421744,2021-10-14,000001,Vente,250000,,,KERVERDER,C804,29650,29014,Botsorhel,29,,,290140000A0845,,,,,,,,,,,,,0,,,,,T,terres,,,153,-3.636545,48.546019
2021-421744,2021-10-14,000001,Vente,250000,,,KERAMBELEC LIORS TACHEN,C094,29650,29014,Botsorhel,29,,,290140000A0847,,,,,,,,,,,,,0,,,,,T,terres,,,280,-3.636445,48.545821
2021-421744,2021-10-14,000001,Vente,250000,,,KERVERDER,C804,29650,29014,Botsorhel,29,,,290140000A0878,,,,,,,,,,,,,0,,,,,T,terres,,,103,-3.636575,48.546221
2021-421744,2021-10-14,000001,Vente,250000,,,KERVERDER,C804,29650,29014,Botsorhel,29,,,290140000A0879,,,,,,,,,,,,,0,,,,,T,terres,,,51,-3.636625,48.545978
2021-421744,2021-10-14,000001,Vente,250000,,,KERAMBELEC LIORS TACHEN,C094,29650,29014,Botsorhel,29,,,290140000A0882,,,,,,,,,,,,,0,,,,,T,terres,,,139,-3.636437,48.545695
2021-421744,2021-10-14,000001,Vente,250000,,,KERAMBELEC LIORS TACHEN,C094,29650,29014,Botsorhel,29,,,290140000A0883,,,,,,,,,,,,,0,,,,,S,sols,,,129,-3.636288,48.545746
2021-423280,2021-11-10,000001,Vente,260000,7010,A,RUE DE KERMARZIN,0013,29650,29014,Botsorhel,29,,,290140000G0106,,,,,,,,,,,,,0,1,Maison,152,5,AG,terrains d'agrément,,,8302,-3.638443,48.526604
2021-423280,2021-11-10,000001,Vente,260000,7010,A,RUE DE KERMARZIN,0013,29650,29014,Botsorhel,29,,,290140000G0106,,,,,,,,,,,,,0,3,Dépendance,,0,S,sols,,,500,-3.638443,48.526604
2021-423280,2021-11-10,000001,Vente,260000,7010,A,RUE DE KERMARZIN,0013,29650,29014,Botsorhel,29,,,290140000G0106,,,,,,,,,,,,,0,1,Maison,152,5,S,sols,,,500,-3.638443,48.526604
2021-423280,2021-11-10,000001,Vente,260000,7010,A,RUE DE KERMARZIN,0013,29650,29014,Botsorhel,29,,,290140000G0106,,,,,,,,,,,,,0,3,Dépendance,,0,AG,terrains d'agrément,,,8302,-3.638443,48.526604
2021-423532,2021-11-02,000001,Vente,60000,21,B,LE BOURG,B134,29650,29014,Botsorhel,29,,,290140000G1209,,,,,,,,,,,,,0,4,Local industriel. commercial ou assimilé,825,0,S,sols,,,2697,-3.639479,48.528218
2021-424302,2021-12-11,000001,Vente,40000,,,PEN AR REST LIORS AR BALAN,D073,29650,29014,Botsorhel,29,,,290140000E0445,,,,,,,,,,,,,0,,,,,S,sols,,,154,-3.641426,48.483978
2021-424302,2021-12-11,000001,Vente,40000,,,PEN AR REST LIORS AR BALAN,D073,29650,29014,Botsorhel,29,,,290140000E0445,,,,,,,,,,,,,0,,,,,T,terres,,,2436,-3.641426,48.483978
2021-424302,2021-12-11,000001,Vente,40000,,,PEN AR REST,D051,29650,29014,Botsorhel,29,,,290140000E0446,,,,,,,,,,,,,0,,,,,J,jardins,,,98,-3.641318,48.484373
2021-424302,2021-12-11,000001,Vente,40000,215,,PEN AR REST,D051,29650,29014,Botsorhel,29,,,290140000E0449,,,,,,,,,,,,,0,1,Maison,45,1,S,sols,,,808,-3.641472,48.484472
2021-424447,2021-12-11,000001,Vente,39040,,,PEN AR REST PARC AN IZAOUE,D079,29650,29014,Botsorhel,29,,,290140000E0191,,,,,,,,,,,,,0,,,,,T,terres,,,6071,-3.644593,48.482722
2021-424447,2021-12-11,000001,Vente,39040,,,PEN AR REST PARC NEVE,D109,29650,29014,Botsorhel,29,,,290140000E0200,,,,,,,,,,,,,0,,,,,T,terres,,,8149,-3.640762,48.481817
2021-424447,2021-12-11,000001,Vente,39040,,,PEN AR REST AR YUN VRAS,D055,29650,29014,Botsorhel,29,,,290140000E0207,,,,,,,,,,,,,0,,,,,L,landes,,,19600,-3.636575,48.480291
2021-424447,2021-12-11,000001,Vente,39040,,,PEN AR REST PARC AR MENE,D090,29650,29014,Botsorhel,29,,,290140000E0208,,,,,,,,,,,,,0,,,,,T,terres,,,4470,-3.636796,48.481602
2021-424447,2021-12-11,000001,Vente,39040,,,PEN AR REST PARC AR MENE,D090,29650,29014,Botsorhel,29,,,290140000E0209,,,,,,,,,,,,,0,,,,,T,terres,,,5380,-3.635536,48.481116
2021-424447,2021-12-11,000001,Vente,39040,,,PEN AR REST AR YUN VRAS,D055,29650,29014,Botsorhel,29,,,290140000E0213,,,,,,,,,,,,,0,,,,,T,terres,,,6750,-3.635745,48.478472
2021-424447,2021-12-11,000001,Vente,39040,,,PEN AR REST COST LAND,D066,29650,29014,Botsorhel,29,,,290140000E0225,,,,,,,,,,,,,0,,,,,P,prés,,,13916,-3.631932,48.478356
2021-424447,2021-12-11,000001,Vente,39040,,,PEN AR REST COST LAND,D066,29650,29014,Botsorhel,29,,,290140000E0225,,,,,,,,,,,,,0,,,,,T,terres,,,20147,-3.631932,48.478356
2021-424447,2021-12-11,000001,Vente,39040,,,PEN AR REST GOAREM AR ROC,D069,29650,29014,Botsorhel,29,,,290140000E0236,,,,,,,,,,,,,0,,,,,T,terres,,,8166,-3.628279,48.475848
2021-424447,2021-12-11,000001,Vente,39040,,,PEN AR REST LIORS AR BALAN,D073,29650,29014,Botsorhel,29,,,290140000E0444,,,,,,,,,,,,,0,,,,,T,terres,,,3300,-3.641268,48.483129
2021-424447,2021-12-11,000001,Vente,39040,,,PEN AR REST PARC AR BILADE,D085,29650,29014,Botsorhel,29,,,290140000E0452,,,,,,,,,,,,,0,,,,,T,terres,,,5170,-3.642806,48.484163
2021-424447,2021-12-11,000001,Vente,39040,,,PEN AR REST PRAT ROS AR HA,D121,29650,29014,Botsorhel,29,,,290140000E0469,,,,,,,,,,,,,0,,,,,L,landes,,,1780,-3.643984,48.485834
2021-424447,2021-12-11,000001,Vente,39040,,,PEN AR REST COAT AR FEUNTE,D058,29650,29014,Botsorhel,29,,,290140000E0493,,,,,,,,,,,,,0,,,,,BT,taillis simples,,,1088,-3.641745,48.486209
2021-424447,2021-12-11,000001,Vente,39040,,,PEN AR REST PRADEN AR BOUR,D116,29650,29014,Botsorhel,29,,,290140000E0499,,,,,,,,,,,,,0,,,,,P,prés,,,816,-3.641704,48.487173
2021-424447,2021-12-11,000001,Vente,39040,,,CREAC H POST ROS VRAS,B376,29650,29014,Botsorhel,29,,,290140000E0510,,,,,,,,,,,,,0,,,,,T,terres,,,7982,-3.639577,48.487186
2021-424447,2021-12-11,000001,Vente,39040,,,CREAC H POST ROS VRAS,B376,29650,29014,Botsorhel,29,,,290140000E0512,,,,,,,,,,,,,0,,,,,T,terres,,,9205,-3.64052,48.487395
2021-424447,2021-12-11,000001,Vente,39040,,,CREAC H POST COAT ROS VRAS,B350,29650,29014,Botsorhel,29,,,290140000E0513,,,,,,,,,,,,,0,,,,,BT,taillis simples,,,1979,-3.641389,48.487662
2021-424447,2021-12-11,000001,Vente,39040,,,CREAC H POST COAT AR FEUNT,B346,29650,29014,Botsorhel,29,,,290140000E0532,,,,,,,,,,,,,0,,,,,BT,taillis simples,,,240,-3.638037,48.487718
2021-424447,2021-12-11,000001,Vente,39040,,,CREAC H POST PRAT AR FEUNT,B365,29650,29014,Botsorhel,29,,,290140000E0535,,,,,,,,,,,,,0,,,,,P,prés,,,450,-3.638008,48.487971
2021-424447,2021-12-11,000001,Vente,39040,,,PEN AR REST,D051,29650,29014,Botsorhel,29,,,290140000E0562,,,,,,,,,,,,,0,,,,,T,terres,,,5475,-3.636365,48.478951
