id_mutation,date_mutation,numero_disposition,nature_mutation,valeur_fonciere,adresse_numero,adresse_suffixe,adresse_nom_voie,adresse_code_voie,code_postal,code_commune,nom_commune,code_departement,ancien_code_commune,ancien_nom_commune,id_parcelle,ancien_id_parcelle,numero_volume,lot1_numero,lot1_surface_carrez,lot2_numero,lot2_surface_carrez,lot3_numero,lot3_surface_carrez,lot4_numero,lot4_surface_carrez,lot5_numero,lot5_surface_carrez,nombre_lots,code_type_local,type_local,surface_reelle_bati,nombre_pieces_principales,code_nature_culture,nature_culture,code_nature_culture_speciale,nature_culture_speciale,surface_terrain,longitude,latitude
2021-395697,2021-01-05,000001,Vente,330000,5,,CHE DE TY NEVEZ KERLEVOT,0830,29170,29161,Pleuven,29,,,29161000AE0124,,,,,,,,,,,,,0,1,Maison,97,4,S,sols,,,500,-4.06194,47.915009
2021-395697,2021-01-05,000001,Vente,330000,5,,CHE DE TY NEVEZ KERLEVOT,0830,29170,29161,Pleuven,29,,,29161000AE0124,,,,,,,,,,,,,0,1,Maison,97,4,AG,terrains d'agrément,,,934,-4.06194,47.915009
2021-396025,2021-01-05,000001,Vente,170000,6,,RES DE LA CHATAIGNERAIE,A062,29170,29161,Pleuven,29,,,29161000AM0022,,,,,,,,,,,,,0,1,Maison,64,4,S,sols,,,293,-4.024776,47.895638
2021-396251,2021-01-19,000001,Vente,380000,38,,RTE DU PRAJOU,0454,29170,29161,Pleuven,29,,,29161000AI0024,,,,,,,,,,,,,0,1,Maison,165,5,S,sols,,,500,-4.035593,47.915452
2021-396251,2021-01-19,000001,Vente,380000,38,,RTE DU PRAJOU,0454,29170,29161,Pleuven,29,,,29161000AI0024,,,,,,,,,,,,,0,1,Maison,165,5,AG,terrains d'agrément,,,3116,-4.035593,47.915452
2021-396344,2021-01-18,000001,Vente,314963,,,TRODERNEC,B159,29170,29161,Pleuven,29,,,291610000A0555,,,,,,,,,,,,,0,,,,,T,terres,,,3781,-4.049126,47.913551
2021-396344,2021-01-18,000001,Vente,314963,,,ROSCOLER,B147,29170,29161,Pleuven,29,,,291610000A0562,,,,,,,,,,,,,0,,,,,T,terres,,,4392,-4.049198,47.912547
2021-396344,2021-01-18,000001,Vente,314963,,,ROSCOLER,B147,29170,29161,Pleuven,29,,,291610000A0568,,,,,,,,,,,,,0,,,,,T,terres,,,704,-4.048618,47.912304
2021-396344,2021-01-18,000001,Vente,314963,,,ROSCOLER,B147,29170,29161,Pleuven,29,,,291610000A0569,,,,,,,,,,,,,0,,,,,BF,futaies feuillues,,,5122,-4.048653,47.912625
2021-396344,2021-01-18,000001,Vente,314963,,,ROSCOLER,B147,29170,29161,Pleuven,29,,,291610000A0575,,,,,,,,,,,,,0,,,,,BT,taillis simples,,,1377,-4.047833,47.913471
2021-396344,2021-01-18,000001,Vente,314963,,,ROSCOLER,B147,29170,29161,Pleuven,29,,,291610000A0576,,,,,,,,,,,,,0,,,,,T,terres,,,1588,-4.0482,47.913217
2021-396344,2021-01-18,000001,Vente,314963,,,TRODERNEC,B159,29170,29161,Pleuven,29,,,291610000A0577,,,,,,,,,,,,,0,,,,,P,prés,,,4437,-4.048329,47.913554
2021-396344,2021-01-18,000001,Vente,314963,,,TRODERNEC,B159,29170,29161,Pleuven,29,,,291610000A0578,,,,,,,,,,,,,0,,,,,P,prés,,,1732,-4.047648,47.914013
2021-396344,2021-01-18,000001,Vente,314963,,,TRODERNEC,B159,29170,29161,Pleuven,29,,,291610000A0579,,,,,,,,,,,,,0,,,,,T,terres,,,2393,-4.048049,47.914141
2021-396344,2021-01-18,000001,Vente,314963,,,ROSCOLER,B147,29170,29161,Pleuven,29,,,291610000A1362,,,,,,,,,,,,,0,,,,,T,terres,,,4784,-4.049693,47.914184
2021-396344,2021-01-18,000001,Vente,314963,5,,CHE DE ROSCOLER,0793,29170,29161,Pleuven,29,,,291610000A1364,,,,,,,,,,,,,0,1,Maison,110,3,S,sols,,,1040,-4.048901,47.914149
2021-396348,2021-01-15,000001,Vente,230000,24,,HENT LESQUIDIC,0320,29170,29161,Pleuven,29,,,29161000AC0159,,,,,,,,,,,,,0,1,Maison,207,5,S,sols,,,500,-4.077128,47.927562
2021-396348,2021-01-15,000001,Vente,230000,24,,HENT LESQUIDIC,0320,29170,29161,Pleuven,29,,,29161000AC0159,,,,,,,,,,,,,0,1,Maison,207,5,AG,terrains d'agrément,,,647,-4.077128,47.927562
2021-396671,2021-01-26,000001,Vente,64500,,,PONT COULOUFFANT,B139,29170,29161,Pleuven,29,,,29161000AA0624,,,,,,,,,,,,,0,,,,,AB,terrains a bâtir,,,500,-4.049526,47.90435
2021-396671,2021-01-26,000001,Vente,64500,,,PONT COULOUFFANT,B139,29170,29161,Pleuven,29,,,29161000AA0629,,,,,,,,,,,,,0,,,,,AB,terrains a bâtir,,,757,-4.049967,47.904072
2021-396676,2021-02-16,000001,Vente,235000,22,,ALL GOAREM PIN,0295,29170,29161,Pleuven,29,,,29161000AA0006,,,,,,,,,,,,,0,1,Maison,142,6,S,sols,,,700,-4.051106,47.907984
2021-396676,2021-02-16,000001,Vente,235000,22,,ALL GOAREM PIN,0295,29170,29161,Pleuven,29,,,29161000AA0006,,,,,,,,,,,,,0,3,Dépendance,,0,S,sols,,,700,-4.051106,47.907984
2021-396676,2021-02-16,000001,Vente,235000,22,,ALL GOAREM PIN,0295,29170,29161,Pleuven,29,,,29161000AA0006,,,,,,,,,,,,,0,1,Maison,142,6,AG,terrains d'agrément,,,295,-4.051106,47.907984
2021-396676,2021-02-16,000001,Vente,235000,22,,ALL GOAREM PIN,0295,29170,29161,Pleuven,29,,,29161000AA0006,,,,,,,,,,,,,0,3,Dépendance,,0,AG,terrains d'agrément,,,295,-4.051106,47.907984
2021-396684,2021-01-29,000001,Vente,300000,6,,TY GLAS ROUTE DE BENODET,0100,29170,29161,Pleuven,29,,,29161000AD0067,,,2,,,,,,,,,,1,4,Local industriel. commercial ou assimilé,238,0,,,,,,-4.069621,47.917375
2021-396725,2021-01-27,000001,Vente,76050,,,LESQUIDIC,B104,29170,29161,Pleuven,29,,,29161000AB0191,,,,,,,,,,,,,0,,,,,T,terres,,,507,-4.075204,47.931476
2021-396877,2021-02-12,000001,Vente,110000,4,,CHE DE PENFRAT,0577,29170,29161,Pleuven,29,,,29161000AB0004,,,,,,,,,,,,,0,3,Dépendance,,0,T,terres,,,1873,-4.077525,47.934256
2021-396877,2021-02-12,000001,Vente,110000,4,,CHE DE PENFRAT,0577,29170,29161,Pleuven,29,,,29161000AB0004,,,,,,,,,,,,,0,1,Maison,71,3,T,terres,,,1873,-4.077525,47.934256
2021-397157,2021-02-12,000001,Vente,100000,,,LESVEZ,B107,29170,29161,Pleuven,29,,,291610000A0524,,,,,,,,,,,,,0,,,,,S,sols,,,200,-4.052087,47.916058
2021-397157,2021-02-12,000001,Vente,100000,,,LESVEZ,B107,29170,29161,Pleuven,29,,,291610000A0524,,,,,,,,,,,,,0,,,,,T,terres,,,16771,-4.052087,47.916058
2021-397157,2021-02-12,000001,Vente,100000,,,LESVEZ,B107,29170,29161,Pleuven,29,,,291610000A0544,,,,,,,,,,,,,0,,,,,T,terres,,,3099,-4.051404,47.916515
2021-397157,2021-02-12,000001,Vente,100000,,,LESVEZ HUELLA,B108,29170,29161,Pleuven,29,,,291610000A1092,,,,,,,,,,,,,0,,,,,T,terres,,,1798,-4.051253,47.917075
2021-397157,2021-02-12,000001,Vente,100000,,,LESVEZ HUELLA,B108,29170,29161,Pleuven,29,,,291610000A1113,,,,,,,,,,,,,0,,,,,VE,vergers,,,89,-4.051436,47.917255
2021-397157,2021-02-12,000001,Vente,100000,,,LESVEZ,B107,29170,29161,Pleuven,29,,,291610000A2377,,,,,,,,,,,,,0,,,,,AG,terrains d'agrément,,,1200,-4.053047,47.916662
2021-397157,2021-02-12,000001,Vente,100000,,,LESVEZ,B107,29170,29161,Pleuven,29,,,291610000A2377,,,,,,,,,,,,,0,,,,,T,terres,,,2741,-4.053047,47.916662
2021-397157,2021-02-12,000001,Vente,100000,,,LESVEZ,B107,29170,29161,Pleuven,29,,,291610000A2379,,,,,,,,,,,,,0,,,,,S,sols,,,323,-4.05243,47.916728
2021-397157,2021-02-12,000001,Vente,100000,,,LESVEZ HUELLA,B108,29170,29161,Pleuven,29,,,291610000A2380,,,,,,,,,,,,,0,,,,,T,terres,,,177,-4.051624,47.917211
2021-397157,2021-02-12,000001,Vente,100000,5,,RTE DE LESVEZ,0540,29170,29161,Pleuven,29,,,291610000A2383,,,,,,,,,,,,,0,,,,,S,sols,,,1222,-4.051912,47.916995
2021-397157,2021-02-12,000001,Vente,100000,,,LESVEZ HUELLA,B108,29170,29161,Pleuven,29,,,291610000A2385,,,,,,,,,,,,,0,,,,,S,sols,,,500,-4.051562,47.916783
2021-397157,2021-02-12,000001,Vente,100000,,,LESVEZ HUELLA,B108,29170,29161,Pleuven,29,,,291610000A2385,,,,,,,,,,,,,0,,,,,L,landes,,,615,-4.051562,47.916783
2021-397443,2021-02-26,000001,Vente,190000,9,,LE PENKER,A745,29170,29161,Pleuven,29,,,29161000AA0220,,,,,,,,,,,,,0,1,Maison,69,2,S,sols,,,761,-4.047938,47.906753
2021-397470,2021-01-19,000001,Vente,162500,10,,HAM GWEZ FAOU,A100,29170,29161,Pleuven,29,,,29161000AA0538,,,2,,,,,,,,,,1,1,Maison,86,4,,,,,,-4.053474,47.907232
2021-397564,2021-03-01,000001,Vente,72000,9,,TOUL AN AEL,0815,29170,29161,Pleuven,29,,,29161000AL0024,,,,,,,,,,,,,0,,,,,S,sols,,,38,-4.030357,47.903115
2021-397564,2021-03-01,000001,Vente,72000,11,,TOUL AN AEL,0815,29170,29161,Pleuven,29,,,29161000AL0025,,,,,,,,,,,,,0,1,Maison,90,3,S,sols,,,500,-4.030197,47.90297
2021-397564,2021-03-01,000001,Vente,72000,11,,TOUL AN AEL,0815,29170,29161,Pleuven,29,,,29161000AL0025,,,,,,,,,,,,,0,1,Maison,90,3,AG,terrains d'agrément,,,611,-4.030197,47.90297
2021-397603,2021-03-16,000001,Vente,340000,2,D,KROAZ HENT KERLEVOT,0450,29170,29161,Pleuven,29,,,29161000AE0035,,,,,,,,,,,,,0,1,Maison,136,4,S,sols,,,739,-4.0606,47.916608
2021-397732,2021-03-12,000001,Vente,21801.2,,,KERLIVERIEN,B076,29170,29161,Pleuven,29,,,29161000AM0141,,,,,,,,,,,,,0,,,,,AB,terrains a bâtir,,,1185,-4.028045,47.891278
2021-397893,2021-03-24,000001,Vente,87000,4,,HAM GWEZ FAOU,A100,29170,29161,Pleuven,29,,,29161000AA0538,,,25,,26,,33,,38,,,,4,4,Local industriel. commercial ou assimilé,51,0,,,,,,-4.053474,47.907232
2021-398042,2021-03-17,000001,Vente,51500,25,,HAM DE TOUL AN BIC,A776,29170,29161,Pleuven,29,,,29161000AK0165,,,,,,,,,,,,,0,,,,,AB,terrains a bâtir,,,459,-4.039913,47.901133
2021-398115,2021-03-15,000001,Vente,320000,2,,PARC N'ALLE,0574,29170,29161,Pleuven,29,,,29161000AA0396,,,,,,,,,,,,,0,1,Maison,116,6,S,sols,,,1000,-4.05305,47.90541
2021-399228,2021-04-09,000001,Vente,310000,20,,RES LA CLAIRIERE,A080,29170,29161,Pleuven,29,,,29161000AK0116,,,,,,,,,,,,,0,1,Maison,89,4,S,sols,,,609,-4.042861,47.902442
2021-399306,2021-04-12,000001,Vente,325000,125,,HENT AR BLEIZI,0310,29170,29161,Pleuven,29,,,29161000AL0119,,,,,,,,,,,,,0,1,Maison,133,5,S,sols,,,990,-4.026971,47.89692
2021-399326,2021-04-23,000002,Vente,1164,,,KEROUREC,B087,29170,29161,Pleuven,29,,,291610000C0191,,,,,,,,,,,,,0,,,,,P,prés,,,4811,-4.025564,47.907447
2021-399610,2021-04-30,000001,Vente,1,,,KERGUILAVANT,B063,29170,29161,Pleuven,29,,,291610000A2172,,,,,,,,,,,,,0,,,,,T,terres,,,80,-4.057222,47.921165
2021-399646,2021-04-27,000001,Vente,316000,179,,HENT AR BLEIZI,0310,29170,29161,Pleuven,29,,,29161000AL0110,,,,,,,,,,,,,0,1,Maison,93,3,S,sols,,,500,-4.027802,47.897936
2021-399646,2021-04-27,000001,Vente,316000,179,,HENT AR BLEIZI,0310,29170,29161,Pleuven,29,,,29161000AL0110,,,,,,,,,,,,,0,1,Maison,93,3,AG,terrains d'agrément,,,1348,-4.027802,47.897936
2021-399646,2021-04-27,000001,Vente,316000,,,HENT AR BLEIZI,0310,29170,29161,Pleuven,29,,,29161000AL0111,,,,,,,,,,,,,0,,,,,S,sols,,,563,-4.027596,47.897453
2021-399646,2021-04-27,000001,Vente,316000,,,PENANHOAT SAINT THOMAS,B133,29170,29161,Pleuven,29,,,29161000AL0123,,,,,,,,,,,,,0,,,,,T,terres,,,7,-4.027657,47.897194
2021-399646,2021-04-27,000001,Vente,316000,179,,HENT AR BLEIZI,0310,29170,29161,Pleuven,29,,,29161000AL0129,,,,,,,,,,,,,0,,,,,T,terres,,,10364,-4.028801,47.897766
2021-399673,2021-04-28,000001,Vente,256000,11,,LE PENKER,A745,29170,29161,Pleuven,29,,,29161000AA0197,,,,,,,,,,,,,0,1,Maison,124,5,S,sols,,,751,-4.047295,47.906804
2021-399690,2021-05-06,000001,Vente,35000,14,B,LE MOULIN DU PONT,0565,29170,29161,Pleuven,29,,,29161000AC0196,,,,,,,,,,,,,0,,,,,AG,terrains d'agrément,,,743,-4.071361,47.928972
2021-399690,2021-05-06,000001,Vente,35000,14,,LE MOULIN DU PONT,0565,29170,29161,Pleuven,29,,,29161000AC0197,,,,,,,,,,,,,0,,,,,S,sols,,,95,-4.07098,47.928893
2021-400416,2021-05-07,000001,Vente,84000,3,,KROAZ HENT TY GUEN,0453,29170,29161,Pleuven,29,,,29161000AH0163,,,11,,5,41,,,,,,,2,2,Appartement,72,2,,,,,,-4.053558,47.908026
2021-400416,2021-05-07,000001,Vente,84000,3,,KROAZ HENT TY GUEN,0453,29170,29161,Pleuven,29,,,29161000AH0163,,,11,,5,41,,,,,,,2,3,Dépendance,,0,,,,,,-4.053558,47.908026
2021-400687,2021-06-04,000001,Vente,103400,6,,HAM KER AN DERVENN,A250,29170,29161,Pleuven,29,,,29161000AC0141,,,,,,,,,,,,,0,,,,,AB,terrains a bâtir,,,1034,-4.073956,47.927539
2021-400724,2021-06-04,000001,Vente,280000,4,,PONT COULOUFFANT,0584,29170,29161,Pleuven,29,,,29161000AA0556,,,,,,,,,,,,,0,1,Maison,175,7,AG,terrains d'agrément,,,547,-4.049623,47.903432
2021-400724,2021-06-04,000001,Vente,280000,4,,PONT COULOUFFANT,0584,29170,29161,Pleuven,29,,,29161000AA0556,,,,,,,,,,,,,0,1,Maison,175,7,S,sols,,,500,-4.049623,47.903432
2021-400942,2021-05-25,000003,Vente,160000,40,B,ALL VIBERT,0850,29170,29161,Pleuven,29,,,291610000D2066,,,,,,,,,,,,,0,1,Maison,80,4,S,sols,,,451,-4.065272,47.907344
2021-400942,2021-05-25,000003,Vente,160000,,,ALLEE VIBERT,B001,29170,29161,Pleuven,29,,,291610000D2071,,,,,,,,,,,,,0,,,,,VE,vergers,,,2,-4.065577,47.907543
2021-400942,2021-05-25,000003,Vente,160000,38,,ALL VIBERT,0850,29170,29161,Pleuven,29,,,291610000D2072,,,,,,,,,,,,,0,,,,,S,sols,,,4,-4.065307,47.907513
2021-400942,2021-05-25,000003,Vente,160000,10,,ALL VIBERT,0850,29170,29161,Pleuven,29,,,291610000D2073,,,,,,,,,,,,,0,,,,,AG,terrains d'agrément,,,280,-4.065398,47.907514
2021-400942,2021-05-25,000003,Vente,160000,,,ALLEE VIBERT,B001,29170,29161,Pleuven,29,,,291610000D2075,,,,,,,,,,,,,0,,,,,AG,terrains d'agrément,,,4,-4.065255,47.907501
2021-400942,2021-05-25,000003,Vente,160000,,,ALLEE VIBERT,B001,29170,29161,Pleuven,29,,,291610000D2077,,,,,,,,,,,,,0,,,,,AG,terrains d'agrément,,,152,-4.065142,47.907421
2021-401072,2021-05-26,000001,Vente,5000,,,KERORGANT,B094,29170,29161,Pleuven,29,,,291610000C0131,,,,,,,,,,,,,0,,,,,P,prés,,,6873,-4.030889,47.913344
2021-401072,2021-05-26,000001,Vente,5000,,,KERORGANT,B094,29170,29161,Pleuven,29,,,291610000C0136,,,,,,,,,,,,,0,,,,,P,prés,,,8691,-4.032517,47.913318
2021-401072,2021-05-26,000001,Vente,5000,,,KERORGANT,B094,29170,29161,Pleuven,29,,,291610000C0136,,,,,,,,,,,,,0,,,,,P,prés,,,8691,-4.032517,47.913318
2021-401322,2021-06-01,000001,Vente,162000,15,,HAM GWEZ FAOU,A100,29170,29161,Pleuven,29,,,29161000AA0538,,,7,74.25,,,,,,,,,1,1,Maison,77,4,,,,,,-4.053474,47.907232
2021-401493,2021-06-04,000001,Vente,155000,9,,LE MOULIN DU PONT,0565,29170,29161,Pleuven,29,,,29161000AC0083,,,,,,,,,,,,,0,1,Maison,82,4,AG,terrains d'agrément,,,589,-4.071198,47.927076
2021-401493,2021-06-04,000001,Vente,155000,9,,LE MOULIN DU PONT,0565,29170,29161,Pleuven,29,,,29161000AC0083,,,,,,,,,,,,,0,1,Maison,82,4,S,sols,,,500,-4.071198,47.927076
2021-401494,2021-06-04,000001,Vente,82000,,,KERARIS,B041,29170,29161,Pleuven,29,,,291610000D1815,,,,,,,,,,,,,0,,,,,P,prés,,,84,-4.060582,47.907016
2021-401494,2021-06-04,000001,Vente,82000,,,KERARIS,B041,29170,29161,Pleuven,29,,,291610000D1818,,,,,,,,,,,,,0,,,,,T,terres,,,350,-4.060771,47.907519
2021-401494,2021-06-04,000001,Vente,82000,3,,CHE DE KERARIS,0415,29170,29161,Pleuven,29,,,291610000D1829,,,,,,,,,,,,,0,1,Maison,59,3,S,sols,,,183,-4.060665,47.907203
2021-401494,2021-06-04,000001,Vente,82000,3,,CHE DE KERARIS,0415,29170,29161,Pleuven,29,,,291610000D1838,,,,,,,,,,,,,0,,,,,S,sols,,,50,-4.060659,47.907362
2021-401494,2021-06-04,000001,Vente,82000,3,,CHE DE KERARIS,0415,29170,29161,Pleuven,29,,,291610000D1839,,,,,,,,,,,,,0,,,,,S,sols,,,157,-4.061052,47.90761
2021-401687,2021-06-23,000001,Vente,270000,9,,HAM KER HALEG,A500,29170,29161,Pleuven,29,,,29161000AI0068,,,,,,,,,,,,,0,1,Maison,98,5,S,sols,,,476,-4.037311,47.915072
2021-401748,2021-04-23,000002,Vente terrain à bâtir,118000,,,LESVEZ,B107,29170,29161,Pleuven,29,,,291610000A0785,,,,,,,,,,,,,0,,,,,T,terres,,,2150,-4.044671,47.921606
2021-401748,2021-04-23,000002,Vente terrain à bâtir,118000,29,,LE BOURG  RTE DE QUIMPER,0589,29170,29161,Pleuven,29,,,29161000AA0649,,,,,,,,,,,,,0,,,,,S,sols,,,612,,
2021-401748,2021-04-23,000002,Vente terrain à bâtir,118000,29,,LE BOURG  RTE DE QUIMPER,0589,29170,29161,Pleuven,29,,,29161000AA0651,,,,,,,,,,,,,0,,,,,AG,terrains d'agrément,,,608,,
2021-401748,2021-04-23,000002,Vente terrain à bâtir,118000,29,,LE BOURG  RTE DE QUIMPER,0589,29170,29161,Pleuven,29,,,29161000AA0652,,,,,,,,,,,,,0,,,,,S,sols,,,323,-4.047621,47.907482
2021-401748,2021-04-23,000002,Vente terrain à bâtir,118000,,,DOURGUEL,B032,29170,29161,Pleuven,29,,,291610000B0050,,,,,,,,,,,,,0,,,,,T,terres,,,982,-4.044473,47.921865
2021-401748,2021-04-23,000002,Vente terrain à bâtir,118000,,,DOURGUEL,B032,29170,29161,Pleuven,29,,,291610000B0051,,,,,,,,,,,,,0,,,,,T,terres,,,8010,-4.043592,47.92209
2021-401748,2021-04-23,000002,Vente terrain à bâtir,118000,,,DOURGUEL,B032,29170,29161,Pleuven,29,,,291610000B0052,,,,,,,,,,,,,0,,,,,T,terres,,,7185,-4.043461,47.922679
2021-401748,2021-04-23,000002,Vente terrain à bâtir,118000,,,DOURGUEL,B032,29170,29161,Pleuven,29,,,291610000B0217,,,,,,,,,,,,,0,,,,,S,sols,,,276,-4.044491,47.922251
2021-401814,2021-06-04,000001,Vente,130000,29,,LE BOURG  RTE DE QUIMPER,0589,29170,29161,Pleuven,29,,,29161000AA0648,,,,,,,,,,,,,0,1,Maison,115,4,S,sols,,,21,-4.047991,47.907638
2021-401814,2021-06-04,000001,Vente,130000,29,,LE BOURG  RTE DE QUIMPER,0589,29170,29161,Pleuven,29,,,29161000AA0648,,,,,,,,,,,,,0,3,Dépendance,,0,S,sols,,,21,-4.047991,47.907638
2021-401814,2021-06-04,000001,Vente,130000,29,,LE BOURG  RTE DE QUIMPER,0589,29170,29161,Pleuven,29,,,29161000AA0650,,,,,,,,,,,,,0,,,,,AB,terrains a bâtir,,,1366,-4.047845,47.907789
2021-401814,2021-06-04,000001,Vente,130000,29,,LE BOURG  RTE DE QUIMPER,0589,29170,29161,Pleuven,29,,,29161000AA0652,,,,,,,,,,,,,0,,,,,S,sols,,,323,-4.047621,47.907482
2021-402608,2021-06-24,000002,Vente,70000,20,,RTE DU PRAJOU,0454,29170,29161,Pleuven,29,,,29161000AI0162,,,,,,,,,,,,,0,3,Dépendance,,0,,,,,,-4.038081,47.914092
2021-402608,2021-06-24,000002,Vente,70000,20,,RTE DU PRAJOU,0454,29170,29161,Pleuven,29,,,29161000AI0162,,,,,,,,,,,,,0,1,Maison,65,3,,,,,,-4.038081,47.914092
2021-402632,2021-06-30,000001,Vente,287264,3,A,TY FLATRES,B160,29170,29161,Pleuven,29,,,29161000AE0134,,,,,,,,,,,,,0,1,Maison,151,6,S,sols,,,780,-4.065166,47.916689
2021-403249,2021-07-20,000001,Vente,300000,,,KERGUILY,B064,29170,29161,Pleuven,29,,,291610000C0183,,,,,,,,,,,,,0,,,,,BF,futaies feuillues,,,1150,-4.027964,47.906759
2021-403249,2021-07-20,000001,Vente,300000,,,KERGUILY,B064,29170,29161,Pleuven,29,,,291610000C0184,,,,,,,,,,,,,0,,,,,BF,futaies feuillues,,,4364,-4.02776,47.906111
2021-403249,2021-07-20,000001,Vente,300000,,,KERGUILY,B064,29170,29161,Pleuven,29,,,291610000C0185,,,,,,,,,,,,,0,,,,,T,terres,,,4885,-4.026793,47.906292
2021-403249,2021-07-20,000001,Vente,300000,,,KERGUILY,B064,29170,29161,Pleuven,29,,,291610000C0186,,,,,,,,,,,,,0,,,,,BF,futaies feuillues,,,2113,-4.027182,47.906822
2021-403249,2021-07-20,000001,Vente,300000,30,,CHE DE PARC VEIL,0575,29170,29161,Pleuven,29,,,291610000C0198,,,,,,,,,,,,,0,1,Maison,118,5,VE,vergers,,,1390,-4.024113,47.907243
2021-403249,2021-07-20,000001,Vente,300000,30,,CHE DE PARC VEIL,0575,29170,29161,Pleuven,29,,,291610000C0198,,,,,,,,,,,,,0,1,Maison,118,5,S,sols,,,200,-4.024113,47.907243
2021-403249,2021-07-20,000001,Vente,300000,,,KERGUILY,B064,29170,29161,Pleuven,29,,,291610000C0199,,,,,,,,,,,,,0,,,,,S,sols,,,740,-4.024465,47.907228
2021-403249,2021-07-20,000001,Vente,300000,,,KERGUILY,B064,29170,29161,Pleuven,29,,,291610000C0200,,,,,,,,,,,,,0,,,,,P,prés,,,7152,-4.025614,47.906984
2021-403249,2021-07-20,000001,Vente,300000,,,KERGUILY,B064,29170,29161,Pleuven,29,,,291610000C0201,,,,,,,,,,,,,0,,,,,T,terres,,,2641,-4.026496,47.906741
2021-403249,2021-07-20,000001,Vente,300000,,,KERGUILY,B064,29170,29161,Pleuven,29,,,291610000C0203,,,,,,,,,,,,,0,,,,,T,terres,,,1098,-4.026597,47.906086
2021-403249,2021-07-20,000001,Vente,300000,,,KERGUILY,B064,29170,29161,Pleuven,29,,,291610000C0450,,,,,,,,,,,,,0,,,,,P,prés,,,940,-4.025581,47.906712
2021-403249,2021-07-20,000001,Vente,300000,,,KERGUILY,B064,29170,29161,Pleuven,29,,,291610000C0549,,,,,,,,,,,,,0,,,,,P,prés,,,1517,-4.026255,47.90623
2021-403547,2021-07-09,000001,Vente,21288.8,9152,F,KERLIVERIEN,B076,29170,29161,Pleuven,29,,,29161000AM0152,,,,,,,,,,,,,0,4,Local industriel. commercial ou assimilé,193,0,S,sols,,,1157,-4.029244,47.89172
2021-403852,2021-08-02,000001,Vente,255255,,,LE BOURG  RTE DE QUIMPER,0589,29170,29161,Pleuven,29,,,29161000AA0048,,,,,,,,,,,,,0,,,,,S,sols,,,933,-4.045844,47.907587
2021-403852,2021-08-02,000001,Vente,255255,3,,LE BOURG  RTE DE QUIMPER,0589,29170,29161,Pleuven,29,,,29161000AA0430,,,,,,,,,,,,,0,1,Maison,96,5,S,sols,,,700,-4.045741,47.907646
2021-403852,2021-08-02,000001,Vente,255255,3,,LE BOURG  RTE DE QUIMPER,0589,29170,29161,Pleuven,29,,,29161000AA0430,,,,,,,,,,,,,0,1,Maison,96,5,J,jardins,,,304,-4.045741,47.907646
2021-403852,2021-08-02,000001,Vente,255255,3,,LE BOURG  RTE DE QUIMPER,0589,29170,29161,Pleuven,29,,,29161000AA0430,,,,,,,,,,,,,0,3,Dépendance,,0,J,jardins,,,304,-4.045741,47.907646
2021-403852,2021-08-02,000001,Vente,255255,3,,LE BOURG  RTE DE QUIMPER,0589,29170,29161,Pleuven,29,,,29161000AA0430,,,,,,,,,,,,,0,3,Dépendance,,0,S,sols,,,700,-4.045741,47.907646
2021-403921,2021-08-10,000001,Vente,70000,25,,TOUL AN AEL,0815,29170,29161,Pleuven,29,,,29161000AL0035,,,,,,,,,,,,,0,1,Maison,150,5,S,sols,,,775,-4.028921,47.902796
2021-403921,2021-08-10,000001,Vente,70000,25,,TOUL AN AEL,0815,29170,29161,Pleuven,29,,,29161000AL0035,,,,,,,,,,,,,0,3,Dépendance,,0,S,sols,,,775,-4.028921,47.902796
2021-403921,2021-08-10,000001,Vente,70000,25,,TOUL AN AEL,0815,29170,29161,Pleuven,29,,,29161000AL0035,,,,,,,,,,,,,0,3,Dépendance,,0,S,sols,,,775,-4.028921,47.902796
2021-403951,2021-07-30,000001,Vente,230000,10,,RUE DE BELLEVUE,0090,29170,29161,Pleuven,29,,,29161000AH0033,,,,,,,,,,,,,0,1,Maison,107,6,S,sols,,,500,-4.05502,47.909308
2021-403951,2021-07-30,000001,Vente,230000,10,,RUE DE BELLEVUE,0090,29170,29161,Pleuven,29,,,29161000AH0033,,,,,,,,,,,,,0,1,Maison,107,6,J,jardins,,,600,-4.05502,47.909308
2021-404206,2021-06-30,000001,Vente,150000,9,,CROIX DU REST,0130,29170,29161,Pleuven,29,,,29161000AE0038,,,10,,4,,6,,,,,,3,2,Appartement,64,3,,,,,,-4.061343,47.91615
2021-404206,2021-06-30,000001,Vente,150000,9,,CROIX DU REST,0130,29170,29161,Pleuven,29,,,29161000AE0038,,,4,,6,,,,,,,,2,3,Dépendance,,0,,,,,,-4.061343,47.91615
2021-404206,2021-06-30,000001,Vente,150000,9,,CROIX DU REST,0130,29170,29161,Pleuven,29,,,29161000AE0038,,,4,,6,,,,,,,,2,3,Dépendance,,0,,,,,,-4.061343,47.91615
2021-404356,2021-08-23,000001,Vente,498000,,,HENT LESQUIDIC,0320,29170,29161,Pleuven,29,,,29161000AC0189,,,,,,,,,,,,,0,,,,,T,terres,,,656,-4.077306,47.924608
2021-404356,2021-08-23,000001,Vente,498000,,,HENT LESQUIDIC,0320,29170,29161,Pleuven,29,,,29161000AC0190,,,,,,,,,,,,,0,,,,,T,terres,,,192,-4.077051,47.924747
2021-404440,2021-08-20,000001,Vente,400100,,,GARN GARO,B035,29170,29161,Pleuven,29,,,29161000AA0308,,,,,,,,,,,,,0,,,,,T,terres,,,286,-4.052769,47.906078
2021-404440,2021-08-20,000001,Vente,400100,5,,GARN GARO,0189,29170,29161,Pleuven,29,,,29161000AA0309,,,,,,,,,,,,,0,1,Maison,178,5,S,sols,,,700,-4.052319,47.906426
2021-404440,2021-08-20,000001,Vente,400100,5,,GARN GARO,0189,29170,29161,Pleuven,29,,,29161000AA0309,,,,,,,,,,,,,0,4,Local industriel. commercial ou assimilé,72,0,S,sols,,,700,-4.052319,47.906426
2021-404440,2021-08-20,000001,Vente,400100,5,,GARN GARO,0189,29170,29161,Pleuven,29,,,29161000AA0309,,,,,,,,,,,,,0,1,Maison,178,5,AG,terrains d'agrément,,,1090,-4.052319,47.906426
2021-404440,2021-08-20,000001,Vente,400100,5,,GARN GARO,0189,29170,29161,Pleuven,29,,,29161000AA0309,,,,,,,,,,,,,0,4,Local industriel. commercial ou assimilé,72,0,AG,terrains d'agrément,,,1090,-4.052319,47.906426
2021-404508,2021-09-03,000001,Vente,205000,40,,HAM DE KERDREZEC,A380,29170,29161,Pleuven,29,,,29161000AL0073,,,,,,,,,,,,,0,1,Maison,68,3,S,sols,,,499,-4.027176,47.899736
2021-404553,2021-08-24,000001,Vente,4000,,,PENHOAT,B136,29170,29161,Pleuven,29,,,29161000AK0059,,,,,,,,,,,,,0,,,,,T,terres,,,3792,-4.034684,47.901559
2021-404553,2021-08-24,000001,Vente,4000,,,CHE DE PEN HOAT SALAUN,0580,29170,29161,Pleuven,29,,,29161000AK0060,,,,,,,,,,,,,0,,,,,S,sols,,,348,-4.034064,47.902098
2021-404553,2021-08-24,000001,Vente,4000,,,PENANHOAT SALAUN,B134,29170,29161,Pleuven,29,,,29161000AK0066,,,,,,,,,,,,,0,,,,,S,sols,,,434,-4.033145,47.902175
2021-404553,2021-08-24,000001,Vente,4000,,,CHE DE PEN HOAT SALAUN,0580,29170,29161,Pleuven,29,,,29161000AK0123,,,,,,,,,,,,,0,,,,,S,sols,,,6,-4.034526,47.902124
2021-404553,2021-08-24,000001,Vente,4000,,,PENANHOAT SALAUN,B134,29170,29161,Pleuven,29,,,29161000AK0124,,,,,,,,,,,,,0,,,,,S,sols,,,87,-4.033621,47.902093
2021-404702,2021-09-07,000001,Vente,15000,,,KERIVOAL,B100,29170,29161,Pleuven,29,,,291610000D0162,,,,,,,,,,,,,0,,,,,BT,taillis simples,,,743,-4.044676,47.891119