id_mutation,date_mutation,numero_disposition,nature_mutation,valeur_fonciere,adresse_numero,adresse_suffixe,adresse_nom_voie,adresse_code_voie,code_postal,code_commune,nom_commune,code_departement,ancien_code_commune,ancien_nom_commune,id_parcelle,ancien_id_parcelle,numero_volume,lot1_numero,lot1_surface_carrez,lot2_numero,lot2_surface_carrez,lot3_numero,lot3_surface_carrez,lot4_numero,lot4_surface_carrez,lot5_numero,lot5_surface_carrez,nombre_lots,code_type_local,type_local,surface_reelle_bati,nombre_pieces_principales,code_nature_culture,nature_culture,code_nature_culture_speciale,nature_culture_speciale,surface_terrain,longitude,latitude
2021-396425,2021-01-16,000001,Vente,18000,,,LE BOURG,B005,29560,29289,Trégarvan,29,,,29289000ZB0287,,,,,,,,,,,,,0,,,,,J,jardins,,,365,-4.225695,48.25172
2021-396425,2021-01-16,000001,Vente,18000,,,LE BOURG,B005,29560,29289,Trégarvan,29,,,29289000ZB0288,,,,,,,,,,,,,0,,,,,BR,futaies résineuses,,,1880,-4.225994,48.251975
2021-397044,2021-02-15,000001,Vente,50000,77,,BELLE VUE,B002,29560,29289,Trégarvan,29,,,29289000ZE0056,,,,,,,,,,,,,0,1,Maison,87,4,S,sols,,,305,-4.224148,48.24293
2021-397044,2021-02-15,000001,Vente,50000,77,,BELLE VUE,B002,29560,29289,Trégarvan,29,,,29289000ZE0056,,,,,,,,,,,,,0,3,Dépendance,,0,S,sols,,,305,-4.224148,48.24293
2021-397044,2021-02-15,000001,Vente,50000,78,,BELLE VUE,B002,29560,29289,Trégarvan,29,,,29289000ZE0057,,,,,,,,,,,,,0,3,Dépendance,,0,T,terres,,,895,-4.224265,48.242721
2021-397044,2021-02-15,000001,Vente,50000,78,,BELLE VUE,B002,29560,29289,Trégarvan,29,,,29289000ZE0057,,,,,,,,,,,,,0,3,Dépendance,,0,S,sols,,,40,-4.224265,48.242721
2021-397044,2021-02-15,000001,Vente,50000,,,BELLE VUE,B002,29560,29289,Trégarvan,29,,,29289000ZE0081,,,,,,,,,,,,,0,,,,,S,sols,,,100,-4.22411,48.242612
2021-400355,2021-05-07,000001,Vente,185000,1978,D,LA GREVE,B260,29560,29289,Trégarvan,29,,,29289000ZA0147,,,,,,,,,,,,,0,1,Maison,113,3,S,sols,,,1217,-4.231969,48.250006
2021-402660,2021-07-09,000001,Vente,55000,29,,GOULENEZ,B043,29560,29289,Trégarvan,29,,,29289000ZB0271,,,,,,,,,,,,,0,1,Maison,80,3,S,sols,,,987,-4.222874,48.25162
2021-402660,2021-07-09,000001,Vente,55000,29,,GOULENEZ,B043,29560,29289,Trégarvan,29,,,29289000ZB0271,,,,,,,,,,,,,0,3,Dépendance,,0,S,sols,,,987,-4.222874,48.25162
2021-405413,2021-09-24,000001,Vente,50000,,,BRIGNEUN,B015,29560,29289,Trégarvan,29,,,29289000ZC0247,,,,,,,,,,,,,0,,,,,S,sols,,,4,-4.208869,48.236969
2021-405413,2021-09-24,000001,Vente,50000,97,,BRIGNEUN,B015,29560,29289,Trégarvan,29,,,29289000ZC0249,,,,,,,,,,,,,0,3,Dépendance,,0,S,sols,,,201,-4.209009,48.236929
2021-405413,2021-09-24,000001,Vente,50000,97,,BRIGNEUN,B015,29560,29289,Trégarvan,29,,,29289000ZC0249,,,,,,,,,,,,,0,3,Dépendance,,0,S,sols,,,201,-4.209009,48.236929
2021-405413,2021-09-24,000001,Vente,50000,97,,BRIGNEUN,B015,29560,29289,Trégarvan,29,,,29289000ZC0249,,,,,,,,,,,,,0,1,Maison,100,4,S,sols,,,201,-4.209009,48.236929
2021-405413,2021-09-24,000001,Vente,50000,,,BRIGNEUN,B015,29560,29289,Trégarvan,29,,,29289000ZC0275,,,,,,,,,,,,,0,,,,,T,terres,,,193,-4.208965,48.236706
2021-405413,2021-09-24,000001,Vente,50000,,,BRIGNEUN,B015,29560,29289,Trégarvan,29,,,29289000ZC0277,,,,,,,,,,,,,0,,,,,S,sols,,,308,-4.208764,48.236872
