id_mutation,date_mutation,numero_disposition,nature_mutation,valeur_fonciere,adresse_numero,adresse_suffixe,adresse_nom_voie,adresse_code_voie,code_postal,code_commune,nom_commune,code_departement,ancien_code_commune,ancien_nom_commune,id_parcelle,ancien_id_parcelle,numero_volume,lot1_numero,lot1_surface_carrez,lot2_numero,lot2_surface_carrez,lot3_numero,lot3_surface_carrez,lot4_numero,lot4_surface_carrez,lot5_numero,lot5_surface_carrez,nombre_lots,code_type_local,type_local,surface_reelle_bati,nombre_pieces_principales,code_nature_culture,nature_culture,code_nature_culture_speciale,nature_culture_speciale,surface_terrain,longitude,latitude
2021-435948,2021-01-26,000001,Vente,10000,,,LA BLAQUIERE,B015,30570,30229,Saint-André-de-Majencoules,30,,,302290000B0878,,,,,,,,,,,,,0,,,,,S,sols,,,102,3.681139,44.038095
2021-435948,2021-01-26,000001,Vente,10000,,,LES BAURIS,B011,30570,30229,Saint-André-de-Majencoules,30,,,302290000B1080,,,,,,,,,,,,,0,,,,,L,landes,,,10,3.688739,44.040763
2021-436017,2021-01-22,000001,Vente,210000,,,POUMAREDES,B188,30570,30229,Saint-André-de-Majencoules,30,,,302290000D0897,,,,,,,,,,,,,0,,,,,BT,taillis simples,CHVER,Chênes -verts,1566,3.656733,44.015687
2021-436017,2021-01-22,000001,Vente,210000,,,POUMAREDES,B188,30570,30229,Saint-André-de-Majencoules,30,,,302290000D0898,,,,,,,,,,,,,0,,,,,BT,taillis simples,CHVER,Chênes -verts,585,3.657475,44.016177
2021-436017,2021-01-22,000001,Vente,210000,,,POUMAREDES,B188,30570,30229,Saint-André-de-Majencoules,30,,,302290000D0908,,,,,,,,,,,,,0,,,,,BT,taillis simples,CHVER,Chênes -verts,7631,3.657786,44.015509
2021-436017,2021-01-22,000001,Vente,210000,,,POUMAREDES,B188,30570,30229,Saint-André-de-Majencoules,30,,,302290000D0909,,,,,,,,,,,,,0,,,,,L,landes,,,1968,3.657251,44.01493
2021-436017,2021-01-22,000001,Vente,210000,,,POUMAREDES,B188,30570,30229,Saint-André-de-Majencoules,30,,,302290000D0910,,,,,,,,,,,,,0,,,,,BT,taillis simples,CHVER,Chênes -verts,12567,3.656239,44.014034
2021-436017,2021-01-22,000001,Vente,210000,,,CAMIAS,B045,30570,30229,Saint-André-de-Majencoules,30,,,302290000E1307,,,,,,,,,,,,,0,,,,,VI,vignes,,,750,3.657401,44.01661
2021-436017,2021-01-22,000001,Vente,210000,,,CAMIAS,B045,30570,30229,Saint-André-de-Majencoules,30,,,302290000E1524,,,,,,,,,,,,,0,,,,,S,sols,,,119,3.65749,44.016943
2021-436017,2021-01-22,000001,Vente,210000,,,CAMIAS,B045,30570,30229,Saint-André-de-Majencoules,30,,,302290000E1752,,,,,,,,,,,,,0,,,,,S,sols,,,173,3.657536,44.017081
2021-436017,2021-01-22,000001,Vente,210000,,,CAMIAS,B045,30570,30229,Saint-André-de-Majencoules,30,,,302290000E1803,,,,,,,,,,,,,0,,,,,VI,vignes,,,1020,3.657714,44.016745
2021-436017,2021-01-22,000001,Vente,210000,5653,,CAMIAS,B045,30570,30229,Saint-André-de-Majencoules,30,,,302290000E1830,,,1,,2,,,,,,,,2,2,Appartement,30,1,,,,,,3.657649,44.017005
2021-436017,2021-01-22,000001,Vente,210000,5114,,CAMIAS,B045,30570,30229,Saint-André-de-Majencoules,30,,,302290000E1831,,,,,,,,,,,,,0,1,Maison,63,3,S,sols,,,74,3.657668,44.016975
2021-436093,2021-01-20,000001,Vente,25000,5369,,LA COSTE,B070,30570,30229,Saint-André-de-Majencoules,30,,,302290000A0597,,,,,,,,,,,,,0,3,Dépendance,,0,S,sols,,,51,3.669701,44.042229
2021-436093,2021-01-20,000001,Vente,25000,5368,,LA COSTE,B070,30570,30229,Saint-André-de-Majencoules,30,,,302290000A0608,,,,,,,,,,,,,0,1,Maison,30,2,S,sols,,,20,3.669587,44.042178
2021-436093,2021-01-20,000001,Vente,25000,5367,,LA COSTE,B070,30570,30229,Saint-André-de-Majencoules,30,,,302290000A1457,,,3,,,,,,,,,,1,2,Appartement,40,1,,,,,,3.669564,44.042296
2021-436093,2021-01-20,000001,Vente,25000,5367,,LA COSTE,B070,30570,30229,Saint-André-de-Majencoules,30,,,302290000A1457,,,6,,8,,,,,,,,2,2,Appartement,10,0,,,,,,3.669564,44.042296
2021-436179,2021-01-28,000001,Vente,20000,,,LE PUECH,B201,30570,30229,Saint-André-de-Majencoules,30,,,302290000A1373,,,,,,,,,,,,,0,,,,,S,sols,,,945,3.669573,44.043901
2021-436179,2021-01-28,000001,Vente,20000,,,LE PUECH,B201,30570,30229,Saint-André-de-Majencoules,30,,,302290000A1373,,,,,,,,,,,,,0,,,,,VI,vignes,,,2936,3.669573,44.043901
2021-436446,2021-02-03,000001,Vente,134350,5251,,LE VILLARET,B253,30570,30229,Saint-André-de-Majencoules,30,,,302290000C0799,,,,,,,,,,,,,0,1,Maison,126,5,S,sols,,,122,3.688486,44.025368
2021-436446,2021-02-03,000001,Vente,134350,,,LE VILLARET,B253,30570,30229,Saint-André-de-Majencoules,30,,,302290000C1100,,,,,,,,,,,,,0,,,,,VI,vignes,,,137,3.688374,44.025404
2021-436446,2021-02-03,000001,Vente,134350,,,LE VILLARET,B253,30570,30229,Saint-André-de-Majencoules,30,,,302290000C1110,,,,,,,,,,,,,0,,,,,T,terres,,,83,3.688487,44.025319
2021-436652,2021-02-24,000001,Echange,2000,,,POUMAREDES,B188,30570,30229,Saint-André-de-Majencoules,30,,,302290000D0893,,,,,,,,,,,,,0,,,,,BT,taillis simples,CHVER,Chênes -verts,798,3.654504,44.01604
2021-436652,2021-02-24,000001,Echange,2000,,,POUMAREDES,B188,30570,30229,Saint-André-de-Majencoules,30,,,302290000D0926,,,,,,,,,,,,,0,,,,,BT,taillis simples,CHVER,Chênes -verts,4446,3.658983,44.014567
2021-436652,2021-02-24,000001,Echange,2000,,,LA FARE,B082,30570,30229,Saint-André-de-Majencoules,30,,,302290000E1209,,,,,,,,,,,,,0,,,,,BT,taillis simples,CHVER,Chênes -verts,5750,3.651169,44.019183
2021-436652,2021-02-24,000001,Echange,2000,,,BOIS NOUVEL,B020,30570,30229,Saint-André-de-Majencoules,30,,,302290000E1271,,,,,,,,,,,,,0,,,,,BT,taillis simples,CHVER,Chênes -verts,3060,3.657128,44.019265
2021-436652,2021-02-24,000001,Echange,2000,,,LES BRUGAS,B038,30570,30229,Saint-André-de-Majencoules,30,,,302290000E1273,,,,,,,,,,,,,0,,,,,BT,taillis simples,CHVER,Chênes -verts,4100,3.656129,44.019359
2021-436652,2021-02-24,000001,Echange,2000,,,LES BRUGAS,B038,30570,30229,Saint-André-de-Majencoules,30,,,302290000E1274,,,,,,,,,,,,,0,,,,,BT,taillis simples,CHVER,Chênes -verts,6215,3.655748,44.020327
2021-436652,2021-02-24,000001,Echange,2000,,,LES BRUGAS,B038,30570,30229,Saint-André-de-Majencoules,30,,,302290000E1277,,,,,,,,,,,,,0,,,,,L,landes,,,1680,3.65563,44.019533
2021-436652,2021-02-24,000001,Echange,2000,,,LES BRUGAS,B038,30570,30229,Saint-André-de-Majencoules,30,,,302290000E1278,,,,,,,,,,,,,0,,,,,VI,vignes,,,1920,3.655616,44.019353
2021-436652,2021-02-24,000001,Echange,2000,,,LES BRUGAS,B038,30570,30229,Saint-André-de-Majencoules,30,,,302290000E1279,,,,,,,,,,,,,0,,,,,T,terres,,,1900,3.656182,44.018727
2021-436652,2021-02-24,000001,Echange,2000,,,LA TAILLADE,B233,30570,30229,Saint-André-de-Majencoules,30,,,302290000E1337,,,,,,,,,,,,,0,,,,,BT,taillis simples,CHVER,Chênes -verts,2510,3.653282,44.01886
2021-436652,2021-02-24,000001,Echange,2000,,,LA TAILLADE,B233,30570,30229,Saint-André-de-Majencoules,30,,,302290000E1339,,,,,,,,,,,,,0,,,,,BT,taillis simples,CHVER,Chênes -verts,27235,3.653182,44.018047
2021-436652,2021-02-24,000001,Echange,2000,,,LA TAILLADE,B233,30570,30229,Saint-André-de-Majencoules,30,,,302290000E1340,,,,,,,,,,,,,0,,,,,BT,taillis simples,CHVER,Chênes -verts,872,3.653014,44.017406
2021-436652,2021-02-24,000001,Echange,2000,,,LA TAILLADE,B233,30570,30229,Saint-André-de-Majencoules,30,,,302290000E1347,,,,,,,,,,,,,0,,,,,BT,taillis simples,CHVER,Chênes -verts,7090,3.655478,44.016478
2021-436652,2021-02-24,000001,Echange,2000,,,GOUTINELLE,B100,30570,30229,Saint-André-de-Majencoules,30,,,302290000E1357,,,,,,,,,,,,,0,,,,,BT,taillis simples,CHVER,Chênes -verts,3358,3.651687,44.018321
2021-436652,2021-02-24,000001,Echange,2000,,,CAMIAS,B045,30570,30229,Saint-André-de-Majencoules,30,,,302290000E1470,,,,,,,,,,,,,0,,,,,BT,taillis simples,CHVER,Chênes -verts,50,,
2021-436652,2021-02-24,000001,Echange,2000,,,CAMIAS,B045,30570,30229,Saint-André-de-Majencoules,30,,,302290000E1802,,,,,,,,,,,,,0,,,,,T,terres,,,40,3.657366,44.017519
2021-436652,2021-02-24,000001,Echange,2000,,,CAMIAS,B045,30570,30229,Saint-André-de-Majencoules,30,,,302290000E1960,,,,,,,,,,,,,0,,,,,BT,taillis simples,CHVER,Chênes -verts,7,3.657259,44.017733
2021-436652,2021-02-24,000001,Echange,2000,,,CAMIAS,B045,30570,30229,Saint-André-de-Majencoules,30,,,302290000E1963,,,,,,,,,,,,,0,,,,,BT,taillis simples,CHVER,Chênes -verts,256,3.657294,44.017614
2021-436652,2021-02-24,000001,Echange,2000,,,CAMIAS,B045,30570,30229,Saint-André-de-Majencoules,30,,,302290000E1965,,,,,,,,,,,,,0,,,,,BT,taillis simples,CHVER,Chênes -verts,39,3.657103,44.01771
2021-436660,2021-02-22,000001,Vente,70000,5301,,PONT DE PEYREGROSSE,B185,30570,30229,Saint-André-de-Majencoules,30,,,302290000B1167,,,,,,,,,,,,,0,1,Maison,70,3,S,sols,,,113,3.683002,44.036589
2021-436660,2021-02-22,000001,Vente,70000,,,LE SOURY,B230,30570,30229,Saint-André-de-Majencoules,30,,,302290000B1169,,,,,,,,,,,,,0,,,,,S,sols,,,45,3.683081,44.036734
2021-436736,2021-02-25,000001,Vente,96000,5169,,PONT D HERAULT,B229,30570,30229,Saint-André-de-Majencoules,30,,,302290000D0444,,,,,,,,,,,,,0,1,Maison,85,4,S,sols,,,268,3.676166,43.997815
2021-437019,2021-02-24,000001,Vente,300,,,LA COSTE,B070,30570,30229,Saint-André-de-Majencoules,30,,,302290000A0687,,,,,,,,,,,,,0,,,,,L,landes,,,61,3.668319,44.043744
2021-437385,2021-03-19,000001,Vente,10994,,,L HUBAC,B115,30570,30229,Saint-André-de-Majencoules,30,,,302290000E0005,,,,,,,,,,,,,0,,,,,BT,taillis simples,CHVER,Chênes -verts,350,3.653563,44.036967
2021-437385,2021-03-19,000001,Vente,10994,,,L HUBAC,B115,30570,30229,Saint-André-de-Majencoules,30,,,302290000E0006,,,,,,,,,,,,,0,,,,,BT,taillis simples,CHVER,Chênes -verts,22000,3.654746,44.037433
2021-437385,2021-03-19,000001,Vente,10994,,,CLAUZELS DES COMBES,B060,30570,30229,Saint-André-de-Majencoules,30,,,302290000E0161,,,,,,,,,,,,,0,,,,,T,terres,,,427,3.660247,44.028389
2021-437385,2021-03-19,000001,Vente,10994,,,CLAUZELS DES COMBES,B060,30570,30229,Saint-André-de-Majencoules,30,,,302290000E0162,,,,,,,,,,,,,0,,,,,VE,vergers,CHAT,Châtaigneraie,510,3.660762,44.028191
2021-437385,2021-03-19,000001,Vente,10994,,,CLAUZELS DES COMBES,B060,30570,30229,Saint-André-de-Majencoules,30,,,302290000E0163,,,,,,,,,,,,,0,,,,,T,terres,,,2530,3.660285,44.02817
2021-437385,2021-03-19,000001,Vente,10994,,,CLAUZELS DES COMBES,B060,30570,30229,Saint-André-de-Majencoules,30,,,302290000E0170,,,,,,,,,,,,,0,,,,,T,terres,,,440,3.659266,44.029209
2021-437385,2021-03-19,000001,Vente,10994,,,CLAUZELS DES COMBES,B060,30570,30229,Saint-André-de-Majencoules,30,,,302290000E0171,,,,,,,,,,,,,0,,,,,T,terres,,,580,3.65937,44.029364
2021-437385,2021-03-19,000001,Vente,10994,,,CLAUZELS DES COMBES,B060,30570,30229,Saint-André-de-Majencoules,30,,,302290000E0172,,,,,,,,,,,,,0,,,,,BT,taillis simples,CHVER,Chênes -verts,960,3.659475,44.02944
2021-437385,2021-03-19,000001,Vente,10994,,,L HORT DEL VALAT,B112,30570,30229,Saint-André-de-Majencoules,30,,,302290000E0191,,,,,,,,,,,,,0,,,,,P,prés,,,630,3.657694,44.029736
2021-437385,2021-03-19,000001,Vente,10994,,,BOIS DE ROUBIAS,B018,30570,30229,Saint-André-de-Majencoules,30,,,302290000E0195,,,,,,,,,,,,,0,,,,,BT,taillis simples,CHVER,Chênes -verts,6030,3.658186,44.027503
2021-437385,2021-03-19,000001,Vente,10994,,,GRAVETTES,B106,30570,30229,Saint-André-de-Majencoules,30,,,302290000E0207,,,,,,,,,,,,,0,,,,,L,landes,,,220,3.656718,44.031113
2021-437385,2021-03-19,000001,Vente,10994,,,MIEMEJANE,B149,30570,30229,Saint-André-de-Majencoules,30,,,302290000E0219,,,,,,,,,,,,,0,,,,,BT,taillis simples,CHVER,Chênes -verts,395,3.656564,44.033136
2021-437385,2021-03-19,000001,Vente,10994,,,COMBE CROZE,B065,30570,30229,Saint-André-de-Majencoules,30,,,302290000E0231,,,,,,,,,,,,,0,,,,,L,landes,,,1540,3.654894,44.033811
2021-437385,2021-03-19,000001,Vente,10994,,,COMBE CROZE,B065,30570,30229,Saint-André-de-Majencoules,30,,,302290000E0232,,,,,,,,,,,,,0,,,,,BT,taillis simples,CHVER,Chênes -verts,9635,3.655042,44.033894
2021-437385,2021-03-19,000001,Vente,10994,,,COMBE CROZE,B065,30570,30229,Saint-André-de-Majencoules,30,,,302290000E0233,,,,,,,,,,,,,0,,,,,L,landes,,,1060,3.655189,44.033198
2021-437385,2021-03-19,000001,Vente,10994,,,COMBE CROZE,B065,30570,30229,Saint-André-de-Majencoules,30,,,302290000E0237,,,,,,,,,,,,,0,,,,,BT,taillis simples,CHVER,Chênes -verts,10050,3.654608,44.033527
2021-437385,2021-03-19,000001,Vente,10994,,,COMBE CROZE,B065,30570,30229,Saint-André-de-Majencoules,30,,,302290000E0251,,,,,,,,,,,,,0,,,,,BT,taillis simples,CHVER,Chênes -verts,23862,3.651579,44.036153
2021-437385,2021-03-19,000001,Vente,10994,,,MALPAS,B142,30570,30229,Saint-André-de-Majencoules,30,,,302290000E0258,,,,,,,,,,,,,0,,,,,BT,taillis simples,CHVER,Chênes -verts,980,3.652756,44.036745
2021-437385,2021-03-19,000001,Vente,10994,,,MALPAS,B142,30570,30229,Saint-André-de-Majencoules,30,,,302290000E0259,,,,,,,,,,,,,0,,,,,BT,taillis simples,CHVER,Chênes -verts,175,3.653257,44.037082
2021-437385,2021-03-19,000001,Vente,10994,,,MALPAS,B142,30570,30229,Saint-André-de-Majencoules,30,,,302290000E0260,,,,,,,,,,,,,0,,,,,BT,taillis simples,CHVER,Chênes -verts,130,3.652663,44.037447
2021-437385,2021-03-19,000001,Vente,10994,,,MALPAS,B142,30570,30229,Saint-André-de-Majencoules,30,,,302290000E0266,,,,,,,,,,,,,0,,,,,BT,taillis simples,CHVER,Chênes -verts,2940,3.650018,44.03676
2021-437385,2021-03-19,000001,Vente,10994,,,PLOT DES SOUCHES,B183,30570,30229,Saint-André-de-Majencoules,30,,,302290000E0967,,,,,,,,,,,,,0,,,,,BT,taillis simples,CHVER,Chênes -verts,19415,3.668999,44.022954
2021-437385,2021-03-19,000001,Vente,10994,,,PLOT DES SOUCHES,B183,30570,30229,Saint-André-de-Majencoules,30,,,302290000E0971,,,,,,,,,,,,,0,,,,,BT,taillis simples,CHVER,Chênes -verts,559,3.668656,44.023498
2021-437385,2021-03-19,000001,Vente,10994,,,NARBOUVIEL,B159,30570,30229,Saint-André-de-Majencoules,30,,,302290000E1132,,,,,,,,,,,,,0,,,,,BT,taillis simples,CHVER,Chênes -verts,439,3.663556,44.019147
2021-437385,2021-03-19,000001,Vente,10994,,,LES AIRES,B005,30570,30229,Saint-André-de-Majencoules,30,,,302290000E1232,,,,,,,,,,,,,0,,,,,BT,taillis simples,CHVER,Chênes -verts,10647,3.654247,44.027669
2021-437385,2021-03-19,000001,Vente,10994,,,MALPAS,B142,30570,30229,Saint-André-de-Majencoules,30,,,302290000E1512,,,,,,,,,,,,,0,,,,,BT,taillis simples,CHVER,Chênes -verts,8303,3.652433,44.037266
2021-437385,2021-03-19,000001,Vente,10994,,,COMBE CROZE,B065,30570,30229,Saint-André-de-Majencoules,30,,,302290000E1515,,,,,,,,,,,,,0,,,,,L,landes,,,1250,3.652855,44.035732
2021-438273,2021-04-13,000001,Vente,21000,,,REQUIROL ET LES SAQUAIROUS,B206,30570,30229,Saint-André-de-Majencoules,30,,,302290000A0045,,,,,,,,,,,,,0,,,,,BT,taillis simples,CHVER,Chênes -verts,2236,3.651207,44.047692
2021-438273,2021-04-13,000001,Vente,21000,,,LES PAUSES,B167,30570,30229,Saint-André-de-Majencoules,30,,,302290000A0331,,,,,,,,,,,,,0,,,,,L,landes,,,151,3.680893,44.045609
2021-438273,2021-04-13,000001,Vente,21000,,,LES PAUSES,B167,30570,30229,Saint-André-de-Majencoules,30,,,302290000A0333,,,,,,,,,,,,,0,,,,,T,terres,,,2030,3.681306,44.04596
2021-438273,2021-04-13,000001,Vente,21000,,,LES PAUSES,B167,30570,30229,Saint-André-de-Majencoules,30,,,302290000A0334,,,,,,,,,,,,,0,,,,,BT,taillis simples,CHVER,Chênes -verts,23420,3.681875,44.04666
2021-438273,2021-04-13,000001,Vente,21000,,,LES PAUSES,B167,30570,30229,Saint-André-de-Majencoules,30,,,302290000A0335,,,,,,,,,,,,,0,,,,,BT,taillis simples,CHVER,Chênes -verts,4832,3.682488,44.047207
2021-438273,2021-04-13,000001,Vente,21000,,,LES PAUSES,B167,30570,30229,Saint-André-de-Majencoules,30,,,302290000A0336,,,,,,,,,,,,,0,,,,,T,terres,,,5741,3.682687,44.045785
2021-438273,2021-04-13,000001,Vente,21000,,,LES PAUSES,B167,30570,30229,Saint-André-de-Majencoules,30,,,302290000A0351,,,,,,,,,,,,,0,,,,,BT,taillis simples,CHVER,Chênes -verts,415,3.682753,44.045433
2021-438273,2021-04-13,000001,Vente,21000,,,LES PAUSES,B167,30570,30229,Saint-André-de-Majencoules,30,,,302290000A0355,,,,,,,,,,,,,0,,,,,T,terres,,,210,3.682126,44.044809
2021-438273,2021-04-13,000001,Vente,21000,,,LES PAUSES,B167,30570,30229,Saint-André-de-Majencoules,30,,,302290000A0356,,,,,,,,,,,,,0,,,,,L,landes,,,1025,3.681963,44.044796
2021-438273,2021-04-13,000001,Vente,21000,,,LES PAUSES,B167,30570,30229,Saint-André-de-Majencoules,30,,,302290000A0363,,,,,,,,,,,,,0,,,,,L,landes,,,5,3.680987,44.045379
2021-438273,2021-04-13,000001,Vente,21000,,,LES PAUSES,B167,30570,30229,Saint-André-de-Majencoules,30,,,302290000A0364,,,,,,,,,,,,,0,,,,,S,sols,,,30,3.68091,44.045456
2021-438273,2021-04-13,000001,Vente,21000,,,LES PAUSES,B167,30570,30229,Saint-André-de-Majencoules,30,,,302290000A0365,,,,,,,,,,,,,0,,,,,L,landes,,,778,3.680836,44.045528
2021-438273,2021-04-13,000001,Vente,21000,,,LES PAUSES,B167,30570,30229,Saint-André-de-Majencoules,30,,,302290000A0987,,,,,,,,,,,,,0,,,,,BT,taillis simples,CHVER,Chênes -verts,925,3.677606,44.047974
2021-438273,2021-04-13,000001,Vente,21000,,,LES PAUSES,B167,30570,30229,Saint-André-de-Majencoules,30,,,302290000A1175,,,,,,,,,,,,,0,,,,,T,terres,,,1097,3.682247,44.045084
2021-438273,2021-04-13,000001,Vente,21000,,,LES PAUSES,B167,30570,30229,Saint-André-de-Majencoules,30,,,302290000A1232,,,,,,,,,,,,,0,,,,,P,prés,,,144,3.681156,44.045154
2021-438275,2021-04-14,000002,Vente,434,,,LATUFFET,B130,30570,30229,Saint-André-de-Majencoules,30,,,302290000D1725,,,,,,,,,,,,,0,,,,,S,sols,,,31,3.675456,43.999523
2021-438275,2021-04-14,000002,Vente,434,,,LATUFFET,B130,30570,30229,Saint-André-de-Majencoules,30,,,302290000D1727,,,,,,,,,,,,,0,,,,,T,terres,,,31,3.675472,43.999678
2021-438403,2021-04-14,000002,Vente,150,,,PONT D HERAULT,B229,30570,30229,Saint-André-de-Majencoules,30,,,302290000D1729,,,,,,,,,,,,,0,,,,,CH,chemin de fer,FER,Chemin de fer,35,3.677008,43.998017
2021-438407,2021-04-12,000001,Echange,10000,,,LES ANGLADES,B007,30570,30229,Saint-André-de-Majencoules,30,,,302290000E1866,,,,,,,,,,,,,0,,,,,T,terres,,,445,3.662067,44.026502
2021-438407,2021-04-12,000001,Echange,10000,,,LES ANGLADES,B007,30570,30229,Saint-André-de-Majencoules,30,,,302290000E1867,,,,,,,,,,,,,0,,,,,T,terres,,,23,3.662104,44.026765
2021-438407,2021-04-12,000001,Echange,10000,,,LA ROUVIERETTE,B215,30570,30229,Saint-André-de-Majencoules,30,,,302290000E1868,,,,,,,,,,,,,0,,,,,T,terres,,,58,3.662209,44.026815
2021-438407,2021-04-12,000001,Echange,10000,,,LA ROUVIERETTE,B215,30570,30229,Saint-André-de-Majencoules,30,,,302290000E1873,,,,,,,,,,,,,0,,,,,T,terres,,,286,3.663094,44.026248
2021-438407,2021-04-12,000001,Echange,10000,,,LA ROUVIERETTE,B215,30570,30229,Saint-André-de-Majencoules,30,,,302290000E1875,,,,,,,,,,,,,0,,,,,T,terres,,,500,3.662842,44.026269
2021-438407,2021-04-12,000001,Echange,10000,,,LA ROUVIERETTE,B215,30570,30229,Saint-André-de-Majencoules,30,,,302290000E1875,,,,,,,,,,,,,0,,,,,T,terres,,,730,3.662842,44.026269
2021-438486,2021-04-21,000001,Vente,75000,5205,,LATUFFET,B130,30570,30229,Saint-André-de-Majencoules,30,,,302290000D0323,,,,,,,,,,,,,0,1,Maison,105,4,S,sols,,,240,3.675642,44.000249
2021-438486,2021-04-21,000001,Vente,75000,,,LATUFFET,B130,30570,30229,Saint-André-de-Majencoules,30,,,302290000D0324,,,,,,,,,,,,,0,,,,,S,sols,,,37,3.67532,44.000398
2021-438486,2021-04-21,000001,Vente,75000,,,LATUFFET,B130,30570,30229,Saint-André-de-Majencoules,30,,,302290000D0324,,,,,,,,,,,,,0,,,,,T,terres,,,500,3.67532,44.000398
2021-438486,2021-04-21,000001,Vente,75000,,,LATUFFET,B130,30570,30229,Saint-André-de-Majencoules,30,,,302290000D1368,,,,,,,,,,,,,0,,,,,T,terres,,,660,3.675481,44.000458
2021-438486,2021-04-21,000001,Vente,75000,,,LATUFFET,B130,30570,30229,Saint-André-de-Majencoules,30,,,302290000D1514,,,,,,,,,,,,,0,,,,,VE,vergers,,,31,3.675477,44.000256
2021-438486,2021-04-21,000001,Vente,75000,,,LATUFFET,B130,30570,30229,Saint-André-de-Majencoules,30,,,302290000D1518,,,,,,,,,,,,,0,,,,,S,sols,,,20,3.675674,44.00016
2021-439693,2021-05-26,000001,Vente,155000,5423,,LES CAMPELS,B053,30570,30229,Saint-André-de-Majencoules,30,,,302290000B0929,,,,,,,,,,,,,0,1,Maison,200,8,S,sols,,,904,3.678341,44.042813
2021-439693,2021-05-26,000001,Vente,155000,,,LES CAMPELS,B053,30570,30229,Saint-André-de-Majencoules,30,,,302290000B0931,,,,,,,,,,,,,0,,,,,S,sols,,,594,3.678291,44.042714
2021-439693,2021-05-26,000001,Vente,155000,,,SALESSOUS,B219,30570,30229,Saint-André-de-Majencoules,30,,,302290000B0934,,,,,,,,,,,,,0,,,,,BT,taillis simples,CHVER,Chênes -verts,560,3.678562,44.042793
2021-439693,2021-05-26,000001,Vente,155000,,,SALESSOUS,B219,30570,30229,Saint-André-de-Majencoules,30,,,302290000B0936,,,,,,,,,,,,,0,,,,,BT,taillis simples,CHVER,Chênes -verts,41,3.67846,44.043018
2021-439693,2021-05-26,000001,Vente,155000,,,SALESSOUS,B219,30570,30229,Saint-André-de-Majencoules,30,,,302290000B0939,,,,,,,,,,,,,0,,,,,S,sols,,,1000,3.678745,44.042286
2021-440097,2021-06-09,000001,Vente,7450,,,LA COSTE,B070,30570,30229,Saint-André-de-Majencoules,30,,,302290000A1021,,,,,,,,,,,,,0,,,,,L,landes,,,151,3.669349,44.041626
2021-440097,2021-06-09,000001,Vente,7450,,,LA COSTE,B070,30570,30229,Saint-André-de-Majencoules,30,,,302290000A1524,,,,,,,,,,,,,0,,,,,VI,vignes,,,326,3.669432,44.041707
2021-440583,2021-06-09,000001,Vente,500,,,ENTRE LAS AIGUES,B079,30570,30229,Saint-André-de-Majencoules,30,,,302290000D1115,,,,,,,,,,,,,0,,,,,VE,vergers,,,1010,3.648016,44.010309
2021-440639,2021-06-22,000001,Vente,3600,,,GOUTINELLE BAS,B101,30570,30229,Saint-André-de-Majencoules,30,,,302290000D1053,,,,,,,,,,,,,0,,,,,L,landes,,,1365,3.646988,44.016636
2021-440639,2021-06-22,000001,Vente,3600,,,GOUTINELLE BAS,B101,30570,30229,Saint-André-de-Majencoules,30,,,302290000D1054,,,,,,,,,,,,,0,,,,,L,landes,,,1888,3.646415,44.016517
2021-440639,2021-06-22,000001,Vente,3600,,,GOUTINELLE BAS,B101,30570,30229,Saint-André-de-Majencoules,30,,,302290000D1055,,,,,,,,,,,,,0,,,,,P,prés,,,1250,3.646081,44.016321
2021-440846,2021-06-29,000001,Vente,20000,,,LES PAUSES,B167,30570,30229,Saint-André-de-Majencoules,30,,,302290000A0284,,,,,,,,,,,,,0,,,,,L,landes,,,456,3.675475,44.046753
2021-440846,2021-06-29,000001,Vente,20000,,,LES PAUSES,B167,30570,30229,Saint-André-de-Majencoules,30,,,302290000A0285,,,,,,,,,,,,,0,,,,,L,landes,,,121,3.675613,44.046657
2021-440846,2021-06-29,000001,Vente,20000,,,LES PAUSES,B167,30570,30229,Saint-André-de-Majencoules,30,,,302290000A0286,,,,,,,,,,,,,0,,,,,L,landes,,,658,3.676483,44.046607
2021-440846,2021-06-29,000001,Vente,20000,,,LES PAUSES,B167,30570,30229,Saint-André-de-Majencoules,30,,,302290000A0411,,,,,,,,,,,,,0,,,,,L,landes,,,1394,3.67636,44.046427
2021-440846,2021-06-29,000001,Vente,20000,,,LES PAUSES,B167,30570,30229,Saint-André-de-Majencoules,30,,,302290000A0412,,,,,,,,,,,,,0,,,,,VI,vignes,,,1200,3.675311,44.046554
2021-440846,2021-06-29,000001,Vente,20000,,,LES PAUSES,B167,30570,30229,Saint-André-de-Majencoules,30,,,302290000A0412,,,,,,,,,,,,,0,,,,,T,terres,,,234,3.675311,44.046554
2021-440846,2021-06-29,000001,Vente,20000,,,LES PAUSES,B167,30570,30229,Saint-André-de-Majencoules,30,,,302290000A0413,,,,,,,,,,,,,0,,,,,T,terres,,,219,3.674847,44.046856
2021-440846,2021-06-29,000001,Vente,20000,,,L ISSART,B116,30570,30229,Saint-André-de-Majencoules,30,,,302290000A0452,,,,,,,,,,,,,0,,,,,J,jardins,POTAG,Jardin potager,851,3.674822,44.046434
2021-440935,2021-06-21,000001,Vente,94000,,,LE PUECH,B201,30570,30229,Saint-André-de-Majencoules,30,,,302290000A0712,,,,,,,,,,,,,0,,,,,VE,vergers,CHAT,Châtaigneraie,4711,3.670916,44.045443
2021-440935,2021-06-21,000001,Vente,94000,,,LE PUECH,B201,30570,30229,Saint-André-de-Majencoules,30,,,302290000A1538,,,,,,,,,,,,,0,,,,,T,terres,,,889,3.67014,44.04518
2021-440935,2021-06-21,000001,Vente,94000,,,LE PUECH,B201,30570,30229,Saint-André-de-Majencoules,30,,,302290000A1539,,,,,,,,,,,,,0,,,,,L,landes,,,489,3.669987,44.045373
2021-440935,2021-06-21,000001,Vente,94000,5645,,LE PUECH,B201,30570,30229,Saint-André-de-Majencoules,30,,,302290000A1542,,,,,,,,,,,,,0,1,Maison,152,5,S,sols,,,215,3.669768,44.045418
2021-440935,2021-06-21,000001,Vente,94000,,,LE PUECH,B201,30570,30229,Saint-André-de-Majencoules,30,,,302290000A1543,,,,,,,,,,,,,0,,,,,BT,taillis simples,CHVER,Chênes -verts,24874,3.670574,44.046302
2021-440953,2021-06-21,000001,Vente,1500,,,LE PUECH,B201,30570,30229,Saint-André-de-Majencoules,30,,,302290000A1494,,,,,,,,,,,,,0,,,,,T,terres,,,2347,3.66833,44.044021