id_mutation,date_mutation,numero_disposition,nature_mutation,valeur_fonciere,adresse_numero,adresse_suffixe,adresse_nom_voie,adresse_code_voie,code_postal,code_commune,nom_commune,code_departement,ancien_code_commune,ancien_nom_commune,id_parcelle,ancien_id_parcelle,numero_volume,lot1_numero,lot1_surface_carrez,lot2_numero,lot2_surface_carrez,lot3_numero,lot3_surface_carrez,lot4_numero,lot4_surface_carrez,lot5_numero,lot5_surface_carrez,nombre_lots,code_type_local,type_local,surface_reelle_bati,nombre_pieces_principales,code_nature_culture,nature_culture,code_nature_culture_speciale,nature_culture_speciale,surface_terrain,longitude,latitude
2021-491491,2021-10-05,000001,Vente,700,,,PLAGNOT,B037,31260,31030,Ausseing,31,,,310300000A0021,,,,,,,,,,,,,0,,,,,T,terres,,,1280,1.029682,43.152339
2021-493095,2021-11-26,000001,Vente,225000,32,,VILLAGE,B047,31260,31030,Ausseing,31,,,310300000B0529,,,,,,,,,,,,,0,3,Dépendance,,0,S,sols,,,815,1.018023,43.151409
2021-493095,2021-11-26,000001,Vente,225000,32,,VILLAGE,B047,31260,31030,Ausseing,31,,,310300000B0529,,,,,,,,,,,,,0,1,Maison,47,2,S,sols,,,815,1.018023,43.151409
2021-493095,2021-11-26,000001,Vente,225000,,,NOUGUERAGUT,B031,31260,31030,Ausseing,31,,,310300000B0530,,,,,,,,,,,,,0,,,,,J,jardins,,,400,1.018083,43.151094
2021-493095,2021-11-26,000001,Vente,225000,,,NOUGUERAGUT,B031,31260,31030,Ausseing,31,,,310300000B0531,,,,,,,,,,,,,0,,,,,J,jardins,,,510,1.018103,43.150944
2021-494257,2021-01-28,000001,Vente,1500,,,LA ROQUE,B043,31260,31030,Ausseing,31,,,310300000B0693,,,,,,,,,,,,,0,,,,,BT,taillis simples,,,13452,1.014999,43.147984
2021-494257,2021-01-28,000001,Vente,1500,,,LA ROQUE,B043,31260,31030,Ausseing,31,,,310300000B0694,,,,,,,,,,,,,0,,,,,P,prés,,,1398,1.015641,43.148778
2021-494330,2021-01-26,000001,Vente,2500,,,CAZALERE,B009,31260,31030,Ausseing,31,,,310300000B0312,,,,,,,,,,,,,0,,,,,BT,taillis simples,,,3240,1.019545,43.155356
2021-494449,2021-03-03,000001,Vente,660000,,,BECHIN,B001,31260,31030,Ausseing,31,,,310300000A0094,,,,,,,,,,,,,0,,,,,BT,taillis simples,,,3010,1.041796,43.145827
2021-494449,2021-03-03,000001,Vente,660000,,,BECHIN,B001,31260,31030,Ausseing,31,,,310300000A0097,,,,,,,,,,,,,0,,,,,BT,taillis simples,,,2140,1.041176,43.14516
2021-494449,2021-03-03,000001,Vente,660000,,,BECHIN,B001,31260,31030,Ausseing,31,,,310300000A0099,,,,,,,,,,,,,0,,,,,BT,taillis simples,,,4834,1.040521,43.14425
2021-494449,2021-03-03,000001,Vente,660000,,,BECHIN,B001,31260,31030,Ausseing,31,,,310300000A0103,,,,,,,,,,,,,0,,,,,BT,taillis simples,,,7050,1.044501,43.145237
2021-494449,2021-03-03,000001,Vente,660000,,,MONPEYROUS,B028,31260,31030,Ausseing,31,,,310300000A0106,,,,,,,,,,,,,0,,,,,L,landes,FRICH,Friche,2160,1.046862,43.14548
2021-495525,2021-06-15,000001,Vente,770224.94,,,BECHIN,B001,31260,31030,Ausseing,31,,,310300000A0094,,,,,,,,,,,,,0,,,,,BT,taillis simples,,,3010,1.041796,43.145827
2021-495525,2021-06-15,000001,Vente,770224.94,,,BECHIN,B001,31260,31030,Ausseing,31,,,310300000A0097,,,,,,,,,,,,,0,,,,,BT,taillis simples,,,2140,1.041176,43.14516
2021-495525,2021-06-15,000001,Vente,770224.94,,,BECHIN,B001,31260,31030,Ausseing,31,,,310300000A0099,,,,,,,,,,,,,0,,,,,BT,taillis simples,,,4834,1.040521,43.14425
2021-495525,2021-06-15,000001,Vente,770224.94,,,BECHIN,B001,31260,31030,Ausseing,31,,,310300000A0103,,,,,,,,,,,,,0,,,,,BT,taillis simples,,,7050,1.044501,43.145237
2021-495525,2021-06-15,000001,Vente,770224.94,,,MONPEYROUS,B028,31260,31030,Ausseing,31,,,310300000A0106,,,,,,,,,,,,,0,,,,,L,landes,FRICH,Friche,2160,1.046862,43.14548
