id_mutation,date_mutation,numero_disposition,nature_mutation,valeur_fonciere,adresse_numero,adresse_suffixe,adresse_nom_voie,adresse_code_voie,code_postal,code_commune,nom_commune,code_departement,ancien_code_commune,ancien_nom_commune,id_parcelle,ancien_id_parcelle,numero_volume,lot1_numero,lot1_surface_carrez,lot2_numero,lot2_surface_carrez,lot3_numero,lot3_surface_carrez,lot4_numero,lot4_surface_carrez,lot5_numero,lot5_surface_carrez,nombre_lots,code_type_local,type_local,surface_reelle_bati,nombre_pieces_principales,code_nature_culture,nature_culture,code_nature_culture_speciale,nature_culture_speciale,surface_terrain,longitude,latitude
2021-462639,2021-01-22,000002,Vente,248000,14,,CHE DE LA FONTAINE ST SERNIN,0190,31670,31254,Labège,31,,,31254000AT0303,,,,,,,,,,,,,0,3,Dépendance,,0,,,,,,1.54044,43.531074
2021-462859,2021-01-29,000001,Vente,1200000,,,,,,31254,Labège,31,,,31254000BI0006,,2,,,,,,,,,,,0,,,,,,,,,,1.507193,43.543509
2021-462865,2021-01-28,000001,Vente,380000,40,B,CHE DE LA FONTAINE ST SERNIN,0190,31670,31254,Labège,31,,,31254000AT0294,,,,,,,,,,,,,0,1,Maison,99,4,S,sols,,,345,1.544017,43.532979
2021-462878,2021-02-09,000001,Vente,340000,8,,CHE DU VALLON,0450,31670,31254,Labège,31,,,31254000AT0162,,,,,,,,,,,,,0,1,Maison,131,5,S,sols,,,561,1.543877,43.531414
2021-462878,2021-02-09,000001,Vente,340000,8,,CHE DU VALLON,0450,31670,31254,Labège,31,,,31254000AT0162,,,,,,,,,,,,,0,1,Maison,131,5,AG,terrains d'agrément,PARC,Parc,729,1.543877,43.531414
2021-463030,2021-03-04,000001,Vente en l'état futur d'achèvement,234900,116,,RTE DE BAZIEGE,0030,31670,31254,Labège,31,,,31254000AV0124,,,51,,,,,,,,,,1,,,,,,,,,,1.536834,43.52866
2021-463030,2021-03-04,000001,Vente en l'état futur d'achèvement,234900,116,,RTE DE BAZIEGE,0030,31670,31254,Labège,31,,,31254000AV0124,,,24,,,,,,,,,,1,,,,,,,,,,1.536834,43.52866
2021-463041,2021-02-22,000001,Vente,226100,150,,RUE DE LA DECOUVERTE,0142,31670,31254,Labège,31,,,31254000BK0023,,,134,,135,,136,,137,,138,,17,4,Local industriel. commercial ou assimilé,259,0,,,,,,1.501961,43.54688
2021-463067,2021-03-08,000001,Vente,46512,150,,RUE DE LA DECOUVERTE,0142,31670,31254,Labège,31,,,31254000BK0023,,,150,,267,,56,,,,,,3,4,Local industriel. commercial ou assimilé,79,0,,,,,,1.501961,43.54688
2021-463136,2021-03-02,000001,Vente,1800000,8,,RUE DU CHENE VERT,0110,31670,31254,Labège,31,,,31254000AL0008,,,,,,,,,,,,,0,4,Local industriel. commercial ou assimilé,1618,0,S,sols,,,5400,,
2021-463164,2021-02-24,000001,Vente,200000,9036,,RUE LA LAURAGAISE,0232,31670,31254,Labège,31,,,31254000AC0036,,,11,206.44,,,,,,,,,1,4,Local industriel. commercial ou assimilé,245,0,,,,,,1.510102,43.550811
2021-463164,2021-02-24,000001,Vente,200000,9036,,RUE LA LAURAGAISE,0232,31670,31254,Labège,31,,,31254000AC0036,,,28,,29,,56,,57,,58,,8,4,Local industriel. commercial ou assimilé,336,0,,,,,,1.510102,43.550811
2021-463165,2021-03-15,000001,Vente,253100,45,,RUE DU COLOMBIER,0126,31670,31254,Labège,31,,,31254000BC0043,,,30,,40,,41,,42,,43,,8,4,Local industriel. commercial ou assimilé,171,0,,,,,,1.515266,43.536084
2021-463165,2021-03-15,000001,Vente,253100,45,,RUE DU COLOMBIER,0126,31670,31254,Labège,31,,,31254000BC0043,,,54,,,,,,,,,,1,4,Local industriel. commercial ou assimilé,110,0,,,,,,1.515266,43.536084
2021-463166,2021-03-15,000001,Vente,216900,45,,RUE DU COLOMBIER,0126,31670,31254,Labège,31,,,31254000BC0043,,,26,,27,,28,,29,,50,,7,4,Local industriel. commercial ou assimilé,110,0,,,,,,1.515266,43.536084
2021-463177,2021-03-06,000001,Vente,211000,4,,RUE BARATOU,0020,31670,31254,Labège,31,,,31254000AW0230,,,,,,,,,,,,,0,1,Maison,25,2,S,sols,,,259,1.529012,43.529716
2021-463189,2021-03-03,000001,Vente,651750,9001,,RUE AMPERE,0007,31670,31254,Labège,31,,,31254000BK0042,,,148,,149,,150,,151,,152,,15,4,Local industriel. commercial ou assimilé,1259,0,,,,,,1.506146,43.548606
2021-463212,2021-03-11,000002,Vente,219999,5,,CHE DE LA FONTAINE ST SERNIN,0190,31670,31254,Labège,31,,,31254000AS0149,,,,,,,,,,,,,0,,,,,AB,terrains a bâtir,RUE,Rue,20,1.53681,43.530704
2021-463212,2021-03-11,000002,Vente,219999,5,,CHE DE LA FONTAINE ST SERNIN,0190,31670,31254,Labège,31,,,31254000AS0150,,,,,,,,,,,,,0,,,,,AB,terrains a bâtir,RUE,Rue,4,1.536833,43.53069
2021-463212,2021-03-11,000002,Vente,219999,7,,CHE DE LA FONTAINE ST SERNIN,0190,31670,31254,Labège,31,,,31254000AS0151,,,,,,,,,,,,,0,,,,,AB,terrains a bâtir,,,650,1.53699,43.530829
2021-463212,2021-03-11,000002,Vente,219999,7,,CHE DE LA FONTAINE ST SERNIN,0190,31670,31254,Labège,31,,,31254000AS0153,,,,,,,,,,,,,0,,,,,AB,terrains a bâtir,,,13,1.536842,43.53073
2021-463212,2021-03-11,000002,Vente,219999,7,,CHE DE LA FONTAINE ST SERNIN,0190,31670,31254,Labège,31,,,31254000AS0154,,,,,,,,,,,,,0,,,,,AB,terrains a bâtir,,,1,1.536887,43.530717
2021-463212,2021-03-11,000002,Vente,219999,7,,CHE DE LA FONTAINE ST SERNIN,0190,31670,31254,Labège,31,,,31254000AS0155,,,,,,,,,,,,,0,,,,,AB,terrains a bâtir,,,20,1.537081,43.530818
2021-463565,2021-03-31,000001,Vente,454860,7,,ALL ST PAUL,0390,31670,31254,Labège,31,,,31254000AV0092,,,,,,,,,,,,,0,1,Maison,130,6,S,sols,,,1021,1.533969,43.527146
2021-463605,2021-03-29,000001,Vente,500000,5,,RUE LAPEYROUSE,0231,31670,31254,Labège,31,,,31254000BE0054,,,,,,,,,,,,,0,4,Local industriel. commercial ou assimilé,648,0,S,sols,,,1549,,
2021-463733,2021-03-19,000001,Vente,880000,9105,,IMP PIERRE ET MARIE CURIE,0342,31670,31254,Labège,31,,,31254000AE0105,,,1,,10,,11,,12,,13,,14,4,Local industriel. commercial ou assimilé,439,0,,,,,,1.511984,43.546196
2021-463876,2021-03-23,000001,Vente,121329,150,,RUE DE LA DECOUVERTE,0142,31670,31254,Labège,31,,,31254000BK0023,,,270,89.68,273,54.21,57,,58,,61,,11,4,Local industriel. commercial ou assimilé,143,0,,,,,,1.501961,43.54688
2021-466143,2021-05-07,000001,Vente,6960000,2480,,AV L OCCITANE,0286,31670,31254,Labège,31,,,31254000BB0107,,,,,,,,,,,,,0,4,Local industriel. commercial ou assimilé,1053,0,S,sols,,,4091,1.519681,43.534341
2021-466143,2021-05-07,000001,Vente,6960000,2480,,AV L OCCITANE,0286,31670,31254,Labège,31,,,31254000BB0107,,,,,,,,,,,,,0,4,Local industriel. commercial ou assimilé,987,0,S,sols,,,4091,1.519681,43.534341
2021-466143,2021-05-07,000001,Vente,6960000,2480,,AV L OCCITANE,0286,31670,31254,Labège,31,,,31254000BB0107,,,,,,,,,,,,,0,4,Local industriel. commercial ou assimilé,988,0,S,sols,,,4091,1.519681,43.534341
2021-466143,2021-05-07,000001,Vente,6960000,2480,,AV L OCCITANE,0286,31670,31254,Labège,31,,,31254000BB0107,,,,,,,,,,,,,0,4,Local industriel. commercial ou assimilé,4662,0,S,sols,,,4091,1.519681,43.534341
2021-466143,2021-05-07,000001,Vente,6960000,2480,,AV L OCCITANE,0286,31670,31254,Labège,31,,,31254000BB0107,,,,,,,,,,,,,0,4,Local industriel. commercial ou assimilé,1054,0,S,sols,,,4091,1.519681,43.534341
2021-466143,2021-05-07,000001,Vente,6960000,2480,,AV L OCCITANE,0286,31670,31254,Labège,31,,,31254000BB0107,,,,,,,,,,,,,0,4,Local industriel. commercial ou assimilé,987,0,S,sols,,,4091,1.519681,43.534341
2021-466143,2021-05-07,000001,Vente,6960000,2480,,AV L OCCITANE,0286,31670,31254,Labège,31,,,31254000BB0107,,,,,,,,,,,,,0,4,Local industriel. commercial ou assimilé,988,0,S,sols,,,4091,1.519681,43.534341
2021-466143,2021-05-07,000001,Vente,6960000,2460,,AV L OCCITANE,0286,31670,31254,Labège,31,,,31254000BC0013,,,,,,,,,,,,,0,,,,,S,sols,,,6620,1.519327,43.534598
2021-466143,2021-05-07,000001,Vente,6960000,2460,,AV L OCCITANE,0286,31670,31254,Labège,31,,,31254000BC0020,,,,,,,,,,,,,0,,,,,S,sols,,,392,1.519527,43.535025
2021-466246,2021-05-07,000001,Vente,697400,40,,CHE DE CANTELOUP,0080,31670,31254,Labège,31,,,31254000AO0306,,,,,,,,,,,,,0,1,Maison,252,7,AG,terrains d'agrément,PARC,Parc,1161,1.537849,43.539768
2021-466246,2021-05-07,000001,Vente,697400,40,,CHE DE CANTELOUP,0080,31670,31254,Labège,31,,,31254000AO0306,,,,,,,,,,,,,0,1,Maison,252,7,S,sols,,,1000,1.537849,43.539768
2021-466246,2021-05-07,000001,Vente,697400,40,,CHE DE CANTELOUP,0080,31670,31254,Labège,31,,,31254000AO0316,,,,,,,,,,,,,0,,,,,S,sols,,,471,1.537548,43.539805
2021-466596,2021-04-23,000001,Vente,217200,12,,ALL DES FRENES,0202,31670,31254,Labège,31,,,31254000AO0344,,,106,62.45,99,,,,,,,,2,2,Appartement,62,3,,,,,,1.53281,43.540944
2021-466596,2021-04-23,000001,Vente,217200,12,,ALL DES FRENES,0202,31670,31254,Labège,31,,,31254000AO0344,,,106,62.45,99,,,,,,,,2,3,Dépendance,,0,,,,,,1.53281,43.540944
2021-466852,2021-05-19,000001,Vente,589286.2,9001,,RUE AMPERE,0007,31670,31254,Labège,31,,,31254000BK0042,,,104,586.9,105,579.8,115,,116,,117,,55,4,Local industriel. commercial ou assimilé,750,0,,,,,,1.506146,43.548606
2021-466852,2021-05-19,000001,Vente,589286.2,9001,,RUE AMPERE,0007,31670,31254,Labège,31,,,31254000BK0042,,,101,11.9,,,,,,,,,1,4,Local industriel. commercial ou assimilé,370,0,,,,,,1.506146,43.548606
2021-467322,2021-05-19,000001,Vente,1690000,9001,,RUE AMPERE,0007,31670,31254,Labège,31,,,31254000BK0042,,,101,,,,,,,,,,1,4,Local industriel. commercial ou assimilé,370,0,,,,,,1.506146,43.548606
2021-467322,2021-05-19,000001,Vente,1690000,9001,,RUE AMPERE,0007,31670,31254,Labège,31,,,31254000BK0042,,,104,,105,,115,,116,,117,,55,4,Local industriel. commercial ou assimilé,750,0,,,,,,1.506146,43.548606
2021-467605,2021-06-02,000001,Vente,330890,5,,RUE DES TROUBADOURS,0430,31670,31254,Labège,31,,,31254000BB0055,,,,,,,,,,,,,0,1,Maison,93,5,S,sols,,,360,1.524416,43.530553
2021-468130,2021-05-31,000001,Vente,252000,14,,CHE DE LA FONTAINE ST SERNIN,0190,31670,31254,Labège,31,,,31254000AT0304,,,,,,,,,,,,,0,,,,,T,terres,,,1300,1.540011,43.530952
2021-468180,2021-06-02,000001,Vente,603936,9001,,RUE AMPERE,0007,31670,31254,Labège,31,,,31254000BK0042,,,111,,112,,161,,162,,163,,15,4,Local industriel. commercial ou assimilé,1259,0,,,,,,1.506146,43.548606
2021-468576,2021-06-16,000001,Vente,3500,10,,CHE DE CANTELOUP,0080,31670,31254,Labège,31,,,31254000AO0344,,,70,,,,,,,,,,1,3,Dépendance,,0,,,,,,1.53281,43.540944
2021-468871,2021-05-28,000001,Vente,234150,17,,CHE DU GARIPUY,0206,31670,31254,Labège,31,,,31254000AO0270,,,11,70.22,43,,73,,,,,,3,2,Appartement,70,3,,,,,,1.534834,43.537083
2021-468871,2021-05-28,000001,Vente,234150,17,,CHE DU GARIPUY,0206,31670,31254,Labège,31,,,31254000AO0270,,,11,70.22,43,,73,,,,,,3,3,Dépendance,,0,,,,,,1.534834,43.537083
2021-469005,2021-06-18,000001,Vente,160000,15,,AV GEORGES BRASSENS,0205,31670,31254,Labège,31,,,31254000AS0034,,,20,,75,,,,,,,,2,3,Dépendance,,0,,,,,,1.537329,43.534903
2021-469005,2021-06-18,000001,Vente,160000,15,,AV GEORGES BRASSENS,0205,31670,31254,Labège,31,,,31254000AS0034,,,20,,75,,,,,,,,2,2,Appartement,49,2,,,,,,1.537329,43.534903
2021-469503,2021-05-29,000002,Vente,150000,8,,CHE DU COLLEGE PERIGORD,0120,31670,31254,Labège,31,,,31254000AX0055,,,,,,,,,,,,,0,1,Maison,79,4,S,sols,,,413,1.525937,43.530849
2021-469503,2021-05-29,000002,Vente,150000,8,,CHE DU COLLEGE PERIGORD,0120,31670,31254,Labège,31,,,31254000AX0057,,,,,,,,,,,,,0,1,Maison,139,5,,,,,,1.526033,43.530961
2021-469527,2021-06-22,000001,Vente,140000,9036,,RUE LA LAURAGAISE,0232,31670,31254,Labège,31,,,31254000AC0036,,,12,,,,,,,,,,1,4,Local industriel. commercial ou assimilé,139,0,,,,,,1.510102,43.550811
2021-469527,2021-06-22,000001,Vente,140000,9036,,RUE LA LAURAGAISE,0232,31670,31254,Labège,31,,,31254000AC0036,,,50,,51,,52,,53,,54,,6,4,Local industriel. commercial ou assimilé,108,0,,,,,,1.510102,43.550811
2021-469942,2021-06-09,000001,Vente,470000,3,,RUE DES HTE FUTAIES,0220,31670,31254,Labège,31,,,31254000AT0153,,,,,,,,,,,,,0,1,Maison,184,5,S,sols,,,600,1.542175,43.531439
2021-469942,2021-06-09,000001,Vente,470000,3,,RUE DES HTE FUTAIES,0220,31670,31254,Labège,31,,,31254000AT0153,,,,,,,,,,,,,0,1,Maison,184,5,AG,terrains d'agrément,PARC,Parc,796,1.542175,43.531439
2021-470015,2021-06-24,000001,Vente,2017500,109,,VC NUMERO DOUZE GRANDE BORDE,0148,31670,31254,Labège,31,,,31254000BI0028,,,300,1318.51,,,,,,,,,1,4,Local industriel. commercial ou assimilé,1373,0,,,,,,1.507551,43.541607
2021-470070,2021-06-14,000001,Vente,320000,227,,RUE PIERRE GILLES DE GENNES,0343,31670,31254,Labège,31,,,31254000BE0099,,,25,,,,,,,,,,1,4,Local industriel. commercial ou assimilé,134,0,,,,,,1.513752,43.540303
2021-471719,2021-07-01,000001,Vente,5000,2,,ALL CHANTECAILLE,0100,31670,31254,Labège,31,,,31254000AT0026,,,,,,,,,,,,,0,,,,,S,sols,,,13,1.538496,43.528196
2021-471800,2021-07-01,000001,Vente,350000,2,,ALL CHANTECAILLE,0100,31670,31254,Labège,31,,,31254000AT0027,,,,,,,,,,,,,0,1,Maison,132,4,AG,terrains d'agrément,PARC,Parc,676,1.538346,43.527989
2021-471800,2021-07-01,000001,Vente,350000,2,,ALL CHANTECAILLE,0100,31670,31254,Labège,31,,,31254000AT0027,,,,,,,,,,,,,0,1,Maison,132,4,S,sols,,,500,1.538346,43.527989
2021-471809,2021-06-30,000001,Vente,850300,8,,CHE DU GARIPUY,0206,31670,31254,Labège,31,,,31254000AO0278,,,,,,,,,,,,,0,3,Dépendance,,0,S,sols,,,1199,1.536073,43.538673
2021-471809,2021-06-30,000001,Vente,850300,8,,CHE DU GARIPUY,0206,31670,31254,Labège,31,,,31254000AO0278,,,,,,,,,,,,,0,1,Maison,212,6,S,sols,,,1199,1.536073,43.538673
2021-471809,2021-06-30,000001,Vente,850300,,,LE TRICOU,B028,31670,31254,Labège,31,,,31254000AO0376,,,,,,,,,,,,,0,,,,,S,sols,,,21,1.536159,43.538925
2021-472285,2021-07-13,000001,Vente,425000,9101,,IMP PIERRE ET MARIE CURIE,0342,31670,31254,Labège,31,,,31254000AE0101,,,,,,,,,,,,,0,4,Local industriel. commercial ou assimilé,310,0,S,sols,,,756,1.51143,43.54621
2021-472285,2021-07-13,000001,Vente,425000,,,PLANTAUREL,B031,31670,31254,Labège,31,,,31254000AE0104,,,,,,,,,,,,,0,,,,,AB,terrains a bâtir,,,189,1.511505,43.546164
2021-473288,2021-07-13,000001,Vente,278000,10,B,RUE TOURNAMILLE,0410,31670,31254,Labège,31,,,31254000AW0152,,,10,,,,,,,,,,1,3,Dépendance,,0,,,,,,1.528269,43.528952
2021-473288,2021-07-13,000001,Vente,278000,10,B,RUE TOURNAMILLE,0410,31670,31254,Labège,31,,,31254000AW0152,,,3,99.93,6,,,,,,,,2,3,Dépendance,,0,,,,,,1.528269,43.528952
2021-473288,2021-07-13,000001,Vente,278000,10,B,RUE TOURNAMILLE,0410,31670,31254,Labège,31,,,31254000AW0152,,,11,,,,,,,,,,1,3,Dépendance,,0,,,,,,1.528269,43.528952
2021-473288,2021-07-13,000001,Vente,278000,10,B,RUE TOURNAMILLE,0410,31670,31254,Labège,31,,,31254000AW0152,,,3,99.93,6,,,,,,,,2,2,Appartement,100,4,,,,,,1.528269,43.528952
2021-474072,2021-08-05,000001,Vente,400000,5,,CHE DU TRICOU,0420,31670,31254,Labège,31,,,31254000AO0087,,,,,,,,,,,,,0,3,Dépendance,,0,S,sols,,,1781,1.533429,43.538027
2021-474072,2021-08-05,000001,Vente,400000,5,,CHE DU TRICOU,0420,31670,31254,Labège,31,,,31254000AO0087,,,,,,,,,,,,,0,1,Maison,115,4,S,sols,,,1781,1.533429,43.538027
2021-474072,2021-08-05,000001,Vente,400000,5,,CHE DU TRICOU,0420,31670,31254,Labège,31,,,31254000AO0087,,,,,,,,,,,,,0,3,Dépendance,,0,S,sols,,,1781,1.533429,43.538027
2021-474072,2021-08-05,000001,Vente,400000,5,,CHE DU TRICOU,0420,31670,31254,Labège,31,,,31254000AO0087,,,,,,,,,,,,,0,3,Dépendance,,0,S,sols,,,1781,1.533429,43.538027
2021-474226,2021-07-21,000001,Vente,2968866.8,580,,RUE MAX PLANCK,0248,31670,31254,Labège,31,,,31254000AC0002,,,,,,,,,,,,,0,4,Local industriel. commercial ou assimilé,,,S,sols,,,2671,1.509623,43.553672
2021-474226,2021-07-21,000001,Vente,2968866.8,649,,RUE MAX PLANCK,0248,31670,31254,Labège,31,,,31254000AC0003,,,,,,,,,,,,,0,4,Local industriel. commercial ou assimilé,,,S,sols,,,2980,1.50992,43.553357
2021-474620,2021-07-22,000001,Vente,528700,3,,CHE DE LA COLLINE,0125,31670,31254,Labège,31,,,31254000AT0199,,,,,,,,,,,,,0,1,Maison,150,6,S,sols,,,938,1.543306,43.53335
2021-474760,2021-08-05,000002,Vente,100000,42,,CHE DE CANTELOUP,0080,31670,31254,Labège,31,,,31254000AO0422,,,,,,,,,,,,,0,1,Maison,121,5,,,,,,1.538254,43.539499
2021-474760,2021-08-05,000002,Vente,100000,42,,CHE DE CANTELOUP,0080,31670,31254,Labège,31,,,31254000AO0422,,,,,,,,,,,,,0,1,Maison,184,7,,,,,,1.538254,43.539499
2021-474760,2021-08-05,000002,Vente,100000,42,,CHE DE CANTELOUP,0080,31670,31254,Labège,31,,,31254000AO0422,,,,,,,,,,,,,0,1,Maison,124,5,,,,,,1.538254,43.539499
2021-474760,2021-08-05,000002,Vente,100000,42,,CHE DE CANTELOUP,0080,31670,31254,Labège,31,,,31254000AO0422,,,,,,,,,,,,,0,1,Maison,119,5,,,,,,1.538254,43.539499
2021-474760,2021-08-05,000002,Vente,100000,42,,CHE DE CANTELOUP,0080,31670,31254,Labège,31,,,31254000AO0422,,,,,,,,,,,,,0,3,Dépendance,,0,,,,,,1.538254,43.539499
2021-474760,2021-08-05,000002,Vente,100000,,,CHE DE CANTELOUP,0080,31670,31254,Labège,31,,,31254000AO0427,,,,,,,,,,,,,0,,,,,S,sols,,,143,1.538157,43.539656
2021-474760,2021-08-05,000002,Vente,100000,,,CHE DE CANTELOUP,0080,31670,31254,Labège,31,,,31254000AO0428,,,,,,,,,,,,,0,,,,,S,sols,,,9,1.537904,43.539343
2021-474760,2021-08-05,000002,Vente,100000,,,CHE DE CANTELOUP,0080,31670,31254,Labège,31,,,31254000AO0429,,,,,,,,,,,,,0,,,,,S,sols,,,33,1.537808,43.539218
2021-474760,2021-08-05,000002,Vente,100000,,,CHE DE CANTELOUP,0080,31670,31254,Labège,31,,,31254000AO0430,,,,,,,,,,,,,0,,,,,S,sols,,,9,1.537715,43.539107
2021-474760,2021-08-05,000002,Vente,100000,,,CHE DE CANTELOUP,0080,31670,31254,Labège,31,,,31254000AO0431,,,,,,,,,,,,,0,,,,,S,sols,,,46,1.537619,43.538996
2021-475341,2021-08-05,000001,Vente,246347,16,,CHE DE LA FONTAINE ST SERNIN,0190,31670,31254,Labège,31,,,31254000AT0099,,,2,,8,,9,,,,,,3,2,Appartement,74,4,,,,,,1.539968,43.531806
2021-475341,2021-08-05,000001,Vente,246347,16,,CHE DE LA FONTAINE ST SERNIN,0190,31670,31254,Labège,31,,,31254000AT0099,,,2,,8,,9,,,,,,3,3,Dépendance,,0,,,,,,1.539968,43.531806
2021-475341,2021-08-05,000001,Vente,246347,16,,CHE DE LA FONTAINE ST SERNIN,0190,31670,31254,Labège,31,,,31254000AT0099,,,2,,8,,9,,,,,,3,3,Dépendance,,0,,,,,,1.539968,43.531806
2021-475366,2021-08-26,000001,Vente,305000,102,,ALL DU LAC,0226,31670,31254,Labège,31,,,31254000BC0025,,,47,,48,,49,,50,,51,,9,4,Local industriel. commercial ou assimilé,177,0,,,,,,1.5165,43.535599
2021-475551,2021-08-30,000001,Vente,376454.7,25,B,RUE DES TROUBADOURS,0430,31670,31254,Labège,31,,,31254000BB0030,,,4,97.86,,,,,,,,,1,1,Maison,97,4,,,,,,1.523361,43.529484
2021-475865,2021-08-24,000001,Vente,359000,4,,RUE FLOREAL,0180,31670,31254,Labège,31,,,31254000AV0067,,,,,,,,,,,,,0,3,Dépendance,,0,S,sols,,,937,1.533311,43.526211
2021-475865,2021-08-24,000001,Vente,359000,4,,RUE FLOREAL,0180,31670,31254,Labège,31,,,31254000AV0067,,,,,,,,,,,,,0,3,Dépendance,,0,S,sols,,,937,1.533311,43.526211
2021-475865,2021-08-24,000001,Vente,359000,4,,RUE FLOREAL,0180,31670,31254,Labège,31,,,31254000AV0067,,,,,,,,,,,,,0,1,Maison,92,5,S,sols,,,937,1.533311,43.526211
2021-475962,2021-08-30,000001,Vente,384000,9,,ALL DES FRENES,0202,31670,31254,Labège,31,,,31254000AO0348,,,,,,,,,,,,,0,1,Maison,88,5,S,sols,,,503,1.532574,43.540299
2021-475962,2021-08-30,000001,Vente,384000,9,,ALL DES FRENES,0202,31670,31254,Labège,31,,,31254000AO0348,,,,,,,,,,,,,0,3,Dépendance,,0,S,sols,,,503,1.532574,43.540299
2021-477720,2021-09-02,000001,Vente,340000,227,,RUE PIERRE GILLES DE GENNES,0343,31670,31254,Labège,31,,,31254000BE0099,,,21,122.8,,,,,,,,,1,4,Local industriel. commercial ou assimilé,124,0,,,,,,1.513752,43.540303
2021-477875,2021-09-30,000001,Vente,405000,12,,RUE BERNARD DARD,0045,31670,31254,Labège,31,,,31254000AW0073,,,,,,,,,,,,,0,1,Maison,116,6,S,sols,,,283,1.531537,43.528739
2021-477875,2021-09-30,000001,Vente,405000,12,,RUE BERNARD DARD,0045,31670,31254,Labège,31,,,31254000AW0073,,,,,,,,,,,,,0,3,Dépendance,,0,S,sols,,,283,1.531537,43.528739
2021-478071,2021-10-01,000001,Vente,240000,2,,RUE DES CONSULS,0131,31670,31254,Labège,31,,,31254000AW0375,,,,,,,,,,,,,0,1,Maison,112,4,S,sols,,,291,1.530202,43.528138
2021-479250,2021-10-01,000001,Vente,310000,5,,RUE BERNARD DARD,0045,31670,31254,Labège,31,,,31254000AW0065,,,,,,,,,,,,,0,1,Maison,99,4,S,sols,,,251,1.532103,43.528643
2021-479250,2021-10-01,000001,Vente,310000,5,,RUE BERNARD DARD,0045,31670,31254,Labège,31,,,31254000AW0065,,,,,,,,,,,,,0,3,Dépendance,,0,S,sols,,,251,1.532103,43.528643
2021-479653,2021-10-06,000001,Vente,50000,5,,AV DES CATHARES,0095,31670,31254,Labège,31,,,31254000AW0093,,,,,,,,,,,,,0,,,,,S,sols,,,158,1.530351,43.528881
2021-479666,2021-09-28,000001,Vente,223450,15,,AV GEORGES BRASSENS,0205,31670,31254,Labège,31,,,31254000AS0034,,,151,,167,,168,,,,,,3,3,Dépendance,,0,,,,,,1.537329,43.534903
2021-479666,2021-09-28,000001,Vente,223450,15,,AV GEORGES BRASSENS,0205,31670,31254,Labège,31,,,31254000AS0034,,,151,,167,,168,,,,,,3,2,Appartement,84,3,,,,,,1.537329,43.534903
2021-479666,2021-09-28,000001,Vente,223450,15,,AV GEORGES BRASSENS,0205,31670,31254,Labège,31,,,31254000AS0034,,,151,,167,,168,,,,,,3,3,Dépendance,,0,,,,,,1.537329,43.534903
2021-480077,2021-10-08,000002,Vente,503500,8,,RUE DE L ANCIEN CHATEAU,0010,31670,31254,Labège,31,,,31254000AV0171,,,,,,,,,,,,,0,,,,,S,sols,,,33,1.529799,43.527826
2021-480077,2021-10-08,000002,Vente,503500,12,,RUE DE L ANCIEN CHATEAU,0010,31670,31254,Labège,31,,,31254000AV0185,,,,,,,,,,,,,0,3,Dépendance,,0,AG,terrains d'agrément,PARC,Parc,500,1.529926,43.52775
2021-480077,2021-10-08,000002,Vente,503500,12,,RUE DE L ANCIEN CHATEAU,0010,31670,31254,Labège,31,,,31254000AV0185,,,,,,,,,,,,,0,1,Maison,157,5,S,sols,,,1000,1.529926,43.52775
2021-480077,2021-10-08,000002,Vente,503500,12,,RUE DE L ANCIEN CHATEAU,0010,31670,31254,Labège,31,,,31254000AV0185,,,,,,,,,,,,,0,3,Dépendance,,0,S,sols,,,1000,1.529926,43.52775
2021-480077,2021-10-08,000002,Vente,503500,12,,RUE DE L ANCIEN CHATEAU,0010,31670,31254,Labège,31,,,31254000AV0185,,,,,,,,,,,,,0,1,Maison,157,5,AG,terrains d'agrément,PARC,Parc,500,1.529926,43.52775
2021-480077,2021-10-08,000002,Vente,503500,,,LE VILLAGE,B030,31670,31254,Labège,31,,,31254000AV0194,,,,,,,,,,,,,0,,,,,AB,terrains a bâtir,,,355,1.529865,43.527552
2021-480077,2021-10-08,000002,Vente,503500,,,LE VILLAGE,B030,31670,31254,Labège,31,,,31254000AV0196,,,,,,,,,,,,,0,,,,,AB,terrains a bâtir,,,191,1.529591,43.527674
2021-480311,2021-10-22,000001,Vente,391930,12,,CHE DES ROMAINS,0360,31670,31254,Labège,31,,,31254000AT0008,,,,,,,,,,,,,0,1,Maison,95,5,S,sols,,,973,1.538158,43.528732
2021-480548,2021-10-15,000001,Vente,175750,23,,CHE DU GARIPUY,0206,31670,31254,Labège,31,,,31254000AO0270,,,1,,33,,76,,,,,,3,3,Dépendance,,0,,,,,,1.534834,43.537083
2021-480548,2021-10-15,000001,Vente,175750,23,,CHE DU GARIPUY,0206,31670,31254,Labège,31,,,31254000AO0270,,,1,,33,,76,,,,,,3,2,Appartement,56,3,,,,,,1.534834,43.537083
2021-480982,2021-10-13,000001,Vente,135000,130,,RUE GALILEE,0203,31670,31254,Labège,31,,,31254000BK0039,,,16028,,16029,,16070,,16085,83.05,16086,,6,4,Local industriel. commercial ou assimilé,72,0,,,,,,1.504137,43.549663
2021-481725,2021-10-07,000002,Vente,500000,21,,CHE DES ROMAINS,0360,31670,31254,Labège,31,,,31254000AT0310,,,,,,,,,,,,,0,1,Maison,135,6,,,,,,1.538276,43.529609
2021-481791,2021-10-27,000002,Vente,120000,,,LES PRES,B022,31670,31254,Labège,31,,,31254000AY0034,,,,,,,,,,,,,0,,,,,P,prés,,,711,1.525833,43.528441
2021-481819,2021-11-10,000001,Vente,425000,13,,RUE DE L ANCIEN CHATEAU,0010,31670,31254,Labège,31,,,31254000AW0107,,,,,,,,,,,,,0,1,Maison,131,3,S,sols,,,695,1.530599,43.527612
2021-481942,2021-10-22,000001,Vente,359500,10,,CHE DES CAMPELS,0078,31670,31254,Labège,31,,,31254000AO0415,,,,,,,,,,,,,0,1,Maison,83,3,S,sols,,,747,1.534043,43.539207
2021-482082,2021-11-18,000001,Vente,75000,190,,RUE JEAN ROSTAND,0227,31670,31254,Labège,31,,,31254000AE0135,,,137,26.16,,,,,,,,,1,4,Local industriel. commercial ou assimilé,27,0,,,,,,1.512415,43.542533
2021-482464,2021-11-26,000001,Vente,205000,130,,RUE GALILEE,0203,31670,31254,Labège,31,,,31254000BK0039,,,16020,,16021,,16022,,16023,,16093,,5,4,Local industriel. commercial ou assimilé,129,0,,,,,,1.504137,43.549663
2021-482572,2021-11-08,000001,Vente,166272.64,227,,RUE PIERRE GILLES DE GENNES,0343,31670,31254,Labège,31,,,31254000BE0099,,,26,340.51,,,,,,,,,1,4,Local industriel. commercial ou assimilé,224,0,,,,,,1.513752,43.540303
2021-482722,2021-11-16,000001,Vente,546280,20,,CHE DE CANTELOUP,0080,31670,31254,Labège,31,,,31254000AO0239,,,,,,,,,,,,,0,1,Maison,138,6,S,sols,,,500,1.534447,43.540757