id_mutation,date_mutation,numero_disposition,nature_mutation,valeur_fonciere,adresse_numero,adresse_suffixe,adresse_nom_voie,adresse_code_voie,code_postal,code_commune,nom_commune,code_departement,ancien_code_commune,ancien_nom_commune,id_parcelle,ancien_id_parcelle,numero_volume,lot1_numero,lot1_surface_carrez,lot2_numero,lot2_surface_carrez,lot3_numero,lot3_surface_carrez,lot4_numero,lot4_surface_carrez,lot5_numero,lot5_surface_carrez,nombre_lots,code_type_local,type_local,surface_reelle_bati,nombre_pieces_principales,code_nature_culture,nature_culture,code_nature_culture_speciale,nature_culture_speciale,surface_terrain,longitude,latitude
2021-462684,2021-01-08,000002,Vente,297480,,,EN CABOS,B013,31540,31329,Maurens,31,,,31329000ZH0031,,,,,,,,,,,,,0,,,,,S,sols,,,171,1.781149,43.46128
2021-462914,2021-02-01,000001,Vente,155000,31,,AS CAILLOUX,B005,31540,31329,Maurens,31,,,31329000ZC0031,,,,,,,,,,,,,0,1,Maison,83,4,S,sols,,,289,1.797758,43.466168
2021-463120,2021-03-05,000001,Vente,328548,,,ENPASCOT,B020,31540,31329,Maurens,31,,,31329000ZI0017,,,,,,,,,,,,,0,,,,,T,terres,,,108053,1.781374,43.462771
2021-463120,2021-03-05,000001,Vente,328548,,,ENPASCOT,B020,31540,31329,Maurens,31,,,31329000ZI0018,,,,,,,,,,,,,0,,,,,T,terres,,,17426,1.778672,43.46401
2021-463828,2021-03-25,000001,Vente,328485,,,BORDE BASSE,B008,31540,31329,Maurens,31,,,31329000ZL0015,,,,,,,,,,,,,0,,,,,P,prés,,,6881,1.800951,43.469774
2021-463828,2021-03-25,000001,Vente,328485,,,BORDE BASSE,B008,31540,31329,Maurens,31,,,31329000ZL0029,,,,,,,,,,,,,0,,,,,T,terres,,,413,1.799455,43.470755
2021-463828,2021-03-25,000001,Vente,328485,2,,IMP DE BORDE BASSE,0022,31540,31329,Maurens,31,,,31329000ZL0030,,,,,,,,,,,,,0,3,Dépendance,,0,S,sols,,,3500,1.800302,43.470465
2021-463828,2021-03-25,000001,Vente,328485,2,,IMP DE BORDE BASSE,0022,31540,31329,Maurens,31,,,31329000ZL0030,,,,,,,,,,,,,0,1,Maison,160,4,S,sols,,,3500,1.800302,43.470465
2021-463828,2021-03-25,000001,Vente,328485,2,,IMP DE BORDE BASSE,0022,31540,31329,Maurens,31,,,31329000ZL0030,,,,,,,,,,,,,0,1,Maison,160,4,P,prés,,,7340,1.800302,43.470465
2021-463828,2021-03-25,000001,Vente,328485,2,,IMP DE BORDE BASSE,0022,31540,31329,Maurens,31,,,31329000ZL0030,,,,,,,,,,,,,0,3,Dépendance,,0,P,prés,,,7340,1.800302,43.470465
2021-464986,2021-04-18,000001,Vente,69000,,,EN CABOS,B013,31540,31329,Maurens,31,,,31329000ZH0034,,,,,,,,,,,,,0,,,,,T,terres,,,8326,1.779206,43.462166
2021-464986,2021-04-18,000001,Vente,69000,,,EN CABOS,B013,31540,31329,Maurens,31,,,31329000ZH0034,,,,,,,,,,,,,0,,,,,T,terres,,,8326,1.779206,43.462166
2021-464986,2021-04-18,000001,Vente,69000,,,EN CABOS,B013,31540,31329,Maurens,31,,,31329000ZH0034,,,,,,,,,,,,,0,,,,,T,terres,,,8326,1.779206,43.462166
2021-464986,2021-04-18,000001,Vente,69000,,,EN CABOS,B013,31540,31329,Maurens,31,,,31329000ZH0035,,,,,,,,,,,,,0,,,,,T,terres,,,14477,1.778341,43.459899
2021-464986,2021-04-18,000001,Vente,69000,,,EN CABOS,B013,31540,31329,Maurens,31,,,31329000ZH0036,,,,,,,,,,,,,0,,,,,T,terres,,,36778,1.782633,43.457052
2021-465148,2021-04-09,000001,Vente,200000,45,,BORDO NAOUTO,B011,31540,31329,Maurens,31,,,31329000ZI0008,,,,,,,,,,,,,0,1,Maison,110,3,S,sols,,,3116,1.790359,43.462768
2021-465148,2021-04-09,000001,Vente,200000,45,,BORDO NAOUTO,B011,31540,31329,Maurens,31,,,31329000ZI0008,,,,,,,,,,,,,0,1,Maison,110,3,T,terres,,,4684,1.790359,43.462768
2021-467219,2021-05-05,000001,Vente,97000,22,,VILLAGE,B042,31540,31329,Maurens,31,,,31329000ZK0016,,,,,,,,,,,,,0,1,Maison,82,2,S,sols,,,101,1.795067,43.465568
2021-467885,2021-05-12,000001,Vente,188000,23,,VILLAGE,B042,31540,31329,Maurens,31,,,31329000ZK0014,,,,,,,,,,,,,0,1,Maison,68,4,S,sols,,,328,1.795195,43.465453
2021-469594,2021-06-03,000001,Vente,23500,,,BORDO NAOUTO,B011,31540,31329,Maurens,31,,,31329000ZI0007,,,,,,,,,,,,,0,,,,,S,sols,,,1434,1.79142,43.46329
2021-472094,2021-06-29,000001,Vente,70000,,,VILLAGE,B042,31540,31329,Maurens,31,,,31329000ZK0019,,,,,,,,,,,,,0,,,,,S,sols,,,32,1.794837,43.465674
2021-472094,2021-06-29,000001,Vente,70000,1,,RUE ETROITE,0049,31540,31329,Maurens,31,,,31329000ZK0020,,,,,,,,,,,,,0,1,Maison,80,3,S,sols,,,30,1.794802,43.465633
2021-472094,2021-06-29,000001,Vente,70000,,,ALCAZAL,B003,31540,31329,Maurens,31,,,31329000ZK0034,,,,,,,,,,,,,0,,,,,J,jardins,,,79,1.794023,43.464898
