id_mutation,date_mutation,numero_disposition,nature_mutation,valeur_fonciere,adresse_numero,adresse_suffixe,adresse_nom_voie,adresse_code_voie,code_postal,code_commune,nom_commune,code_departement,ancien_code_commune,ancien_nom_commune,id_parcelle,ancien_id_parcelle,numero_volume,lot1_numero,lot1_surface_carrez,lot2_numero,lot2_surface_carrez,lot3_numero,lot3_surface_carrez,lot4_numero,lot4_surface_carrez,lot5_numero,lot5_surface_carrez,nombre_lots,code_type_local,type_local,surface_reelle_bati,nombre_pieces_principales,code_nature_culture,nature_culture,code_nature_culture_speciale,nature_culture_speciale,surface_terrain,longitude,latitude
2021-492348,2021-11-08,000001,Vente,5000,,,BORDE NEUVE,B005,31360,31504,Saint-Médard,31,,,31504000ZC0045,,,,,,,,,,,,,0,,,,,BT,taillis simples,,,278,0.832728,43.129008
2021-492348,2021-11-08,000001,Vente,5000,,,BORDE NEUVE,B005,31360,31504,Saint-Médard,31,,,31504000ZC0045,,,,,,,,,,,,,0,,,,,P,prés,,,3614,0.832728,43.129008
2021-493287,2021-12-02,000002,Vente,157500,,,MARTIS NORD,B017,31360,31504,Saint-Médard,31,,,31504000AC0005,,,,,,,,,,,,,0,,,,,AG,terrains d'agrément,,,54,0.838946,43.127246
2021-493287,2021-12-02,000002,Vente,157500,30,,CHEM DU HAUT,0020,31360,31504,Saint-Médard,31,,,31504000AC0006,,,,,,,,,,,,,0,3,Dépendance,,0,S,sols,,,811,0.839142,43.127242
2021-493287,2021-12-02,000002,Vente,157500,30,,CHEM DU HAUT,0020,31360,31504,Saint-Médard,31,,,31504000AC0006,,,,,,,,,,,,,0,1,Maison,110,5,S,sols,,,811,0.839142,43.127242
2021-493287,2021-12-02,000002,Vente,157500,,,MARTIS NORD,B017,31360,31504,Saint-Médard,31,,,31504000ZC0030,,,,,,,,,,,,,0,,,,,BT,taillis simples,,,587,0.839155,43.127792
2021-493287,2021-12-02,000002,Vente,157500,,,MARTIS NORD,B017,31360,31504,Saint-Médard,31,,,31504000ZC0030,,,,,,,,,,,,,0,,,,,L,landes,,,2716,0.839155,43.127792
2021-494048,2021-12-29,000001,Vente,2700,,,LES ROUSSEAUX,B024,31360,31504,Saint-Médard,31,,,315040000A0241,,,,,,,,,,,,,0,,,,,BT,taillis simples,,,1934,0.804393,43.135976
2021-494048,2021-12-29,000001,Vente,2700,,,LES ROUSSEAUX,B024,31360,31504,Saint-Médard,31,,,315040000A0244,,,,,,,,,,,,,0,,,,,BT,taillis simples,,,4538,0.804771,43.136557
2021-495148,2021-05-10,000001,Vente,177250,26,,CHEM DU HAUT,0020,31360,31504,Saint-Médard,31,,,31504000AC0008,,,,,,,,,,,,,0,1,Maison,93,4,AG,terrains d'agrément,,,819,0.840601,43.12711
2021-495148,2021-05-10,000001,Vente,177250,26,,CHEM DU HAUT,0020,31360,31504,Saint-Médard,31,,,31504000AC0008,,,,,,,,,,,,,0,1,Maison,93,4,S,sols,,,700,0.840601,43.12711
2021-495148,2021-05-10,000001,Vente,177250,,,MARTIS NORD,B017,31360,31504,Saint-Médard,31,,,31504000AC0036,,,,,,,,,,,,,0,,,,,S,sols,,,215,0.840178,43.127038
2021-495693,2021-07-26,000001,Vente,249740,6,,CHEM DES ESCOUDASSES,0041,31360,31504,Saint-Médard,31,,,31504000AA0044,,,,,,,,,,,,,0,3,Dépendance,,0,S,sols,,,1000,0.825407,43.127139
2021-495693,2021-07-26,000001,Vente,249740,6,,CHEM DES ESCOUDASSES,0041,31360,31504,Saint-Médard,31,,,31504000AA0044,,,,,,,,,,,,,0,3,Dépendance,,0,AG,terrains d'agrément,,,2000,0.825407,43.127139
2021-495693,2021-07-26,000001,Vente,249740,6,,CHEM DES ESCOUDASSES,0041,31360,31504,Saint-Médard,31,,,31504000AA0044,,,,,,,,,,,,,0,3,Dépendance,,0,AG,terrains d'agrément,,,2000,0.825407,43.127139
2021-495693,2021-07-26,000001,Vente,249740,6,,CHEM DES ESCOUDASSES,0041,31360,31504,Saint-Médard,31,,,31504000AA0044,,,,,,,,,,,,,0,1,Maison,137,3,P,prés,,,1070,0.825407,43.127139
2021-495693,2021-07-26,000001,Vente,249740,6,,CHEM DES ESCOUDASSES,0041,31360,31504,Saint-Médard,31,,,31504000AA0044,,,,,,,,,,,,,0,3,Dépendance,,0,P,prés,,,1070,0.825407,43.127139
2021-495693,2021-07-26,000001,Vente,249740,6,,CHEM DES ESCOUDASSES,0041,31360,31504,Saint-Médard,31,,,31504000AA0044,,,,,,,,,,,,,0,3,Dépendance,,0,P,prés,,,1070,0.825407,43.127139
2021-495693,2021-07-26,000001,Vente,249740,6,,CHEM DES ESCOUDASSES,0041,31360,31504,Saint-Médard,31,,,31504000AA0044,,,,,,,,,,,,,0,1,Maison,137,3,S,sols,,,1000,0.825407,43.127139
2021-495693,2021-07-26,000001,Vente,249740,6,,CHEM DES ESCOUDASSES,0041,31360,31504,Saint-Médard,31,,,31504000AA0044,,,,,,,,,,,,,0,3,Dépendance,,0,S,sols,,,1000,0.825407,43.127139
2021-495693,2021-07-26,000001,Vente,249740,6,,CHEM DES ESCOUDASSES,0041,31360,31504,Saint-Médard,31,,,31504000AA0044,,,,,,,,,,,,,0,1,Maison,137,3,AG,terrains d'agrément,,,2000,0.825407,43.127139
