id_mutation,date_mutation,numero_disposition,nature_mutation,valeur_fonciere,adresse_numero,adresse_suffixe,adresse_nom_voie,adresse_code_voie,code_postal,code_commune,nom_commune,code_departement,ancien_code_commune,ancien_nom_commune,id_parcelle,ancien_id_parcelle,numero_volume,lot1_numero,lot1_surface_carrez,lot2_numero,lot2_surface_carrez,lot3_numero,lot3_surface_carrez,lot4_numero,lot4_surface_carrez,lot5_numero,lot5_surface_carrez,nombre_lots,code_type_local,type_local,surface_reelle_bati,nombre_pieces_principales,code_nature_culture,nature_culture,code_nature_culture_speciale,nature_culture_speciale,surface_terrain,longitude,latitude
2021-491250,2021-09-08,000001,Vente,120000,74,,RTE MOULIN DES PRATS,0236,31510,31535,Sauveterre-de-Comminges,31,,,315350000I0600,,,,,,,,,,,,,0,1,Maison,77,3,S,sols,,,780,0.680932,43.030967
2021-491250,2021-09-08,000001,Vente,120000,74,,RTE MOULIN DES PRATS,0236,31510,31535,Sauveterre-de-Comminges,31,,,315350000I0600,,,,,,,,,,,,,0,3,Dépendance,,0,S,sols,,,780,0.680932,43.030967
2021-491250,2021-09-08,000001,Vente,120000,74,,RTE MOULIN DES PRATS,0236,31510,31535,Sauveterre-de-Comminges,31,,,315350000I0600,,,,,,,,,,,,,0,3,Dépendance,,0,S,sols,,,780,0.680932,43.030967
2021-491296,2021-09-08,000001,Vente,600,,,POUCH,B193,31510,31535,Sauveterre-de-Comminges,31,,,315350000C0538,,,,,,,,,,,,,0,,,,,BS,taillis sous futaie,,,1860,0.67721,43.024443
2021-491649,2021-09-17,000001,Vente,706.5,,,AD PA,B001,31510,31535,Sauveterre-de-Comminges,31,,,315350000D0316,,,,,,,,,,,,,0,,,,,P,prés,,,1145,0.668407,43.020213
2021-491649,2021-09-17,000001,Vente,706.5,,,AD PA,B001,31510,31535,Sauveterre-de-Comminges,31,,,315350000D0595,,,,,,,,,,,,,0,,,,,P,prés,,,1210,0.668286,43.02014
2021-491650,2021-09-17,000002,Vente,186,,,AD PA,B001,31510,31535,Sauveterre-de-Comminges,31,,,315350000D0314,,,,,,,,,,,,,0,,,,,P,prés,,,620,0.667868,43.020274
2021-491937,2021-10-08,000001,Vente,27000,,,SOUS-VILLAGE,B224,31510,31535,Sauveterre-de-Comminges,31,,,315350000A0692,,,,,,,,,,,,,0,,,,,P,prés,,,1890,0.685935,43.051297
2021-491937,2021-10-08,000001,Vente,27000,,,CERIDE,B043,31510,31535,Sauveterre-de-Comminges,31,,,315350000A0711,,,,,,,,,,,,,0,,,,,P,prés,,,2305,0.689124,43.050247
2021-491937,2021-10-08,000001,Vente,27000,,,PEDAILLO,B172,31510,31535,Sauveterre-de-Comminges,31,,,315350000A1021,,,,,,,,,,,,,0,,,,,P,prés,,,2610,0.690238,43.050055
2021-491937,2021-10-08,000001,Vente,27000,,,PEDAILLO,B172,31510,31535,Sauveterre-de-Comminges,31,,,315350000A1022,,,,,,,,,,,,,0,,,,,T,terres,,,10600,0.691388,43.050142
2021-491937,2021-10-08,000001,Vente,27000,,,CERIDE,B043,31510,31535,Sauveterre-de-Comminges,31,,,315350000A1040,,,,,,,,,,,,,0,,,,,S,sols,,,2320,0.688245,43.049967
2021-491937,2021-10-08,000001,Vente,27000,,,SOUS-VILLAGE,B224,31510,31535,Sauveterre-de-Comminges,31,,,315350000A1049,,,,,,,,,,,,,0,,,,,T,terres,,,11185,0.686369,43.051933
2021-491937,2021-10-08,000001,Vente,27000,,,CERIDE,B043,31510,31535,Sauveterre-de-Comminges,31,,,315350000A1201,,,,,,,,,,,,,0,,,,,T,terres,,,25374,0.687685,43.050461
2021-492198,2021-10-13,000001,Vente,140000,180,,COTE DE LAYRIS,0264,31510,31535,Sauveterre-de-Comminges,31,,,315350000I0917,,,,,,,,,,,,,0,3,Dépendance,,0,S,sols,,,497,0.667248,43.03409
2021-492198,2021-10-13,000001,Vente,140000,180,,COTE DE LAYRIS,0264,31510,31535,Sauveterre-de-Comminges,31,,,315350000I0917,,,,,,,,,,,,,0,1,Maison,160,4,S,sols,,,497,0.667248,43.03409
2021-492198,2021-10-13,000001,Vente,140000,,,HAMEAU DE BRUNCAN,B101,31510,31535,Sauveterre-de-Comminges,31,,,315350000I0918,,,,,,,,,,,,,0,,,,,L,landes,,,1037,0.667385,43.034284
2021-492198,2021-10-13,000001,Vente,140000,,,MARIEBONNE,B148,31510,31535,Sauveterre-de-Comminges,31,,,315350000I0966,,,,,,,,,,,,,0,,,,,L,landes,,,2687,0.667836,43.034736
2021-492461,2021-10-22,000001,Vente,328275,35,,RUE DES GROGNARDS,0295,31510,31535,Sauveterre-de-Comminges,31,,,315350000F0325,,,,,,,,,,,,,0,1,Maison,167,5,S,sols,,,1000,0.657234,43.027504
2021-492461,2021-10-22,000001,Vente,328275,35,,RUE DES GROGNARDS,0295,31510,31535,Sauveterre-de-Comminges,31,,,315350000F0325,,,,,,,,,,,,,0,1,Maison,167,5,P,prés,,,2050,0.657234,43.027504
2021-492907,2021-12-06,000001,Vente,40950,189,,COTE DE LAYRIS,0264,31510,31535,Sauveterre-de-Comminges,31,,,315350000I0922,,,,,,,,,,,,,0,1,Maison,132,4,S,sols,,,525,0.666808,43.034067
2021-492951,2021-11-10,000001,Echange,500,,,RIOUECH,B210,31510,31535,Sauveterre-de-Comminges,31,,,315350000C0090,,,,,,,,,,,,,0,,,,,P,prés,,,2183,0.689386,43.033933
2021-492951,2021-11-10,000002,Echange,500,249,,RTE DE GOUERDES,0272,31510,31535,Sauveterre-de-Comminges,31,,,315350000I0513,,,,,,,,,,,,,0,,,,,P,prés,,,1305,0.690222,43.034814
2021-493000,2021-12-06,000001,Vente,120000,189,,COTE DE LAYRIS,0264,31510,31535,Sauveterre-de-Comminges,31,,,315350000I0922,,,,,,,,,,,,,0,1,Maison,132,4,S,sols,,,525,0.666808,43.034067
2021-493288,2021-12-04,000001,Vente,99000,2,,PL DU BEDIAOU,0292,31510,31535,Sauveterre-de-Comminges,31,,,315350000C0120,,,,,,,,,,,,,0,1,Maison,130,5,S,sols,,,252,0.691599,43.032223
2021-493288,2021-12-04,000001,Vente,99000,2,,PL DU BEDIAOU,0292,31510,31535,Sauveterre-de-Comminges,31,,,315350000C0120,,,,,,,,,,,,,0,3,Dépendance,,0,S,sols,,,252,0.691599,43.032223
2021-493288,2021-12-04,000001,Vente,99000,,,HAMEAU D ILHAN,B098,31510,31535,Sauveterre-de-Comminges,31,,,315350000C0666,,,,,,,,,,,,,0,,,,,S,sols,,,36,0.691698,43.032308
2021-493288,2021-12-04,000001,Vente,99000,25,,CAR CARRERE MIQUEOU,0291,31510,31535,Sauveterre-de-Comminges,31,,,315350000C0667,,,,,,,,,,,,,0,,,,,S,sols,,,104,0.691811,43.032274
2021-493345,2021-11-27,000001,Vente,17500,,,MOLE DE MARIE,B151,31510,31535,Sauveterre-de-Comminges,31,,,315350000C0549,,,,,,,,,,,,,0,,,,,T,terres,,,2320,0.676468,43.028089
2021-493345,2021-11-27,000001,Vente,17500,,,MOLE DE MARIE,B151,31510,31535,Sauveterre-de-Comminges,31,,,315350000C0550,,,,,,,,,,,,,0,,,,,L,landes,,,2695,0.676893,43.028029
2021-493345,2021-11-27,000001,Vente,17500,,,MOLE DE MARIE,B151,31510,31535,Sauveterre-de-Comminges,31,,,315350000C0551,,,,,,,,,,,,,0,,,,,BS,taillis sous futaie,,,9125,0.67734,43.027854
2021-493345,2021-11-27,000001,Vente,17500,,,POUILLEUX,B194,31510,31535,Sauveterre-de-Comminges,31,,,315350000D0376,,,,,,,,,,,,,0,,,,,T,terres,,,2085,0.673376,43.027679
2021-493345,2021-11-27,000001,Vente,17500,,,POUILLEUX,B194,31510,31535,Sauveterre-de-Comminges,31,,,315350000D0378,,,,,,,,,,,,,0,,,,,P,prés,,,1155,0.672784,43.027472
2021-493345,2021-11-27,000001,Vente,17500,,,POUILLEUX,B194,31510,31535,Sauveterre-de-Comminges,31,,,315350000D0379,,,,,,,,,,,,,0,,,,,T,terres,,,3200,0.673386,43.027366
2021-493345,2021-11-27,000001,Vente,17500,,,POUILLEUX,B194,31510,31535,Sauveterre-de-Comminges,31,,,315350000D0397,,,,,,,,,,,,,0,,,,,T,terres,,,5705,0.675127,43.028065
2021-493345,2021-11-27,000001,Vente,17500,,,POUILLEUX,B194,31510,31535,Sauveterre-de-Comminges,31,,,315350000D0398,,,,,,,,,,,,,0,,,,,P,prés,,,5460,0.675843,43.027724
2021-493360,2021-11-29,000001,Vente,126400,781,,CHEM DE LA POTENCE,0290,31510,31535,Sauveterre-de-Comminges,31,,,315350000C0180,,,,,,,,,,,,,0,3,Dépendance,,0,S,sols,,,248,0.694222,43.034125
2021-493360,2021-11-29,000001,Vente,126400,781,,CHEM DE LA POTENCE,0290,31510,31535,Sauveterre-de-Comminges,31,,,315350000C0180,,,,,,,,,,,,,0,1,Maison,65,1,S,sols,,,248,0.694222,43.034125
2021-493377,2021-12-07,000001,Vente,145000,300,,RTE DE PAYSSAS,0301,31510,31535,Sauveterre-de-Comminges,31,,,315350000A0701,,,,,,,,,,,,,0,1,Maison,110,4,S,sols,,,1420,0.687475,43.052831
2021-493377,2021-12-07,000001,Vente,145000,300,,RTE DE PAYSSAS,0301,31510,31535,Sauveterre-de-Comminges,31,,,315350000A0701,,,,,,,,,,,,,0,3,Dépendance,,0,S,sols,,,1420,0.687475,43.052831
2021-493694,2021-12-17,000001,Vente,250,,,RAPANAS,B208,31510,31535,Sauveterre-de-Comminges,31,,,315350000G0458,,,,,,,,,,,,,0,,,,,BS,taillis sous futaie,,,2410,0.64855,43.038521
2021-493694,2021-12-17,000001,Vente,250,,,SABANOS,B215,31510,31535,Sauveterre-de-Comminges,31,,,315350000H0293,,,,,,,,,,,,,0,,,,,L,landes,,,2093,0.667139,43.050064
2021-493695,2021-12-17,000002,Vente,169750,,,ROUZES,B212,31510,31535,Sauveterre-de-Comminges,31,,,315350000A0002,,,,,,,,,,,,,0,,,,,P,prés,,,1935,0.680043,43.067206
2021-493695,2021-12-17,000002,Vente,169750,,,HOUCH,B112,31510,31535,Sauveterre-de-Comminges,31,,,315350000A0755,,,,,,,,,,,,,0,,,,,P,prés,,,1230,0.67771,43.048985
2021-493695,2021-12-17,000002,Vente,169750,,,HOUCH,B112,31510,31535,Sauveterre-de-Comminges,31,,,315350000A0756,,,,,,,,,,,,,0,,,,,P,prés,,,2640,0.67755,43.048757
2021-493695,2021-12-17,000002,Vente,169750,,,HOUCH,B112,31510,31535,Sauveterre-de-Comminges,31,,,315350000A0764,,,,,,,,,,,,,0,,,,,P,prés,,,1520,0.674418,43.047949
2021-493695,2021-12-17,000002,Vente,169750,,,HOUCH,B112,31510,31535,Sauveterre-de-Comminges,31,,,315350000A0771,,,,,,,,,,,,,0,,,,,P,prés,,,3420,0.672593,43.047897
2021-493695,2021-12-17,000002,Vente,169750,,,HOUCH,B112,31510,31535,Sauveterre-de-Comminges,31,,,315350000A0772,,,,,,,,,,,,,0,,,,,P,prés,,,3290,0.673094,43.047184
2021-493695,2021-12-17,000002,Vente,169750,262,,CHEM RURAL 75,0275,31510,31535,Sauveterre-de-Comminges,31,,,315350000A0774,,,,,,,,,,,,,0,4,Local industriel. commercial ou assimilé,600,0,P,prés,,,4160,0.672259,43.046717
2021-493695,2021-12-17,000002,Vente,169750,262,,CHEM RURAL 75,0275,31510,31535,Sauveterre-de-Comminges,31,,,315350000A0774,,,,,,,,,,,,,0,4,Local industriel. commercial ou assimilé,600,0,S,sols,,,1000,0.672259,43.046717
2021-493695,2021-12-17,000002,Vente,169750,,,LAS BOURIES,B125,31510,31535,Sauveterre-de-Comminges,31,,,315350000A0779,,,,,,,,,,,,,0,,,,,P,prés,,,8790,0.671384,43.047439
2021-493695,2021-12-17,000002,Vente,169750,,,RAPANAS,B208,31510,31535,Sauveterre-de-Comminges,31,,,315350000G0609,,,,,,,,,,,,,0,,,,,P,prés,,,1830,0.648178,43.03897
2021-493695,2021-12-17,000002,Vente,169750,,,COUMAROTE,B063,31510,31535,Sauveterre-de-Comminges,31,,,315350000G0617,,,,,,,,,,,,,0,,,,,P,prés,,,12026,0.6482,43.040346
2021-493695,2021-12-17,000002,Vente,169750,,,RUS,B214,31510,31535,Sauveterre-de-Comminges,31,,,315350000H0194,,,,,,,,,,,,,0,,,,,P,prés,,,1855,0.671402,43.049812
2021-493695,2021-12-17,000002,Vente,169750,,,RUS,B214,31510,31535,Sauveterre-de-Comminges,31,,,315350000H0195,,,,,,,,,,,,,0,,,,,T,terres,,,1488,0.670987,43.049655
2021-493695,2021-12-17,000002,Vente,169750,,,RUS,B214,31510,31535,Sauveterre-de-Comminges,31,,,315350000H0196,,,,,,,,,,,,,0,,,,,T,terres,,,2822,0.670882,43.05019
2021-493695,2021-12-17,000002,Vente,169750,,,RUS,B214,31510,31535,Sauveterre-de-Comminges,31,,,315350000H0197,,,,,,,,,,,,,0,,,,,T,terres,,,6248,0.67038,43.049702
2021-493695,2021-12-17,000002,Vente,169750,,,RUS,B214,31510,31535,Sauveterre-de-Comminges,31,,,315350000H0201,,,,,,,,,,,,,0,,,,,T,terres,,,5345,0.669854,43.049604
2021-493695,2021-12-17,000002,Vente,169750,,,RUS,B214,31510,31535,Sauveterre-de-Comminges,31,,,315350000H0211,,,,,,,,,,,,,0,,,,,L,landes,,,4338,0.668857,43.048337
2021-493695,2021-12-17,000002,Vente,169750,,,SABANOS,B215,31510,31535,Sauveterre-de-Comminges,31,,,315350000H0294,,,,,,,,,,,,,0,,,,,L,landes,,,1070,0.666762,43.049791
2021-493695,2021-12-17,000002,Vente,169750,,,SABANOS,B215,31510,31535,Sauveterre-de-Comminges,31,,,315350000H0298,,,,,,,,,,,,,0,,,,,L,landes,,,1268,0.666975,43.049583
2021-493695,2021-12-17,000002,Vente,169750,,,SABANOS,B215,31510,31535,Sauveterre-de-Comminges,31,,,315350000H0299,,,,,,,,,,,,,0,,,,,L,landes,,,8330,0.666689,43.049132
2021-493695,2021-12-17,000002,Vente,169750,,,SABANOS,B215,31510,31535,Sauveterre-de-Comminges,31,,,315350000H0307,,,,,,,,,,,,,0,,,,,T,terres,,,2998,0.666546,43.047212
2021-493695,2021-12-17,000002,Vente,169750,,,SABANOS,B215,31510,31535,Sauveterre-de-Comminges,31,,,315350000H0311,,,,,,,,,,,,,0,,,,,P,prés,,,1725,0.666633,43.047902
2021-493695,2021-12-17,000002,Vente,169750,,,SABANOS,B215,31510,31535,Sauveterre-de-Comminges,31,,,315350000H0316,,,,,,,,,,,,,0,,,,,T,terres,,,3333,0.665738,43.049224
2021-493695,2021-12-17,000002,Vente,169750,,,SABANOS,B215,31510,31535,Sauveterre-de-Comminges,31,,,315350000H0318,,,,,,,,,,,,,0,,,,,L,landes,,,3508,0.665456,43.048375
2021-493695,2021-12-17,000002,Vente,169750,,,SABANOS,B215,31510,31535,Sauveterre-de-Comminges,31,,,315350000H0320,,,,,,,,,,,,,0,,,,,L,landes,,,2162,0.664803,43.048123
2021-493695,2021-12-17,000002,Vente,169750,,,SABANOS,B215,31510,31535,Sauveterre-de-Comminges,31,,,315350000H0321,,,,,,,,,,,,,0,,,,,L,landes,,,2415,0.664965,43.047822
2021-493695,2021-12-17,000002,Vente,169750,,,PEYRIN,B179,31510,31535,Sauveterre-de-Comminges,31,,,315350000I0016,,,,,,,,,,,,,0,,,,,P,prés,,,4630,0.673458,43.045855
2021-493695,2021-12-17,000002,Vente,169750,,,GOUTAS,B091,31510,31535,Sauveterre-de-Comminges,31,,,315350000I0410,,,,,,,,,,,,,0,,,,,VE,vergers,CHAT,Châtaigneraie,1398,0.679825,43.036407
2021-493833,2021-12-22,000001,Vente,30000,115,,HAMEAU DE GESSET,B104,31510,31535,Sauveterre-de-Comminges,31,,,315350000C0505,,,,,,,,,,,,,0,1,Maison,33,1,S,sols,,,410,0.680166,43.021635
2021-493833,2021-12-22,000001,Vente,30000,,,POUCH,B193,31510,31535,Sauveterre-de-Comminges,31,,,315350000C0516,,,,,,,,,,,,,0,,,,,L,landes,,,1565,0.680263,43.022912
2021-493833,2021-12-22,000001,Vente,30000,,,POUCH,B193,31510,31535,Sauveterre-de-Comminges,31,,,315350000C0517,,,,,,,,,,,,,0,,,,,BS,taillis sous futaie,,,1195,0.679953,43.023055
2021-494320,2021-02-09,000001,Vente,277550,35,,RUE DES GROGNARDS,0295,31510,31535,Sauveterre-de-Comminges,31,,,315350000F0325,,,,,,,,,,,,,0,1,Maison,167,5,S,sols,,,1000,0.657234,43.027504
2021-494320,2021-02-09,000001,Vente,277550,35,,RUE DES GROGNARDS,0295,31510,31535,Sauveterre-de-Comminges,31,,,315350000F0325,,,,,,,,,,,,,0,1,Maison,167,5,P,prés,,,2050,0.657234,43.027504
2021-494333,2021-01-26,000001,Vente,3000,,,MONT SAINT-PE,B154,31510,31535,Sauveterre-de-Comminges,31,,,315350000A0091,,,,,,,,,,,,,0,,,,,P,prés,,,3230,0.690232,43.063511
2021-494333,2021-01-26,000001,Vente,3000,,,CIEPTS,B047,31510,31535,Sauveterre-de-Comminges,31,,,315350000A0203,,,,,,,,,,,,,0,,,,,P,prés,,,6030,0.691111,43.064256
2021-494333,2021-01-26,000001,Vente,3000,,,CIEPTS,B047,31510,31535,Sauveterre-de-Comminges,31,,,315350000A0204,,,,,,,,,,,,,0,,,,,BS,taillis sous futaie,,,8400,0.691681,43.064406
2021-494334,2021-01-23,000001,Vente,25500,129,,HEYRECH,B109,31510,31535,Sauveterre-de-Comminges,31,,,315350000D0589,,,,,,,,,,,,,0,3,Dépendance,,0,P,prés,,,1156,0.677586,43.02002
2021-494334,2021-01-23,000001,Vente,25500,129,,HEYRECH,B109,31510,31535,Sauveterre-de-Comminges,31,,,315350000D0589,,,,,,,,,,,,,0,3,Dépendance,,0,S,sols,,,319,0.677586,43.02002
2021-494403,2021-02-05,000001,Vente,1900,,,BOUSSENS,B027,31510,31535,Sauveterre-de-Comminges,31,,,315350000A0995,,,,,,,,,,,,,0,,,,,P,prés,,,6535,0.697242,43.043501
2021-494468,2021-02-06,000001,Vente,13000,,,POUJAU,B195,31510,31535,Sauveterre-de-Comminges,31,,,315350000D0298,,,,,,,,,,,,,0,,,,,P,prés,,,825,0.665909,43.018691
2021-494468,2021-02-06,000001,Vente,13000,,,POUJAU,B195,31510,31535,Sauveterre-de-Comminges,31,,,315350000D0298,,,,,,,,,,,,,0,,,,,S,sols,,,250,0.665909,43.018691
2021-494468,2021-02-06,000001,Vente,13000,,,POUJAU,B195,31510,31535,Sauveterre-de-Comminges,31,,,315350000D0299,,,,,,,,,,,,,0,,,,,S,sols,,,250,0.666418,43.018709
2021-494468,2021-02-06,000001,Vente,13000,,,POUJAU,B195,31510,31535,Sauveterre-de-Comminges,31,,,315350000D0299,,,,,,,,,,,,,0,,,,,P,prés,,,1160,0.666418,43.018709
2021-494485,2021-02-12,000001,Vente,26000,,,ARTIGUES,B006,31510,31535,Sauveterre-de-Comminges,31,,,315350000C0397,,,,,,,,,,,,,0,,,,,P,prés,,,1855,0.678993,43.020385
2021-494485,2021-02-12,000001,Vente,26000,,,HAMEAU DE GESSET,B104,31510,31535,Sauveterre-de-Comminges,31,,,315350000C0492,,,,,,,,,,,,,0,,,,,P,prés,,,330,0.679265,43.020822
2021-494656,2021-03-02,000001,Echange,600,,,CAMON,B030,31510,31535,Sauveterre-de-Comminges,31,,,315350000D0448,,,,,,,,,,,,,0,,,,,P,prés,,,230,0.676816,43.022489
2021-494656,2021-03-02,000001,Echange,600,,,BARRASSEN DESSUS,B011,31510,31535,Sauveterre-de-Comminges,31,,,315350000I0818,,,,,,,,,,,,,0,,,,,T,terres,,,1280,0.674634,43.030142
2021-494656,2021-03-02,000002,Echange,600,,,POUILLEUX,B194,31510,31535,Sauveterre-de-Comminges,31,,,315350000D0394,,,,,,,,,,,,,0,,,,,P,prés,,,815,0.674749,43.02792
2021-494656,2021-03-02,000002,Echange,600,,,POUILLEUX,B194,31510,31535,Sauveterre-de-Comminges,31,,,315350000D0396,,,,,,,,,,,,,0,,,,,P,prés,,,1095,0.674908,43.028166
2021-494674,2021-03-19,000001,Vente,1500,,,ARRIVES,B003,31510,31535,Sauveterre-de-Comminges,31,,,315350000C0463,,,,,,,,,,,,,0,,,,,L,landes,,,3350,0.682795,43.021359
2021-494790,2021-03-16,000001,Vente,750,,,DEOUEZE,B077,31510,31535,Sauveterre-de-Comminges,31,,,315350000E0079,,,,,,,,,,,,,0,,,,,BS,taillis sous futaie,,,1130,0.662113,43.021763
2021-494790,2021-03-16,000001,Vente,750,,,LONGUERES,B140,31510,31535,Sauveterre-de-Comminges,31,,,315350000E0480,,,,,,,,,,,,,0,,,,,L,landes,,,440,0.664626,43.01916
2021-495263,2021-06-02,000001,Vente,700,,,ESPIEOUT,B085,31510,31535,Sauveterre-de-Comminges,31,,,315350000I0229,,,,,,,,,,,,,0,,,,,L,landes,,,2608,0.686013,43.040242
2021-495263,2021-06-02,000001,Vente,700,,,ESPIEOUT,B085,31510,31535,Sauveterre-de-Comminges,31,,,315350000I0230,,,,,,,,,,,,,0,,,,,P,prés,,,1767,0.685965,43.039878
2021-495438,2021-06-16,000001,Vente,7000,,,MONT SAINT-PE,B154,31510,31535,Sauveterre-de-Comminges,31,,,315350000A0077,,,,,,,,,,,,,0,,,,,T,terres,,,2950,0.688075,43.063362
2021-495438,2021-06-16,000001,Vente,7000,,,MONT SAINT-PE,B154,31510,31535,Sauveterre-de-Comminges,31,,,315350000A0078,,,,,,,,,,,,,0,,,,,BS,taillis sous futaie,,,2480,0.688003,43.063524
2021-495438,2021-06-16,000001,Vente,7000,,,MONT SAINT-PE,B154,31510,31535,Sauveterre-de-Comminges,31,,,315350000A0096,,,,,,,,,,,,,0,,,,,P,prés,,,3490,0.688717,43.063358
2021-495438,2021-06-16,000001,Vente,7000,,,CASTILLON,B037,31510,31535,Sauveterre-de-Comminges,31,,,315350000A0097,,,,,,,,,,,,,0,,,,,T,terres,,,3930,0.68898,43.062869
2021-495438,2021-06-16,000001,Vente,7000,,,CASTILLON,B037,31510,31535,Sauveterre-de-Comminges,31,,,315350000A0101,,,,,,,,,,,,,0,,,,,T,terres,,,2055,0.688266,43.06201
2021-495438,2021-06-16,000001,Vente,7000,,,CASTILLON,B037,31510,31535,Sauveterre-de-Comminges,31,,,315350000A0102,,,,,,,,,,,,,0,,,,,T,terres,,,4060,0.687748,43.061566
2021-495438,2021-06-16,000001,Vente,7000,,,CASTILLON,B037,31510,31535,Sauveterre-de-Comminges,31,,,315350000A0103,,,,,,,,,,,,,0,,,,,P,prés,,,2250,0.687574,43.061332
2021-495438,2021-06-16,000001,Vente,7000,,,CASTILLON,B037,31510,31535,Sauveterre-de-Comminges,31,,,315350000A0168,,,,,,,,,,,,,0,,,,,BS,taillis sous futaie,,,1100,0.688171,43.061135
2021-495438,2021-06-16,000001,Vente,7000,,,CIEPTS,B047,31510,31535,Sauveterre-de-Comminges,31,,,315350000A0171,,,,,,,,,,,,,0,,,,,P,prés,,,3350,0.688643,43.061614
2021-495438,2021-06-16,000001,Vente,7000,,,CIEPTS,B047,31510,31535,Sauveterre-de-Comminges,31,,,315350000A0172,,,,,,,,,,,,,0,,,,,P,prés,,,2610,0.688673,43.062043
2021-495438,2021-06-16,000001,Vente,7000,,,CIEPTS,B047,31510,31535,Sauveterre-de-Comminges,31,,,315350000A0174,,,,,,,,,,,,,0,,,,,P,prés,,,1725,0.689518,43.061611
2021-495438,2021-06-16,000001,Vente,7000,,,CIEPTS,B047,31510,31535,Sauveterre-de-Comminges,31,,,315350000A0175,,,,,,,,,,,,,0,,,,,BS,taillis sous futaie,,,1430,0.689604,43.061191
2021-495438,2021-06-16,000001,Vente,7000,,,CIEPTS,B047,31510,31535,Sauveterre-de-Comminges,31,,,315350000A0176,,,,,,,,,,,,,0,,,,,BS,taillis sous futaie,,,4270,0.689783,43.060693
2021-495438,2021-06-16,000001,Vente,7000,,,CIEPTS,B047,31510,31535,Sauveterre-de-Comminges,31,,,315350000A0196,,,,,,,,,,,,,0,,,,,T,terres,,,4680,0.692091,43.061614
2021-495438,2021-06-16,000001,Vente,7000,,,MONT SAINT-PE,B154,31510,31535,Sauveterre-de-Comminges,31,,,315350000A1048,,,,,,,,,,,,,0,,,,,BS,taillis sous futaie,,,2495,0.68878,43.063838
2021-495544,2021-07-06,000002,Vente,200000,,,RUE SAINT ROCH,0234,31510,31535,Sauveterre-de-Comminges,31,,,315350000I1214,,,,,,,,,,,,,0,,,,,S,sols,,,89,0.677082,43.037328
2021-495544,2021-07-06,000002,Vente,200000,75,,RUE SAINT ROCH,0234,31510,31535,Sauveterre-de-Comminges,31,,,315350000I1217,,,,,,,,,,,,,0,,,,,S,sols,,,2184,0.6767,43.03748
2021-495545,2021-07-06,000001,Vente,4000,,,GOUTAS,B091,31510,31535,Sauveterre-de-Comminges,31,,,315350000I0412,,,,,,,,,,,,,0,,,,,BF,futaies feuillues,,,1030,0.680872,43.036487
2021-495545,2021-07-06,000001,Vente,4000,,,GOUTAS,B091,31510,31535,Sauveterre-de-Comminges,31,,,315350000I0416,,,,,,,,,,,,,0,,,,,L,landes,,,1478,0.681355,43.036735
2021-495545,2021-07-06,000001,Vente,4000,,,GOUTAS,B091,31510,31535,Sauveterre-de-Comminges,31,,,315350000I0417,,,,,,,,,,,,,0,,,,,L,landes,,,7265,0.68119,43.036808
2021-495545,2021-07-06,000001,Vente,4000,,,GOUTAS,B091,31510,31535,Sauveterre-de-Comminges,31,,,315350000I0418,,,,,,,,,,,,,0,,,,,BS,taillis sous futaie,,,1630,0.681965,43.037188
2021-495584,2021-06-24,000001,Vente,750,,,POUILLEUX,B194,31510,31535,Sauveterre-de-Comminges,31,,,315350000D0391,,,,,,,,,,,,,0,,,,,T,terres,,,1820,0.674589,43.027224
2021-495589,2021-06-26,000001,Vente,10000,444,,HAMEAU DE BRUNCAN,B101,31510,31535,Sauveterre-de-Comminges,31,,,315350000I0961,,,,,,,,,,,,,0,3,Dépendance,,0,S,sols,,,400,0.666799,43.035702
2021-495589,2021-06-26,000001,Vente,10000,444,,HAMEAU DE BRUNCAN,B101,31510,31535,Sauveterre-de-Comminges,31,,,315350000I0961,,,,,,,,,,,,,0,3,Dépendance,,0,J,jardins,,,2443,0.666799,43.035702
2021-495764,2021-07-15,000001,Vente,40000,45,,CHEM DE LA FONTAINE,0239,31510,31535,Sauveterre-de-Comminges,31,,,315350000I0310,,,,,,,,,,,,,0,1,Maison,84,3,S,sols,,,565,0.67453,43.036879
2021-495794,2021-07-16,000001,Vente,3236,,,CASTILLON,B037,31510,31535,Sauveterre-de-Comminges,31,,,315350000A0134,,,,,,,,,,,,,0,,,,,T,terres,,,2170,0.681162,43.058487
2021-495794,2021-07-16,000001,Vente,3236,,,CASTILLON,B037,31510,31535,Sauveterre-de-Comminges,31,,,315350000A0140,,,,,,,,,,,,,0,,,,,BS,taillis sous futaie,,,1330,0.683873,43.058543
2021-495794,2021-07-16,000001,Vente,3236,,,CASTILLON,B037,31510,31535,Sauveterre-de-Comminges,31,,,315350000A0141,,,,,,,,,,,,,0,,,,,T,terres,,,2850,0.683912,43.058305
2021-495794,2021-07-16,000001,Vente,3236,,,CASTILLON,B037,31510,31535,Sauveterre-de-Comminges,31,,,315350000A0142,,,,,,,,,,,,,0,,,,,BS,taillis sous futaie,,,1740,0.68388,43.058118
2021-495854,2021-08-04,000001,Vente,24000,,,AU VILLAGE,B232,31510,31535,Sauveterre-de-Comminges,31,,,315350000A1204,,,,,,,,,,,,,0,,,,,T,terres,,,1390,0.682862,43.053523
2021-495896,2021-07-30,000001,Vente,65000,179,,HAMEAU DE BOUCOU,B100,31510,31535,Sauveterre-de-Comminges,31,,,315350000E0195,,,,,,,,,,,,,0,3,Dépendance,,0,T,terres,,,775,0.666701,43.022547
2021-495896,2021-07-30,000001,Vente,65000,179,,HAMEAU DE BOUCOU,B100,31510,31535,Sauveterre-de-Comminges,31,,,315350000E0195,,,,,,,,,,,,,0,1,Maison,65,3,T,terres,,,775,0.666701,43.022547
2021-495896,2021-07-30,000001,Vente,65000,179,,HAMEAU DE BOUCOU,B100,31510,31535,Sauveterre-de-Comminges,31,,,315350000E0195,,,,,,,,,,,,,0,1,Maison,65,3,S,sols,,,40,0.666701,43.022547
2021-495896,2021-07-30,000001,Vente,65000,179,,HAMEAU DE BOUCOU,B100,31510,31535,Sauveterre-de-Comminges,31,,,315350000E0195,,,,,,,,,,,,,0,3,Dépendance,,0,S,sols,,,40,0.666701,43.022547
2021-495896,2021-07-30,000001,Vente,65000,37,,CHEM DE L EGLISE,0244,31510,31535,Sauveterre-de-Comminges,31,,,315350000E0349,,,,,,,,,,,,,0,,,,,S,sols,,,300,0.667314,43.022556
2021-495943,2021-08-06,000001,Vente,3000,,,AU VILLAGE,B232,31510,31535,Sauveterre-de-Comminges,31,,,315350000A0416,,,,,,,,,,,,,0,,,,,BS,taillis sous futaie,,,820,0.684186,43.055425
2021-495943,2021-08-06,000001,Vente,3000,,,AU VILLAGE,B232,31510,31535,Sauveterre-de-Comminges,31,,,315350000A0417,,,,,,,,,,,,,0,,,,,P,prés,,,1385,0.684144,43.055099
2021-495943,2021-08-06,000001,Vente,3000,,,AU VILLAGE,B232,31510,31535,Sauveterre-de-Comminges,31,,,315350000A0418,,,,,,,,,,,,,0,,,,,P,prés,,,1125,0.683838,43.055002
2021-495943,2021-08-06,000001,Vente,3000,,,AU VILLAGE,B232,31510,31535,Sauveterre-de-Comminges,31,,,315350000A0419,,,,,,,,,,,,,0,,,,,L,landes,,,665,0.683745,43.054719