id_mutation,date_mutation,numero_disposition,nature_mutation,valeur_fonciere,adresse_numero,adresse_suffixe,adresse_nom_voie,adresse_code_voie,code_postal,code_commune,nom_commune,code_departement,ancien_code_commune,ancien_nom_commune,id_parcelle,ancien_id_parcelle,numero_volume,lot1_numero,lot1_surface_carrez,lot2_numero,lot2_surface_carrez,lot3_numero,lot3_surface_carrez,lot4_numero,lot4_surface_carrez,lot5_numero,lot5_surface_carrez,nombre_lots,code_type_local,type_local,surface_reelle_bati,nombre_pieces_principales,code_nature_culture,nature_culture,code_nature_culture_speciale,nature_culture_speciale,surface_terrain,longitude,latitude
2021-496367,2021-01-27,000001,Vente,148000,,,LE VILLAGE,B090,32170,32028,Barcugnan,32,,,320280000B0376,,,,,,,,,,,,,0,,,,,J,jardins,,,825,0.403874,43.364649
2021-496367,2021-01-27,000001,Vente,148000,,,LE VILLAGE,B090,32170,32028,Barcugnan,32,,,320280000B0377,,,,,,,,,,,,,0,,,,,E,eaux,CANAL,Canal,132,0.404604,43.363958
2021-496367,2021-01-27,000001,Vente,148000,,,LE VILLAGE,B090,32170,32028,Barcugnan,32,,,320280000B0377,,,,,,,,,,,,,0,,,,,T,terres,,,14318,0.404604,43.363958
2021-496367,2021-01-27,000001,Vente,148000,5061,,A POUPAT,B079,32170,32028,Barcugnan,32,,,320280000B0378,,,,,,,,,,,,,0,1,Maison,140,3,S,sols,,,2263,0.403699,43.36401
2021-496367,2021-01-27,000001,Vente,148000,,,LE VILLAGE,B090,32170,32028,Barcugnan,32,,,320280000B0382,,,,,,,,,,,,,0,,,,,E,eaux,CANAL,Canal,90,0.405823,43.363488
2021-496367,2021-01-27,000001,Vente,148000,,,LE VILLAGE,B090,32170,32028,Barcugnan,32,,,320280000B0382,,,,,,,,,,,,,0,,,,,T,terres,,,5032,0.405823,43.363488
2021-496367,2021-01-27,000001,Vente,148000,,,LE VILLAGE,B090,32170,32028,Barcugnan,32,,,320280000B0382,,,,,,,,,,,,,0,,,,,T,terres,,,15598,0.405823,43.363488
2021-496367,2021-01-27,000001,Vente,148000,,,LE VILLAGE,B090,32170,32028,Barcugnan,32,,,320280000B0383,,,,,,,,,,,,,0,,,,,P,prés,,,10480,0.404629,43.362343
2021-496367,2021-01-27,000001,Vente,148000,,,LE VILLAGE,B090,32170,32028,Barcugnan,32,,,320280000B0383,,,,,,,,,,,,,0,,,,,T,terres,,,1336,0.404629,43.362343
2021-496367,2021-01-27,000001,Vente,148000,,,LE VILLAGE,B090,32170,32028,Barcugnan,32,,,320280000B0384,,,,,,,,,,,,,0,,,,,T,terres,,,19580,0.405724,43.361972
2021-496367,2021-01-27,000001,Vente,148000,,,LE VILLAGE,B090,32170,32028,Barcugnan,32,,,320280000B0385,,,,,,,,,,,,,0,,,,,T,terres,,,1870,0.406637,43.362162
2021-496367,2021-01-27,000001,Vente,148000,,,LE VILLAGE,B090,32170,32028,Barcugnan,32,,,320280000B0386,,,,,,,,,,,,,0,,,,,T,terres,,,3600,0.406651,43.361667
2021-496367,2021-01-27,000001,Vente,148000,,,LE VILLAGE,B090,32170,32028,Barcugnan,32,,,320280000B0387,,,,,,,,,,,,,0,,,,,P,prés,,,3584,0.406937,43.362128
2021-496367,2021-01-27,000001,Vente,148000,,,A FAOUQUE,B043,32170,32028,Barcugnan,32,,,320280000B1419,,,,,,,,,,,,,0,,,,,S,sols,,,1500,0.403654,43.363575
2021-496367,2021-01-27,000001,Vente,148000,,,A FAOUQUE,B043,32170,32028,Barcugnan,32,,,320280000B1419,,,,,,,,,,,,,0,,,,,T,terres,,,1305,0.403654,43.363575
2021-496367,2021-01-27,000001,Vente,148000,,,LE VILLAGE,B090,32170,32028,Barcugnan,32,,,320280000B1421,,,,,,,,,,,,,0,,,,,T,terres,,,1420,0.403688,43.363334
2021-496367,2021-01-27,000001,Vente,148000,,,LE VILLAGE,B090,32170,32028,Barcugnan,32,,,320280000B1423,,,,,,,,,,,,,0,,,,,T,terres,,,1313,0.403583,43.36296
2021-497900,2021-05-11,000001,Vente,1000,,,A MATHEOU,B064,32170,32028,Barcugnan,32,,,320280000A1119,,,,,,,,,,,,,0,,,,,AB,terrains a bâtir,,,1936,0.400685,43.387213
2021-497930,2021-04-29,000001,Vente,186180,,,LE CHATEAU,B027,32170,32028,Barcugnan,32,,,320280000B0197,,,,,,,,,,,,,0,,,,,S,sols,,,761,0.386246,43.361087
2021-497930,2021-04-29,000001,Vente,186180,,,LE CHATEAU,B027,32170,32028,Barcugnan,32,,,320280000B1094,,,,,,,,,,,,,0,,,,,S,sols,,,433,0.386492,43.361134
2021-497930,2021-04-29,000001,Vente,186180,,,AU PEJAS,B073,32170,32028,Barcugnan,32,,,320280000B1096,,,,,,,,,,,,,0,,,,,P,prés,,,212,0.386213,43.361135
2021-497930,2021-04-29,000001,Vente,186180,5022,,A CATALI,B021,32170,32028,Barcugnan,32,,,320280000B1101,,,,,,,,,,,,,0,1,Maison,150,7,S,sols,,,501,0.385627,43.361077
2021-497930,2021-04-29,000001,Vente,186180,,,A CATALI,B021,32170,32028,Barcugnan,32,,,320280000B1102,,,,,,,,,,,,,0,,,,,S,sols,,,22,0.385497,43.36108
2021-497930,2021-04-29,000001,Vente,186180,,,A CATALI,B021,32170,32028,Barcugnan,32,,,320280000B1103,,,,,,,,,,,,,0,,,,,S,sols,,,602,0.385607,43.360919
2021-497930,2021-04-29,000001,Vente,186180,,,A CATALI,B021,32170,32028,Barcugnan,32,,,320280000B1104,,,,,,,,,,,,,0,,,,,S,sols,,,244,0.385479,43.361081
2021-498105,2021-05-21,000001,Vente,164000,,,A COUJEROUS,B032,32170,32028,Barcugnan,32,,,320280000B0016,,,,,,,,,,,,,0,,,,,T,terres,,,5284,0.382027,43.363955
2021-498105,2021-05-21,000001,Vente,164000,5003,,A BASCANS,B003,32170,32028,Barcugnan,32,,,320280000B0017,,,,,,,,,,,,,0,1,Maison,150,4,S,sols,,,2882,0.382706,43.363922
2021-498105,2021-05-21,000001,Vente,164000,,,A COUJEROUS,B032,32170,32028,Barcugnan,32,,,320280000B0018,,,,,,,,,,,,,0,,,,,P,prés,,,2299,0.383159,43.363656
2021-498105,2021-05-21,000001,Vente,164000,,,A COUJEROUS,B032,32170,32028,Barcugnan,32,,,320280000B0018,,,,,,,,,,,,,0,,,,,S,sols,,,2000,0.383159,43.363656
2021-498313,2021-05-27,000001,Vente,35303,,,A SAINT ARAILLES,B082,32170,32028,Barcugnan,32,,,320280000B1382,,,,,,,,,,,,,0,,,,,T,terres,,,5588,0.406721,43.374357
2021-498313,2021-05-27,000001,Vente,35303,,,A SAINT ARAILLES,B082,32170,32028,Barcugnan,32,,,320280000B1382,,,,,,,,,,,,,0,,,,,T,terres,,,35945,0.406721,43.374357
2021-498510,2021-06-09,000001,Vente,130000,5036,,A DRAGOU,B038,32170,32028,Barcugnan,32,,,320280000A0394,,,,,,,,,,,,,0,1,Maison,87,4,S,sols,,,1322,0.393081,43.389018
2021-498510,2021-06-09,000001,Vente,130000,,,A PECHUT,B072,32170,32028,Barcugnan,32,,,320280000A0395,,,,,,,,,,,,,0,,,,,T,terres,,,551,0.393115,43.389261
2021-500389,2021-09-21,000001,Vente,66000,,,A LARRATS,B058,32170,32028,Barcugnan,32,,,320280000B0172,,,,,,,,,,,,,0,,,,,VI,vignes,,,4198,0.394887,43.365227
2021-500389,2021-09-21,000001,Vente,66000,,,A LARRATS,B058,32170,32028,Barcugnan,32,,,320280000B0173,,,,,,,,,,,,,0,,,,,T,terres,,,5530,0.394412,43.365424
2021-500389,2021-09-21,000001,Vente,66000,,,LE CHATEAU,B027,32170,32028,Barcugnan,32,,,320280000B0182,,,,,,,,,,,,,0,,,,,P,prés,,,29300,0.388861,43.361901
2021-500389,2021-09-21,000001,Vente,66000,,,L'ESPAGNOL,B042,32170,32028,Barcugnan,32,,,320280000B0283,,,,,,,,,,,,,0,,,,,T,terres,,,10835,0.391689,43.361411
2021-500389,2021-09-21,000001,Vente,66000,,,L'ESPAGNOL,B042,32170,32028,Barcugnan,32,,,320280000B0285,,,,,,,,,,,,,0,,,,,T,terres,,,12145,0.391533,43.359786
2021-500389,2021-09-21,000001,Vente,66000,,,L'ESPAGNOL,B042,32170,32028,Barcugnan,32,,,320280000B0285,,,,,,,,,,,,,0,,,,,T,terres,,,12145,0.391533,43.359786
2021-500389,2021-09-21,000001,Vente,66000,,,LE MOULIN,B069,32170,32028,Barcugnan,32,,,320280000B0623,,,,,,,,,,,,,0,,,,,T,terres,,,14678,0.391119,43.35805
2021-501102,2021-10-27,000001,Vente,105000,5008,,A PECHUT,B072,32170,32028,Barcugnan,32,,,320280000A0399,,,,,,,,,,,,,0,1,Maison,69,4,S,sols,,,2001,0.393469,43.390103
2021-501102,2021-10-27,000001,Vente,105000,,,A PECHUT,B072,32170,32028,Barcugnan,32,,,320280000A1167,,,,,,,,,,,,,0,,,,,P,prés,,,344,0.393875,43.390163
2021-501102,2021-10-27,000001,Vente,105000,,,A PECHUT,B072,32170,32028,Barcugnan,32,,,320280000A1170,,,,,,,,,,,,,0,,,,,J,jardins,,,322,0.393803,43.39042
2021-501464,2021-11-22,000001,Vente,700,,,LE CHATEAU,B027,32170,32028,Barcugnan,32,,,320280000B0947,,,,,,,,,,,,,0,,,,,P,prés,,,1126,0.388473,43.362964
