id_mutation,date_mutation,numero_disposition,nature_mutation,valeur_fonciere,adresse_numero,adresse_suffixe,adresse_nom_voie,adresse_code_voie,code_postal,code_commune,nom_commune,code_departement,ancien_code_commune,ancien_nom_commune,id_parcelle,ancien_id_parcelle,numero_volume,lot1_numero,lot1_surface_carrez,lot2_numero,lot2_surface_carrez,lot3_numero,lot3_surface_carrez,lot4_numero,lot4_surface_carrez,lot5_numero,lot5_surface_carrez,nombre_lots,code_type_local,type_local,surface_reelle_bati,nombre_pieces_principales,code_nature_culture,nature_culture,code_nature_culture_speciale,nature_culture_speciale,surface_terrain,longitude,latitude
2021-496517,2021-02-05,000001,Vente,2500,,,AU DAULIN,B027,32300,32045,Berdoues,32,,,320450000A0242,,,,,,,,,,,,,0,,,,,L,landes,,,1240,0.421819,43.489107
2021-496517,2021-02-05,000001,Vente,2500,,,AU DAULIN,B027,32300,32045,Berdoues,32,,,320450000A0244,,,,,,,,,,,,,0,,,,,BT,taillis simples,,,16055,0.422805,43.489096
2021-496629,2021-02-16,000001,Vente,135000,,,A EMBORDE,B031,32300,32045,Berdoues,32,,,320450000G0726,,,,,,,,,,,,,0,,,,,AG,terrains d'agrément,,,1125,0.380905,43.478203
2021-496629,2021-02-16,000001,Vente,135000,5727,,A EMBORDE,B031,32300,32045,Berdoues,32,,,320450000G0727,,,,,,,,,,,,,0,1,Maison,78,3,S,sols,,,362,0.381027,43.477969
2021-497067,2021-03-19,000001,Vente,330000,5880,,AUX COUSINES,B025,32300,32045,Berdoues,32,,,320450000B0880,,,,,,,,,,,,,0,1,Maison,81,4,S,sols,,,2956,0.401616,43.484059
2021-497067,2021-03-19,000001,Vente,330000,5880,,AUX COUSINES,B025,32300,32045,Berdoues,32,,,320450000B0880,,,,,,,,,,,,,0,1,Maison,81,4,S,sols,,,2956,0.401616,43.484059
2021-497067,2021-03-19,000001,Vente,330000,5880,,AUX COUSINES,B025,32300,32045,Berdoues,32,,,320450000B0880,,,,,,,,,,,,,0,1,Maison,81,4,S,sols,,,2956,0.401616,43.484059
2021-497357,2021-03-11,000001,Vente,65000,,,A LA RIVIERE,B102,32300,32045,Berdoues,32,,,320450000B0429,,,,,,,,,,,,,0,,,,,T,terres,,,33080,0.41164,43.476027
2021-497357,2021-03-11,000001,Vente,65000,,,A LA RIVIERE,B102,32300,32045,Berdoues,32,,,320450000B0430,,,,,,,,,,,,,0,,,,,T,terres,,,38580,0.412082,43.475342
2021-497995,2021-05-06,000001,Vente,139700,,,AU PAYSAN,B086,32300,32045,Berdoues,32,,,320450000F0365,,,,,,,,,,,,,0,,,,,T,terres,,,72,0.388617,43.480449
2021-497995,2021-05-06,000001,Vente,139700,,,AU PAYSAN,B086,32300,32045,Berdoues,32,,,320450000F0367,,,,,,,,,,,,,0,,,,,VI,vignes,,,54,0.388615,43.48025
2021-497995,2021-05-06,000001,Vente,139700,,,AU PAYSAN,B086,32300,32045,Berdoues,32,,,320450000F0369,,,,,,,,,,,,,0,,,,,T,terres,,,628,0.389318,43.480322
2021-497995,2021-05-06,000001,Vente,139700,,,AU PAYSAN,B086,32300,32045,Berdoues,32,,,320450000F0371,,,,,,,,,,,,,0,,,,,T,terres,,,108,0.388788,43.480121
2021-497995,2021-05-06,000001,Vente,139700,5007,,AU PAYSAN,B086,32300,32045,Berdoues,32,,,320450000F0373,,,,,,,,,,,,,0,1,Maison,90,3,S,sols,,,2228,0.389063,43.480298
2021-499091,2021-06-28,000001,Vente,73400,5074,,AU VILLAGE,B116,32300,32045,Berdoues,32,,,320450000B0843,,,,,,,,,,,,,0,1,Maison,75,4,P,prés,,,3510,0.403325,43.480883
2021-499091,2021-06-28,000001,Vente,73400,5074,,AU VILLAGE,B116,32300,32045,Berdoues,32,,,320450000B0843,,,,,,,,,,,,,0,1,Maison,75,4,S,sols,,,948,0.403325,43.480883
2021-499153,2021-06-28,000001,Vente,264000,,,A LA RIBERE,B099,32300,32045,Berdoues,32,,,320450000C0033,,,,,,,,,,,,,0,,,,,J,jardins,,,1080,0.414253,43.46418
2021-499153,2021-06-28,000001,Vente,264000,,,A LA RIBERE,B099,32300,32045,Berdoues,32,,,320450000C0034,,,,,,,,,,,,,0,,,,,P,prés,,,440,0.413888,43.464181
2021-499153,2021-06-28,000001,Vente,264000,,,A LA RIBERE,B099,32300,32045,Berdoues,32,,,320450000C0035,,,,,,,,,,,,,0,,,,,J,jardins,,,920,0.414189,43.463932
2021-499153,2021-06-28,000001,Vente,264000,,,A LA RIBERE,B099,32300,32045,Berdoues,32,,,320450000C0036,,,,,,,,,,,,,0,,,,,P,prés,,,3597,0.413356,43.463709
2021-499153,2021-06-28,000001,Vente,264000,,,A LA RIBERE,B099,32300,32045,Berdoues,32,,,320450000C0338,,,,,,,,,,,,,0,,,,,P,prés,,,47,0.412862,43.463462
2021-499153,2021-06-28,000001,Vente,264000,5012,,A LA RIBERE,B099,32300,32045,Berdoues,32,,,320450000C0339,,,,,,,,,,,,,0,3,Dépendance,,0,S,sols,,,1167,0.413108,43.463411
2021-499153,2021-06-28,000001,Vente,264000,5012,,A LA RIBERE,B099,32300,32045,Berdoues,32,,,320450000C0339,,,,,,,,,,,,,0,3,Dépendance,,0,S,sols,,,1167,0.413108,43.463411
2021-499153,2021-06-28,000001,Vente,264000,5012,,A LA RIBERE,B099,32300,32045,Berdoues,32,,,320450000C0339,,,,,,,,,,,,,0,3,Dépendance,,0,S,sols,,,1167,0.413108,43.463411
2021-499153,2021-06-28,000001,Vente,264000,5012,,A LA RIBERE,B099,32300,32045,Berdoues,32,,,320450000C0339,,,,,,,,,,,,,0,1,Maison,136,4,S,sols,,,1167,0.413108,43.463411
2021-499153,2021-06-28,000001,Vente,264000,,,A LA RIBERE,B099,32300,32045,Berdoues,32,,,320450000C0342,,,,,,,,,,,,,0,,,,,T,terres,,,9680,0.413691,43.463276
2021-499153,2021-06-28,000001,Vente,264000,,,A LA RIBERE,B099,32300,32045,Berdoues,32,,,320450000C0344,,,,,,,,,,,,,0,,,,,J,jardins,,,749,0.413099,43.462838
2021-499958,2021-08-30,000001,Vente,197200,5003,,AUX COUSINES,B025,32300,32045,Berdoues,32,,,320450000B0875,,,,,,,,,,,,,0,1,Maison,99,4,S,sols,,,1894,0.399527,43.483336
2021-500229,2021-09-20,000001,Vente,294350,,,A EMBORDE,B031,32300,32045,Berdoues,32,,,320450000G0629,,,,,,,,,,,,,0,,,,,T,terres,,,46,0.385038,43.478014
2021-500229,2021-09-20,000001,Vente,294350,,,A EMBORDE,B031,32300,32045,Berdoues,32,,,320450000G0632,,,,,,,,,,,,,0,,,,,L,landes,,,617,0.385103,43.477479
2021-500229,2021-09-20,000001,Vente,294350,5570,,A EMBORDE,B031,32300,32045,Berdoues,32,,,320450000G0634,,,,,,,,,,,,,0,1,Maison,148,5,T,terres,,,1037,0.385199,43.477772
2021-500229,2021-09-20,000001,Vente,294350,5570,,A EMBORDE,B031,32300,32045,Berdoues,32,,,320450000G0634,,,,,,,,,,,,,0,3,Dépendance,,0,S,sols,,,1500,0.385199,43.477772
2021-500229,2021-09-20,000001,Vente,294350,5570,,A EMBORDE,B031,32300,32045,Berdoues,32,,,320450000G0634,,,,,,,,,,,,,0,1,Maison,148,5,S,sols,,,1500,0.385199,43.477772
2021-500229,2021-09-20,000001,Vente,294350,5570,,A EMBORDE,B031,32300,32045,Berdoues,32,,,320450000G0634,,,,,,,,,,,,,0,3,Dépendance,,0,T,terres,,,1037,0.385199,43.477772
2021-500604,2021-10-08,000001,Vente,327565,5101,,A LA CAILLAVERE,B016,32300,32045,Berdoues,32,,,320450000B0068,,,,,,,,,,,,,0,3,Dépendance,,0,S,sols,,,1500,0.400144,43.489379
2021-500604,2021-10-08,000001,Vente,327565,5101,,A LA CAILLAVERE,B016,32300,32045,Berdoues,32,,,320450000B0068,,,,,,,,,,,,,0,1,Maison,190,6,T,terres,,,3840,0.400144,43.489379
2021-500604,2021-10-08,000001,Vente,327565,5101,,A LA CAILLAVERE,B016,32300,32045,Berdoues,32,,,320450000B0068,,,,,,,,,,,,,0,1,Maison,190,6,S,sols,,,1500,0.400144,43.489379
2021-500604,2021-10-08,000001,Vente,327565,5101,,A LA CAILLAVERE,B016,32300,32045,Berdoues,32,,,320450000B0068,,,,,,,,,,,,,0,3,Dépendance,,0,T,terres,,,3840,0.400144,43.489379
2021-501704,2021-12-13,000001,Vente,186000,,,A LA LANO,B063,32300,32045,Berdoues,32,,,320450000F0411,,,,,,,,,,,,,0,,,,,T,terres,,,1440,0.397151,43.480941
2021-501704,2021-12-13,000001,Vente,186000,5545,,A LA LANO,B063,32300,32045,Berdoues,32,,,320450000F0420,,,,,,,,,,,,,0,1,Maison,89,3,T,terres,,,4726,0.396963,43.480513
2021-501704,2021-12-13,000001,Vente,186000,5545,,A LA LANO,B063,32300,32045,Berdoues,32,,,320450000F0420,,,,,,,,,,,,,0,1,Maison,89,3,S,sols,,,1000,0.396963,43.480513
2021-501733,2021-11-29,000001,Vente,374500,5569,B,AUX MOULIES,B078,32300,32045,Berdoues,32,,,320450000G0569,,,,,,,,,,,,,0,1,Maison,126,4,S,sols,,,1665,0.390268,43.472163
2021-501733,2021-11-29,000001,Vente,374500,,,AUX MOULIES,B078,32300,32045,Berdoues,32,,,320450000G0576,,,,,,,,,,,,,0,,,,,S,sols,,,9180,0.389982,43.471855
2021-501733,2021-11-29,000001,Vente,374500,,,AU BRUCHAT,B013,32300,32045,Berdoues,32,,,320450000G0673,,,,,,,,,,,,,0,,,,,T,terres,,,333,0.390724,43.473294
2021-501882,2021-12-14,000001,Vente,185563,5059,A,AU NATON,B081,32300,32045,Berdoues,32,,,320450000E0134,,,,,,,,,,,,,0,1,Maison,135,5,S,sols,,,1330,0.387005,43.489633
2021-501882,2021-12-14,000001,Vente,185563,,,AU NATON,B081,32300,32045,Berdoues,32,,,320450000E0135,,,,,,,,,,,,,0,,,,,BT,taillis simples,,,1440,0.387625,43.489535
2021-501882,2021-12-14,000001,Vente,185563,,,AU NATON,B081,32300,32045,Berdoues,32,,,320450000E0251,,,,,,,,,,,,,0,,,,,T,terres,,,894,0.38618,43.489795
2021-501882,2021-12-14,000001,Vente,185563,,,AU NATON,B081,32300,32045,Berdoues,32,,,320450000E0253,,,,,,,,,,,,,0,,,,,T,terres,,,1267,0.386585,43.489662
2021-501882,2021-12-14,000001,Vente,185563,,,AU NATON,B081,32300,32045,Berdoues,32,,,320450000E0255,,,,,,,,,,,,,0,,,,,T,terres,,,232,0.387367,43.489376
2021-501882,2021-12-14,000001,Vente,185563,5060,,AU NATON,B081,32300,32045,Berdoues,32,,,320450000E0312,,,,,,,,,,,,,0,4,Local industriel. commercial ou assimilé,48,0,S,sols,,,1857,0.387177,43.489777
2021-501882,2021-12-14,000001,Vente,185563,,,AU NATON,B081,32300,32045,Berdoues,32,,,320450000E0314,,,,,,,,,,,,,0,,,,,T,terres,,,5176,0.387072,43.490184
2021-501882,2021-12-14,000001,Vente,185563,,,AU NATON,B081,32300,32045,Berdoues,32,,,320450000E0317,,,,,,,,,,,,,0,,,,,T,terres,,,1489,0.3873,43.490536
2021-501882,2021-12-14,000001,Vente,185563,,,AU NATON,B081,32300,32045,Berdoues,32,,,320450000E0330,,,,,,,,,,,,,0,,,,,T,terres,,,355,0.387056,43.489374
