id_mutation,date_mutation,numero_disposition,nature_mutation,valeur_fonciere,adresse_numero,adresse_suffixe,adresse_nom_voie,adresse_code_voie,code_postal,code_commune,nom_commune,code_departement,ancien_code_commune,ancien_nom_commune,id_parcelle,ancien_id_parcelle,numero_volume,lot1_numero,lot1_surface_carrez,lot2_numero,lot2_surface_carrez,lot3_numero,lot3_surface_carrez,lot4_numero,lot4_surface_carrez,lot5_numero,lot5_surface_carrez,nombre_lots,code_type_local,type_local,surface_reelle_bati,nombre_pieces_principales,code_nature_culture,nature_culture,code_nature_culture_speciale,nature_culture_speciale,surface_terrain,longitude,latitude
2021-496343,2021-01-15,000001,Vente,70000,5077,,CASTERA,B068,32170,32116,Duffort,32,,,32116000ZE0065,,,,,,,,,,,,,0,1,Maison,60,2,P,prés,,,4350,0.407012,43.334743
2021-496343,2021-01-15,000001,Vente,70000,5077,,CASTERA,B068,32170,32116,Duffort,32,,,32116000ZE0065,,,,,,,,,,,,,0,3,Dépendance,,0,S,sols,,,300,0.407012,43.334743
2021-496343,2021-01-15,000001,Vente,70000,5077,,CASTERA,B068,32170,32116,Duffort,32,,,32116000ZE0065,,,,,,,,,,,,,0,1,Maison,60,2,S,sols,,,300,0.407012,43.334743
2021-496343,2021-01-15,000001,Vente,70000,5077,,CASTERA,B068,32170,32116,Duffort,32,,,32116000ZE0065,,,,,,,,,,,,,0,3,Dépendance,,0,P,prés,,,4350,0.407012,43.334743
2021-497939,2021-04-23,000001,Vente,11000,,,PAULET,B048,32170,32116,Duffort,32,,,32116000ZB0021,,,,,,,,,,,,,0,,,,,T,terres,,,8534,0.432531,43.344758
2021-497939,2021-04-23,000001,Vente,11000,,,PAULET,B048,32170,32116,Duffort,32,,,32116000ZB0021,,,,,,,,,,,,,0,,,,,T,terres,,,17066,0.432531,43.344758
2021-497939,2021-04-23,000001,Vente,11000,,,SUD DE CARRERE,B066,32170,32116,Duffort,32,,,32116000ZB0053,,,,,,,,,,,,,0,,,,,T,terres,,,273,0.416047,43.347171
2021-497939,2021-04-23,000001,Vente,11000,,,SUD DE CARRERE,B066,32170,32116,Duffort,32,,,32116000ZB0054,,,,,,,,,,,,,0,,,,,T,terres,,,20565,0.414942,43.34746
2021-501451,2021-11-22,000001,Vente,18000,5017,,A LACARCE,B035,32170,32116,Duffort,32,,,32116000ZC0002,,,,,,,,,,,,,0,1,Maison,100,2,S,sols,,,2090,0.432682,43.343171
2021-501451,2021-11-22,000001,Vente,18000,5017,,A LACARCE,B035,32170,32116,Duffort,32,,,32116000ZC0002,,,,,,,,,,,,,0,1,Maison,50,2,S,sols,,,2090,0.432682,43.343171
2021-501451,2021-11-22,000001,Vente,18000,,,RIBERE,B059,32170,32116,Duffort,32,,,32116000ZC0037,,,,,,,,,,,,,0,,,,,T,terres,,,3379,0.432889,43.342939
2021-501451,2021-11-22,000001,Vente,18000,,,RIBERE,B059,32170,32116,Duffort,32,,,32116000ZC0037,,,,,,,,,,,,,0,,,,,T,terres,,,3379,0.432889,43.342939
