id_mutation,date_mutation,numero_disposition,nature_mutation,valeur_fonciere,adresse_numero,adresse_suffixe,adresse_nom_voie,adresse_code_voie,code_postal,code_commune,nom_commune,code_departement,ancien_code_commune,ancien_nom_commune,id_parcelle,ancien_id_parcelle,numero_volume,lot1_numero,lot1_surface_carrez,lot2_numero,lot2_surface_carrez,lot3_numero,lot3_surface_carrez,lot4_numero,lot4_surface_carrez,lot5_numero,lot5_surface_carrez,nombre_lots,code_type_local,type_local,surface_reelle_bati,nombre_pieces_principales,code_nature_culture,nature_culture,code_nature_culture_speciale,nature_culture_speciale,surface_terrain,longitude,latitude
2021-499400,2021-08-02,000001,Vente,84100,,,AU HAUT DE LASCLOTES,B032,32300,32215,Loubersan,32,,,322150000C0235,,,,,,,,,,,,,0,,,,,BT,taillis simples,,,4420,0.516022,43.498989
2021-499400,2021-08-02,000001,Vente,84100,5022,,NAVARRE,B055,32300,32215,Loubersan,32,,,322150000D0066,,,,,,,,,,,,,0,1,Maison,115,3,S,sols,,,1940,0.510331,43.494988
2021-499400,2021-08-02,000001,Vente,84100,5022,,NAVARRE,B055,32300,32215,Loubersan,32,,,322150000D0066,,,,,,,,,,,,,0,3,Dépendance,,0,S,sols,,,1940,0.510331,43.494988
2021-499400,2021-08-02,000001,Vente,84100,,,A LALANNE,B036,32300,32215,Loubersan,32,,,322150000D0647,,,,,,,,,,,,,0,,,,,S,sols,,,55,0.510661,43.494951
2021-499400,2021-08-02,000001,Vente,84100,,,A LALANNE,B036,32300,32215,Loubersan,32,,,322150000D0649,,,,,,,,,,,,,0,,,,,S,sols,,,765,0.510357,43.494751
2021-500058,2021-08-17,000001,Vente,114000,,,A LA LANNE,B040,32300,32215,Loubersan,32,,,322150000B0175,,,,,,,,,,,,,0,,,,,T,terres,,,9620,0.524145,43.50851
2021-500058,2021-08-17,000001,Vente,114000,,,A ENCARDONNE,B024,32300,32215,Loubersan,32,,,322150000B0216,,,,,,,,,,,,,0,,,,,BT,taillis simples,,,530,0.52502,43.508007
2021-500058,2021-08-17,000001,Vente,114000,,,A ENCARDONNE,B024,32300,32215,Loubersan,32,,,322150000B0217,,,,,,,,,,,,,0,,,,,P,prés,,,10600,0.524081,43.507745
2021-500058,2021-08-17,000001,Vente,114000,,,A ENCARDONNE,B024,32300,32215,Loubersan,32,,,322150000B0218,,,,,,,,,,,,,0,,,,,L,landes,,,1038,0.523356,43.507996
2021-500058,2021-08-17,000001,Vente,114000,,,A ENCARDONNE,B024,32300,32215,Loubersan,32,,,322150000B0224,,,,,,,,,,,,,0,,,,,T,terres,,,1198,0.5229,43.507053
2021-500058,2021-08-17,000001,Vente,114000,,,A ENCARDONNE,B024,32300,32215,Loubersan,32,,,322150000B0225,,,,,,,,,,,,,0,,,,,S,sols,,,131,0.52307,43.506984
2021-500058,2021-08-17,000001,Vente,114000,,,A ENCARDONNE,B024,32300,32215,Loubersan,32,,,322150000B0226,,,,,,,,,,,,,0,,,,,L,landes,,,1241,0.523339,43.507119
2021-500058,2021-08-17,000001,Vente,114000,5032,,A ENCARDONNE,B024,32300,32215,Loubersan,32,,,322150000B0227,,,,,,,,,,,,,0,1,Maison,157,5,S,sols,,,1295,0.523733,43.507309
2021-500058,2021-08-17,000001,Vente,114000,5032,,A ENCARDONNE,B024,32300,32215,Loubersan,32,,,322150000B0227,,,,,,,,,,,,,0,3,Dépendance,,0,S,sols,,,1295,0.523733,43.507309
2021-500058,2021-08-17,000001,Vente,114000,,,A ENCARDONNE,B024,32300,32215,Loubersan,32,,,322150000B0228,,,,,,,,,,,,,0,,,,,S,sols,,,333,0.524209,43.507464
2021-500058,2021-08-17,000001,Vente,114000,,,A ENCARDONNE,B024,32300,32215,Loubersan,32,,,322150000B0229,,,,,,,,,,,,,0,,,,,L,landes,,,1015,0.524298,43.507396
2021-500058,2021-08-17,000001,Vente,114000,,,A ENCARDONNE,B024,32300,32215,Loubersan,32,,,322150000B0371,,,,,,,,,,,,,0,,,,,P,prés,,,618,0.524173,43.507435
2021-500102,2021-09-15,000001,Vente,700,,,AU HAUT DE LASCLOTES,B032,32300,32215,Loubersan,32,,,322150000C0209,,,,,,,,,,,,,0,,,,,BS,taillis sous futaie,,,1850,0.511897,43.498383
2021-501725,2021-12-14,000001,Vente,370000,5069,,SALLES,B065,32300,32215,Loubersan,32,,,322150000A0032,,,,,,,,,,,,,0,3,Dépendance,,0,S,sols,,,1455,0.513122,43.517505
2021-501725,2021-12-14,000001,Vente,370000,5069,,SALLES,B065,32300,32215,Loubersan,32,,,322150000A0032,,,,,,,,,,,,,0,3,Dépendance,,0,S,sols,,,1455,0.513122,43.517505
2021-501725,2021-12-14,000001,Vente,370000,5069,,SALLES,B065,32300,32215,Loubersan,32,,,322150000A0032,,,,,,,,,,,,,0,1,Maison,130,3,S,sols,,,1455,0.513122,43.517505
2021-501725,2021-12-14,000001,Vente,370000,,,A LARRIBERAU,B041,32300,32215,Loubersan,32,,,322150000A0212,,,,,,,,,,,,,0,,,,,S,sols,,,1340,0.512919,43.517481
2021-501725,2021-12-14,000001,Vente,370000,,,A LARRIBERAU,B041,32300,32215,Loubersan,32,,,322150000A0214,,,,,,,,,,,,,0,,,,,T,terres,,,1384,0.513453,43.517366
