id_mutation,date_mutation,numero_disposition,nature_mutation,valeur_fonciere,adresse_numero,adresse_suffixe,adresse_nom_voie,adresse_code_voie,code_postal,code_commune,nom_commune,code_departement,ancien_code_commune,ancien_nom_commune,id_parcelle,ancien_id_parcelle,numero_volume,lot1_numero,lot1_surface_carrez,lot2_numero,lot2_surface_carrez,lot3_numero,lot3_surface_carrez,lot4_numero,lot4_surface_carrez,lot5_numero,lot5_surface_carrez,nombre_lots,code_type_local,type_local,surface_reelle_bati,nombre_pieces_principales,code_nature_culture,nature_culture,code_nature_culture_speciale,nature_culture_speciale,surface_terrain,longitude,latitude
2021-496791,2021-02-16,000001,Vente,1294.5,,,AUX MICHELS,B028,32300,32401,Saint-Ost,32,,,324010000D0171,,,,,,,,,,,,,0,,,,,T,terres,,,2589,0.464466,43.379011
2021-496794,2021-02-16,000001,Vente,12655,,,AUX MICHELS,B028,32300,32401,Saint-Ost,32,,,324010000D0322,,,,,,,,,,,,,0,,,,,T,terres,,,6009,0.463501,43.379062
2021-496794,2021-02-16,000001,Vente,12655,,,AUX MICHELS,B028,32300,32401,Saint-Ost,32,,,324010000D0322,,,,,,,,,,,,,0,,,,,T,terres,,,2511,0.463501,43.379062
2021-496794,2021-02-16,000001,Vente,12655,,,AUX MICHELS,B028,32300,32401,Saint-Ost,32,,,324010000D0393,,,,,,,,,,,,,0,,,,,T,terres,,,5470,0.464265,43.378637
2021-496794,2021-02-16,000001,Vente,12655,,,AUX MICHELS,B028,32300,32401,Saint-Ost,32,,,324010000D0395,,,,,,,,,,,,,0,,,,,T,terres,,,3907,0.463301,43.37834
2021-496794,2021-02-16,000001,Vente,12655,,,AUX MICHELS,B028,32300,32401,Saint-Ost,32,,,324010000D0397,,,,,,,,,,,,,0,,,,,T,terres,,,7414,0.462219,43.378758
2021-498381,2021-05-25,000002,Echange,450,,,A SOLON,B035,32300,32401,Saint-Ost,32,,,324010000D0403,,,,,,,,,,,,,0,,,,,S,sols,,,770,0.468371,43.378008
2021-498382,2021-05-25,000003,Echange,4450,,,A SOLON,B035,32300,32401,Saint-Ost,32,,,324010000D0404,,,,,,,,,,,,,0,,,,,T,terres,,,1087,0.469174,43.378117
2021-498502,2021-06-01,000001,Vente,165000,5003,,A SOLON,B035,32300,32401,Saint-Ost,32,,,324010000D0402,,,,,,,,,,,,,0,1,Maison,212,5,S,sols,,,1383,0.46871,43.378081
2021-498502,2021-06-01,000001,Vente,165000,,,A SOLON,B035,32300,32401,Saint-Ost,32,,,324010000D0404,,,,,,,,,,,,,0,,,,,T,terres,,,1087,0.469174,43.378117
2021-501009,2021-11-02,000001,Vente,205200,5037,,AUX POUCOURETS,B032,32300,32401,Saint-Ost,32,,,324010000C0376,,,,,,,,,,,,,0,1,Maison,115,3,S,sols,,,2827,0.454021,43.366826
2021-501009,2021-11-02,000001,Vente,205200,5037,,AUX POUCOURETS,B032,32300,32401,Saint-Ost,32,,,324010000C0376,,,,,,,,,,,,,0,3,Dépendance,,0,S,sols,,,2827,0.454021,43.366826
2021-501009,2021-11-02,000001,Vente,205200,,,AUX POUCOURETS,B032,32300,32401,Saint-Ost,32,,,324010000C0398,,,,,,,,,,,,,0,,,,,T,terres,,,3255,0.453819,43.366321
2021-501009,2021-11-02,000001,Vente,205200,,,AUX POUCOURETS,B032,32300,32401,Saint-Ost,32,,,324010000C0572,,,,,,,,,,,,,0,,,,,T,terres,,,3490,0.453781,43.365914
2021-501009,2021-11-02,000001,Vente,205200,,,AUX POUCOURETS,B032,32300,32401,Saint-Ost,32,,,324010000C0761,,,,,,,,,,,,,0,,,,,T,terres,,,4521,0.454238,43.367188
2021-501009,2021-11-02,000001,Vente,205200,,,AUX POUCOURETS,B032,32300,32401,Saint-Ost,32,,,324010000C0763,,,,,,,,,,,,,0,,,,,P,prés,,,1309,0.454422,43.366633
2021-501009,2021-11-02,000001,Vente,205200,,,AUX POUCOURETS,B032,32300,32401,Saint-Ost,32,,,324010000C0765,,,,,,,,,,,,,0,,,,,T,terres,,,2300,0.454447,43.366165
2021-501009,2021-11-02,000001,Vente,205200,,,AUX POUCOURETS,B032,32300,32401,Saint-Ost,32,,,324010000C0767,,,,,,,,,,,,,0,,,,,T,terres,,,694,0.454519,43.366442
2021-501009,2021-11-02,000001,Vente,205200,,,AUX POUCOURETS,B032,32300,32401,Saint-Ost,32,,,324010000C0769,,,,,,,,,,,,,0,,,,,T,terres,,,1604,0.454437,43.365707
