id_mutation,date_mutation,numero_disposition,nature_mutation,valeur_fonciere,adresse_numero,adresse_suffixe,adresse_nom_voie,adresse_code_voie,code_postal,code_commune,nom_commune,code_departement,ancien_code_commune,ancien_nom_commune,id_parcelle,ancien_id_parcelle,numero_volume,lot1_numero,lot1_surface_carrez,lot2_numero,lot2_surface_carrez,lot3_numero,lot3_surface_carrez,lot4_numero,lot4_surface_carrez,lot5_numero,lot5_surface_carrez,nombre_lots,code_type_local,type_local,surface_reelle_bati,nombre_pieces_principales,code_nature_culture,nature_culture,code_nature_culture_speciale,nature_culture_speciale,surface_terrain,longitude,latitude
2021-497178,2021-03-09,000001,Vente,50000,,,A TILLAC,B060,32160,32445,Tieste-Uragnoux,32,,,324450000B0076,,,,,,,,,,,,,0,,,,,VE,vergers,,,1542,0.020749,43.548344
2021-497178,2021-03-09,000001,Vente,50000,5039,,AU MICHEL,B064,32160,32445,Tieste-Uragnoux,32,,,324450000B0077,,,,,,,,,,,,,0,1,Maison,150,4,S,sols,,,904,0.020846,43.548178
2021-497178,2021-03-09,000001,Vente,50000,,,A TILLAC,B060,32160,32445,Tieste-Uragnoux,32,,,324450000B0078,,,,,,,,,,,,,0,,,,,J,jardins,,,807,0.020945,43.547937
2021-497178,2021-03-09,000001,Vente,50000,,,A TILLAC,B060,32160,32445,Tieste-Uragnoux,32,,,324450000B0080,,,,,,,,,,,,,0,,,,,T,terres,,,2160,0.021303,43.54781
2021-498165,2021-05-04,000001,Vente,150000,5036,,A TILLAC,B060,32160,32445,Tieste-Uragnoux,32,,,324450000B0084,,,,,,,,,,,,,0,1,Maison,145,5,S,sols,,,2888,0.023318,43.548809
2021-498165,2021-05-04,000001,Vente,150000,5036,,A TILLAC,B060,32160,32445,Tieste-Uragnoux,32,,,324450000B0084,,,,,,,,,,,,,0,1,Maison,106,6,S,sols,,,2888,0.023318,43.548809
2021-498165,2021-05-04,000001,Vente,150000,,,A TILLAC,B060,32160,32445,Tieste-Uragnoux,32,,,324450000B0085,,,,,,,,,,,,,0,,,,,J,jardins,,,1308,0.023729,43.548444
2021-498165,2021-05-04,000001,Vente,150000,,,A TILLAC,B060,32160,32445,Tieste-Uragnoux,32,,,324450000B0086,,,,,,,,,,,,,0,,,,,T,terres,,,9090,0.023968,43.548605
2021-498165,2021-05-04,000001,Vente,150000,,,A TILLAC,B060,32160,32445,Tieste-Uragnoux,32,,,324450000B0087,,,,,,,,,,,,,0,,,,,T,terres,,,6189,0.02449,43.549096
2021-498165,2021-05-04,000001,Vente,150000,,,A TILLAC,B060,32160,32445,Tieste-Uragnoux,32,,,324450000B0621,,,,,,,,,,,,,0,,,,,T,terres,,,8166,0.024673,43.54935
2021-498165,2021-05-04,000001,Vente,150000,,,A TILLAC,B060,32160,32445,Tieste-Uragnoux,32,,,324450000B0622,,,,,,,,,,,,,0,,,,,T,terres,,,212,0.025697,43.548868
2021-498165,2021-05-04,000001,Vente,150000,,,A TILLAC,B060,32160,32445,Tieste-Uragnoux,32,,,324450000B0728,,,,,,,,,,,,,0,,,,,S,sols,,,1999,0.02304,43.54897
2021-499409,2021-07-23,000001,Vente,285700,,,A COUALEVE,B022,32160,32445,Tieste-Uragnoux,32,,,324450000B0061,,,,,,,,,,,,,0,,,,,J,jardins,,,1656,0.021394,43.553099
2021-499409,2021-07-23,000001,Vente,285700,5021,,AU BEOUSAT,B006,32160,32445,Tieste-Uragnoux,32,,,324450000B0062,,,,,,,,,,,,,0,1,Maison,130,4,S,sols,,,2019,0.021544,43.553308
2021-499409,2021-07-23,000001,Vente,285700,,,A COUALEVE,B022,32160,32445,Tieste-Uragnoux,32,,,324450000B0063,,,,,,,,,,,,,0,,,,,T,terres,,,1614,0.021996,43.553066
2021-501631,2021-12-08,000001,Vente,10800,,,A BOUZIGOT,B010,32160,32445,Tieste-Uragnoux,32,,,324450000B0798,,,,,,,,,,,,,0,,,,,AB,terrains a bâtir,,,1798,0.036496,43.550756
2021-501994,2021-12-21,000001,Vente,2500,,,A BRAMEPAN,B011,32160,32445,Tieste-Uragnoux,32,,,324450000A0097,,,,,,,,,,,,,0,,,,,L,landes,,,5792,0.043912,43.558555
2021-502144,2021-12-23,000001,Vente,16000,,,A LAS ESMARRIGADES,B040,32160,32445,Tieste-Uragnoux,32,,,324450000C0006,,,,,,,,,,,,,0,,,,,P,prés,,,5860,0.011922,43.556648
2021-502144,2021-12-23,000001,Vente,16000,,,A LAS ESMARRIGADES,B040,32160,32445,Tieste-Uragnoux,32,,,324450000C0007,,,,,,,,,,,,,0,,,,,P,prés,,,15820,0.012622,43.555692
2021-502144,2021-12-23,000001,Vente,16000,,,A LAS ESMARRIGADES,B040,32160,32445,Tieste-Uragnoux,32,,,324450000C0027,,,,,,,,,,,,,0,,,,,P,prés,,,4520,0.014096,43.553959
2021-502144,2021-12-23,000001,Vente,16000,,,A LAS ESMARRIGADES,B040,32160,32445,Tieste-Uragnoux,32,,,324450000C0028,,,,,,,,,,,,,0,,,,,BT,taillis simples,,,300,0.013262,43.554643
2021-502280,2021-12-16,000002,Echange,39688,,,A CANTAN,B016,32160,32445,Tieste-Uragnoux,32,,,32445000ZA0020,,,,,,,,,,,,,0,,,,,T,terres,,,34300,0.037553,43.539397
