id_mutation,date_mutation,numero_disposition,nature_mutation,valeur_fonciere,adresse_numero,adresse_suffixe,adresse_nom_voie,adresse_code_voie,code_postal,code_commune,nom_commune,code_departement,ancien_code_commune,ancien_nom_commune,id_parcelle,ancien_id_parcelle,numero_volume,lot1_numero,lot1_surface_carrez,lot2_numero,lot2_surface_carrez,lot3_numero,lot3_surface_carrez,lot4_numero,lot4_surface_carrez,lot5_numero,lot5_surface_carrez,nombre_lots,code_type_local,type_local,surface_reelle_bati,nombre_pieces_principales,code_nature_culture,nature_culture,code_nature_culture_speciale,nature_culture_speciale,surface_terrain,longitude,latitude
2021-525405,2021-03-24,000002,Vente,30000,,,FALY,B043,33430,33178,Gajac,33,,,331780000B0741,,,,,,,,,,,,,0,,,,,AG,terrains d'agrément,,,76,-0.126993,44.437492
2021-525405,2021-03-24,000002,Vente,30000,,,FALY,B043,33430,33178,Gajac,33,,,331780000B0742,,,,,,,,,,,,,0,,,,,AG,terrains d'agrément,,,17,-0.126986,44.437469
2021-525408,2021-03-11,000002,Vente,374,,,ANDRIEUX,B001,33430,33178,Gajac,33,,,331780000D0559,,,,,,,,,,,,,0,,,,,P,prés,,,749,-0.163636,44.432691
2021-532950,2021-06-25,000001,Vente,130500,145,,LA CAVE,B032,33430,33178,Gajac,33,,,331780000D0212,,,,,,,,,,,,,0,1,Maison,90,5,S,sols,,,33,-0.134017,44.434779
2021-532950,2021-06-25,000001,Vente,130500,,,LA CAVE,B032,33430,33178,Gajac,33,,,331780000D0213,,,,,,,,,,,,,0,,,,,J,jardins,,,815,-0.133735,44.434592
2021-532950,2021-06-25,000001,Vente,130500,,,LA CAVE,B032,33430,33178,Gajac,33,,,331780000D0213,,,,,,,,,,,,,0,,,,,T,terres,,,5469,-0.133735,44.434592
2021-532950,2021-06-25,000001,Vente,130500,,,LA CAVE,B032,33430,33178,Gajac,33,,,331780000D0213,,,,,,,,,,,,,0,,,,,S,sols,,,616,-0.133735,44.434592
2021-532950,2021-06-25,000001,Vente,130500,,,LA CAVE,B032,33430,33178,Gajac,33,,,331780000D0214,,,,,,,,,,,,,0,,,,,P,prés,,,1651,-0.132868,44.434193
2021-537728,2021-08-13,000001,Vente,244690,78,,FALY SUD,B044,33430,33178,Gajac,33,,,331780000C0148,,,,,,,,,,,,,0,1,Maison,104,5,S,sols,,,757,-0.125315,44.436474
2021-537728,2021-08-13,000001,Vente,244690,,,MADIC-EST,B072,33430,33178,Gajac,33,,,331780000C0587,,,,,,,,,,,,,0,,,,,S,sols,,,36,-0.125689,44.436527
2021-537728,2021-08-13,000001,Vente,244690,,,MADIC-EST,B072,33430,33178,Gajac,33,,,331780000C0587,,,,,,,,,,,,,0,,,,,J,jardins,,,1215,-0.125689,44.436527
2021-537728,2021-08-13,000001,Vente,244690,,,MADIC-EST,B072,33430,33178,Gajac,33,,,331780000C0588,,,,,,,,,,,,,0,,,,,P,prés,,,7391,-0.1262,44.435616
2021-537728,2021-08-13,000001,Vente,244690,,,MADIC-EST,B072,33430,33178,Gajac,33,,,331780000C0612,,,,,,,,,,,,,0,,,,,P,prés,,,74,-0.12569,44.436637
2021-537728,2021-08-13,000001,Vente,244690,,,FALY SUD,B044,33430,33178,Gajac,33,,,331780000C0614,,,,,,,,,,,,,0,,,,,P,prés,,,46,-0.125283,44.436637
