id_mutation,date_mutation,numero_disposition,nature_mutation,valeur_fonciere,adresse_numero,adresse_suffixe,adresse_nom_voie,adresse_code_voie,code_postal,code_commune,nom_commune,code_departement,ancien_code_commune,ancien_nom_commune,id_parcelle,ancien_id_parcelle,numero_volume,lot1_numero,lot1_surface_carrez,lot2_numero,lot2_surface_carrez,lot3_numero,lot3_surface_carrez,lot4_numero,lot4_surface_carrez,lot5_numero,lot5_surface_carrez,nombre_lots,code_type_local,type_local,surface_reelle_bati,nombre_pieces_principales,code_nature_culture,nature_culture,code_nature_culture_speciale,nature_culture_speciale,surface_terrain,longitude,latitude
2021-524379,2021-02-12,000001,Vente,181000,,,MONCAT,B047,33190,33346,Puybarban,33,,,333460000B0033,,,,,,,,,,,,,0,,,,,P,prés,,,1045,-0.080385,44.549447
2021-524379,2021-02-12,000001,Vente,181000,12,,MONCAT,B047,33190,33346,Puybarban,33,,,333460000B0595,,,,,,,,,,,,,0,1,Maison,130,4,S,sols,,,117,-0.080432,44.549734
2021-524444,2021-02-26,000001,Vente,270000,2,,NOAILLAN,B077,33190,33346,Puybarban,33,,,333460000B0746,,,,,,,,,,,,,0,1,Maison,106,4,S,sols,,,1200,-0.076176,44.544558
2021-524444,2021-02-26,000001,Vente,270000,2,B,NOAILLAN,B077,33190,33346,Puybarban,33,,,333460000B0747,,,,,,,,,,,,,0,4,Local industriel. commercial ou assimilé,120,0,AG,terrains d'agrément,,,1490,-0.075662,44.544573
2021-524444,2021-02-26,000001,Vente,270000,2,B,NOAILLAN,B077,33190,33346,Puybarban,33,,,333460000B0747,,,,,,,,,,,,,0,4,Local industriel. commercial ou assimilé,120,0,S,sols,,,500,-0.075662,44.544573
2021-524460,2021-02-13,000001,Vente,70000,,,A DUGA,B023,33190,33346,Puybarban,33,,,333460000A0215,,,,,,,,,,,,,0,,,,,T,terres,,,5045,-0.076768,44.556109
2021-524460,2021-02-13,000001,Vente,70000,,,A DUGA,B023,33190,33346,Puybarban,33,,,333460000A0217,,,,,,,,,,,,,0,,,,,J,jardins,,,730,-0.076146,44.556035
2021-524460,2021-02-13,000001,Vente,70000,102,,A DUGA,B023,33190,33346,Puybarban,33,,,333460000A0796,,,,,,,,,,,,,0,1,Maison,108,4,S,sols,,,1201,-0.076307,44.556293
2021-524460,2021-02-13,000001,Vente,70000,,,A DUGA,B023,33190,33346,Puybarban,33,,,333460000A0797,,,,,,,,,,,,,0,,,,,S,sols,,,4,-0.076117,44.556088
2021-525019,2021-03-04,000002,Vente,13500,,,CARBONADE,B012,33190,33346,Puybarban,33,,,333460000A0161,,,,,,,,,,,,,0,,,,,VE,vergers,,,2715,-0.079875,44.55909
2021-525057,2021-03-09,000001,Vente,77000,,,BARENNE,B002,33190,33346,Puybarban,33,,,333460000A0530,,,,,,,,,,,,,0,,,,,BT,taillis simples,,,2065,-0.068156,44.554467
2021-525057,2021-03-09,000001,Vente,77000,,,BARENNE,B002,33190,33346,Puybarban,33,,,333460000A0795,,,,,,,,,,,,,0,,,,,S,sols,,,91,-0.067411,44.554987
2021-525057,2021-03-09,000001,Vente,77000,,,BARENNE,B002,33190,33346,Puybarban,33,,,333460000A0848,,,,,,,,,,,,,0,,,,,P,prés,,,1263,-0.067557,44.554567
2021-525057,2021-03-09,000001,Vente,77000,,,BARENNE,B002,33190,33346,Puybarban,33,,,333460000A0850,,,,,,,,,,,,,0,,,,,P,prés,,,3022,-0.067665,44.554948
2021-525230,2021-03-10,000001,Vente,262800,3,,LE GUERFE,B026,33190,33346,Puybarban,33,,,333460000B0043,,,,,,,,,,,,,0,1,Maison,135,5,S,sols,,,800,-0.07626,44.547768
2021-525230,2021-03-10,000001,Vente,262800,,,LE GUERFE,B026,33190,33346,Puybarban,33,,,333460000B0044,,,,,,,,,,,,,0,,,,,J,jardins,,,1000,-0.076242,44.54759
2021-525230,2021-03-10,000001,Vente,262800,,,LE GUERFE,B026,33190,33346,Puybarban,33,,,333460000B0769,,,,,,,,,,,,,0,,,,,T,terres,,,2315,-0.075793,44.547702
2021-525230,2021-03-10,000001,Vente,262800,,,LE GUERFE,B026,33190,33346,Puybarban,33,,,333460000B0914,,,,,,,,,,,,,0,,,,,T,terres,,,1089,-0.075931,44.547872
2021-531914,2021-06-17,000001,Vente,217000,7,,LAPIERRE-SUD,B041,33190,33346,Puybarban,33,,,333460000B0116,,,,,,,,,,,,,0,1,Maison,200,7,S,sols,,,278,-0.07017,44.551549
2021-531914,2021-06-17,000001,Vente,217000,7,,LAPIERRE-SUD,B041,33190,33346,Puybarban,33,,,333460000B0116,,,,,,,,,,,,,0,3,Dépendance,,0,S,sols,,,278,-0.07017,44.551549
2021-531914,2021-06-17,000001,Vente,217000,,,LAPIERRE-SUD,B041,33190,33346,Puybarban,33,,,333460000B0599,,,,,,,,,,,,,0,,,,,J,jardins,,,94,-0.070137,44.55149
2021-531914,2021-06-17,000001,Vente,217000,,,LAPIERRE-SUD,B041,33190,33346,Puybarban,33,,,333460000B0633,,,,,,,,,,,,,0,,,,,S,sols,,,500,-0.070139,44.551223
2021-531914,2021-06-17,000001,Vente,217000,,,LAPIERRE-SUD,B041,33190,33346,Puybarban,33,,,333460000B0633,,,,,,,,,,,,,0,,,,,T,terres,,,783,-0.070139,44.551223
2021-531931,2021-06-25,000001,Vente,25000,65,,LA PICHARDE,B058,33190,33346,Puybarban,33,,,333460000B0542,,,,,,,,,,,,,0,1,Maison,140,3,S,sols,,,1025,-0.056929,44.524022
2021-531931,2021-06-25,000001,Vente,25000,,,LA PICHARDE,B058,33190,33346,Puybarban,33,,,333460000B0543,,,,,,,,,,,,,0,,,,,P,prés,,,1160,-0.059614,44.524312
2021-531931,2021-06-25,000001,Vente,25000,,,LA PICHARDE,B058,33190,33346,Puybarban,33,,,333460000B0544,,,,,,,,,,,,,0,,,,,VI,vignes,,,1700,-0.059076,44.524041
2021-531931,2021-06-25,000001,Vente,25000,,,LA PICHARDE,B058,33190,33346,Puybarban,33,,,333460000B0545,,,,,,,,,,,,,0,,,,,T,terres,,,12515,-0.058103,44.524001
2021-531931,2021-06-25,000001,Vente,25000,,,LA PICHARDE,B058,33190,33346,Puybarban,33,,,333460000B0714,,,,,,,,,,,,,0,,,,,T,terres,,,11064,-0.057043,44.523946
2021-534427,2021-07-05,000001,Vente,225000,,,LA PALUE,B055,33190,33346,Puybarban,33,,,333460000A0124,,,,,,,,,,,,,0,,,,,VE,vergers,,,8175,-0.079007,44.560315
2021-534427,2021-07-05,000001,Vente,225000,,,LE SENDIEUX,B067,33190,33346,Puybarban,33,,,333460000A0177,,,,,,,,,,,,,0,,,,,VE,vergers,,,8765,-0.079844,44.561333
2021-534427,2021-07-05,000001,Vente,225000,,,LE SENDIEUX,B067,33190,33346,Puybarban,33,,,333460000A0178,,,,,,,,,,,,,0,,,,,VE,vergers,,,5645,-0.078989,44.56124
2021-534427,2021-07-05,000001,Vente,225000,,,LE SENDIEUX,B067,33190,33346,Puybarban,33,,,333460000A0185,,,,,,,,,,,,,0,,,,,VE,vergers,,,4135,-0.079768,44.562216
2021-534427,2021-07-05,000001,Vente,225000,,,LE SENDIEUX,B067,33190,33346,Puybarban,33,,,333460000A0186,,,,,,,,,,,,,0,,,,,VE,vergers,,,1015,-0.080132,44.562127
2021-534427,2021-07-05,000001,Vente,225000,,,CARBONADE,B012,33190,33346,Puybarban,33,,,333460000A0686,,,,,,,,,,,,,0,,,,,BO,oseraies,,,988,-0.08071,44.560625
2021-534427,2021-07-05,000001,Vente,225000,,,CARBONADE,B012,33190,33346,Puybarban,33,,,333460000A0856,,,,,,,,,,,,,0,,,,,VE,vergers,,,11422,-0.079953,44.560353
2021-536715,2021-07-29,000001,Vente,245500,,,POUCHON,B061,33190,33346,Puybarban,33,,,333460000B0706,,,,,,,,,,,,,0,,,,,AG,terrains d'agrément,,,1529,-0.076716,44.552707
2021-536715,2021-07-29,000001,Vente,245500,1,,POUCHON,B061,33190,33346,Puybarban,33,,,333460000B0707,,,,,,,,,,,,,0,3,Dépendance,,0,S,sols,,,785,-0.076695,44.552896
2021-536715,2021-07-29,000001,Vente,245500,1,,POUCHON,B061,33190,33346,Puybarban,33,,,333460000B0707,,,,,,,,,,,,,0,1,Maison,200,2,AG,terrains d'agrément,,,742,-0.076695,44.552896
2021-536715,2021-07-29,000001,Vente,245500,1,,POUCHON,B061,33190,33346,Puybarban,33,,,333460000B0707,,,,,,,,,,,,,0,3,Dépendance,,0,AG,terrains d'agrément,,,742,-0.076695,44.552896
2021-536715,2021-07-29,000001,Vente,245500,1,,POUCHON,B061,33190,33346,Puybarban,33,,,333460000B0707,,,,,,,,,,,,,0,1,Maison,200,2,S,sols,,,785,-0.076695,44.552896
2021-537552,2021-08-31,000001,Vente,140000,,,DARBOUCAN,B022,33190,33346,Puybarban,33,,,333460000B0270,,,,,,,,,,,,,0,,,,,S,sols,,,1021,-0.067922,44.530148
2021-537552,2021-08-31,000001,Vente,140000,,,DARBOUCAN,B022,33190,33346,Puybarban,33,,,333460000B0270,,,,,,,,,,,,,0,,,,,BT,taillis simples,ACACI,Acacias,473,-0.067922,44.530148
2021-537552,2021-08-31,000001,Vente,140000,,,DARBOUCAN,B022,33190,33346,Puybarban,33,,,333460000B0270,,,,,,,,,,,,,0,,,,,BT,taillis simples,ACACI,Acacias,12352,-0.067922,44.530148
2021-537552,2021-08-31,000001,Vente,140000,,,DARBOUCAN,B022,33190,33346,Puybarban,33,,,333460000B0270,,,,,,,,,,,,,0,,,,,BR,futaies résineuses,PIN,Pins,7599,-0.067922,44.530148
2021-537552,2021-08-31,000001,Vente,140000,,,DARBOUCAN,B022,33190,33346,Puybarban,33,,,333460000B0271,,,,,,,,,,,,,0,,,,,S,sols,,,1545,-0.068147,44.530728
2021-537552,2021-08-31,000001,Vente,140000,,,DARBOUCAN,B022,33190,33346,Puybarban,33,,,333460000B0272,,,,,,,,,,,,,0,,,,,BR,futaies résineuses,PIN,Pins,300,-0.067843,44.530643
2021-537552,2021-08-31,000001,Vente,140000,,,DARBOUCAN,B022,33190,33346,Puybarban,33,,,333460000B0272,,,,,,,,,,,,,0,,,,,L,landes,,,270,-0.067843,44.530643
2021-537552,2021-08-31,000001,Vente,140000,,,DARBOUCAN,B022,33190,33346,Puybarban,33,,,333460000B0272,,,,,,,,,,,,,0,,,,,BR,futaies résineuses,PIN,Pins,555,-0.067843,44.530643
2021-537552,2021-08-31,000001,Vente,140000,,,DARBOUCAN,B022,33190,33346,Puybarban,33,,,333460000B0272,,,,,,,,,,,,,0,,,,,S,sols,,,1530,-0.067843,44.530643
2021-537552,2021-08-31,000001,Vente,140000,,,DARBOUCAN,B022,33190,33346,Puybarban,33,,,333460000B0273,,,,,,,,,,,,,0,,,,,BR,futaies résineuses,PIN,Pins,5549,-0.067041,44.531054
2021-537552,2021-08-31,000001,Vente,140000,,,DARBOUCAN,B022,33190,33346,Puybarban,33,,,333460000B0273,,,,,,,,,,,,,0,,,,,BT,taillis simples,ACACI,Acacias,263,-0.067041,44.531054
2021-537552,2021-08-31,000001,Vente,140000,,,DARBOUCAN,B022,33190,33346,Puybarban,33,,,333460000B0273,,,,,,,,,,,,,0,,,,,L,landes,,,1730,-0.067041,44.531054
2021-537552,2021-08-31,000001,Vente,140000,,,DARBOUCAN,B022,33190,33346,Puybarban,33,,,333460000B0273,,,,,,,,,,,,,0,,,,,S,sols,,,220,-0.067041,44.531054
2021-537552,2021-08-31,000001,Vente,140000,,,DARBOUCAN,B022,33190,33346,Puybarban,33,,,333460000B0273,,,,,,,,,,,,,0,,,,,BR,futaies résineuses,PIN,Pins,25963,-0.067041,44.531054
2021-537552,2021-08-31,000001,Vente,140000,,,JEAN-CHOYNE,B032,33190,33346,Puybarban,33,,,333460000B0740,,,,,,,,,,,,,0,,,,,BR,futaies résineuses,PIN,Pins,342,-0.065944,44.531257
2021-540076,2021-10-01,000001,Vente,3600,,,BARENNE,B002,33190,33346,Puybarban,33,,,333460000A0852,,,,,,,,,,,,,0,,,,,T,terres,,,1112,-0.067977,44.55375
2021-540076,2021-10-01,000001,Vente,3600,,,BARENNE,B002,33190,33346,Puybarban,33,,,333460000A0854,,,,,,,,,,,,,0,,,,,T,terres,,,1755,-0.06789,44.553436
2021-540079,2021-10-01,000002,Vente,3400,,,BARENNE,B002,33190,33346,Puybarban,33,,,333460000A0853,,,,,,,,,,,,,0,,,,,T,terres,,,1153,-0.068541,44.55379
2021-540079,2021-10-01,000002,Vente,3400,,,BARENNE,B002,33190,33346,Puybarban,33,,,333460000A0855,,,,,,,,,,,,,0,,,,,T,terres,,,1570,-0.068601,44.55344
2021-545228,2021-11-29,000001,Vente,115000,,,AU HAY,B029,33190,33346,Puybarban,33,,,333460000A0574,,,,,,,,,,,,,0,,,,,T,terres,,,720,-0.075323,44.555302
2021-545228,2021-11-29,000001,Vente,115000,,,AU HAY,B029,33190,33346,Puybarban,33,,,333460000A0574,,,,,,,,,,,,,0,,,,,T,terres,,,359,-0.075323,44.555302
2021-545228,2021-11-29,000001,Vente,115000,1,,AU HAY,B029,33190,33346,Puybarban,33,,,333460000A0786,,,,,,,,,,,,,0,3,Dépendance,,0,S,sols,,,270,-0.07563,44.555292
2021-545228,2021-11-29,000001,Vente,115000,1,,AU HAY,B029,33190,33346,Puybarban,33,,,333460000A0786,,,,,,,,,,,,,0,1,Maison,120,4,S,sols,,,270,-0.07563,44.555292
2021-545228,2021-11-29,000001,Vente,115000,,,AU HAY,B029,33190,33346,Puybarban,33,,,333460000A0787,,,,,,,,,,,,,0,,,,,S,sols,,,84,-0.075114,44.555362
