id_mutation,date_mutation,numero_disposition,nature_mutation,valeur_fonciere,adresse_numero,adresse_suffixe,adresse_nom_voie,adresse_code_voie,code_postal,code_commune,nom_commune,code_departement,ancien_code_commune,ancien_nom_commune,id_parcelle,ancien_id_parcelle,numero_volume,lot1_numero,lot1_surface_carrez,lot2_numero,lot2_surface_carrez,lot3_numero,lot3_surface_carrez,lot4_numero,lot4_surface_carrez,lot5_numero,lot5_surface_carrez,nombre_lots,code_type_local,type_local,surface_reelle_bati,nombre_pieces_principales,code_nature_culture,nature_culture,code_nature_culture_speciale,nature_culture_speciale,surface_terrain,longitude,latitude
2021-527192,2021-02-03,000001,Vente,7500,,,LE BAYSSE,B001,33660,33347,Puynormand,33,,,333470000B0102,,,,,,,,,,,,,0,,,,,T,terres,,,2285,0.014179,44.97982
2021-527192,2021-02-03,000001,Vente,7500,,,AU PIGNET,B065,33660,33347,Puynormand,33,,,333470000C0065,,,,,,,,,,,,,0,,,,,L,landes,,,17980,-0.002826,44.970708
2021-527192,2021-02-03,000001,Vente,7500,,,AU PIGNET,B065,33660,33347,Puynormand,33,,,333470000C0065,,,,,,,,,,,,,0,,,,,BR,futaies résineuses,PIN,Pins,37288,-0.002826,44.970708
2021-527192,2021-02-03,000001,Vente,7500,,,AU PIGNET,B065,33660,33347,Puynormand,33,,,333470000C0065,,,,,,,,,,,,,0,,,,,B,bois,,,12429,-0.002826,44.970708
2021-527192,2021-02-03,000001,Vente,7500,,,L HOMME MORT,B043,33660,33347,Puynormand,33,,,333470000C0195,,,,,,,,,,,,,0,,,,,BR,futaies résineuses,PIN,Pins,1900,-0.016147,44.980672
2021-527192,2021-02-03,000001,Vente,7500,,,PARET,B054,33660,33347,Puynormand,33,,,33347000ZA0119,,,,,,,,,,,,,0,,,,,B,bois,,,1926,-0.007497,44.995034
2021-527192,2021-02-03,000001,Vente,7500,,,PARET,B054,33660,33347,Puynormand,33,,,33347000ZA0119,,,,,,,,,,,,,0,,,,,BR,futaies résineuses,PIN,Pins,1925,-0.007497,44.995034
2021-527718,2021-02-24,000001,Vente,20000,,,PRAIRIE,B066,33660,33347,Puynormand,33,,,333470000B0397,,,,,,,,,,,,,0,,,,,L,landes,,,9145,0.008311,44.964976
2021-527718,2021-02-24,000001,Vente,20000,,,PRAIRIE,B066,33660,33347,Puynormand,33,,,333470000B0400,,,,,,,,,,,,,0,,,,,T,terres,,,6685,0.009596,44.96383
2021-527718,2021-02-24,000001,Vente,20000,,,PRAIRIE,B066,33660,33347,Puynormand,33,,,333470000B0400,,,,,,,,,,,,,0,,,,,BT,taillis simples,,,3315,0.009596,44.96383
2021-527718,2021-02-24,000001,Vente,20000,,,PRAIRIE,B066,33660,33347,Puynormand,33,,,333470000B0401,,,,,,,,,,,,,0,,,,,BT,taillis simples,,,1020,0.009486,44.964332
2021-527718,2021-02-24,000001,Vente,20000,,,PRAIRIE,B066,33660,33347,Puynormand,33,,,333470000B0401,,,,,,,,,,,,,0,,,,,T,terres,,,12410,0.009486,44.964332
2021-527718,2021-02-24,000001,Vente,20000,,,PRAIRIE,B066,33660,33347,Puynormand,33,,,333470000B0915,,,,,,,,,,,,,0,,,,,L,landes,,,1555,0.007898,44.96572
2021-528176,2021-03-20,000001,Vente,28000,,,LE BOURG-SUD,B015,33660,33347,Puynormand,33,,,333470000B0691,,,,,,,,,,,,,0,,,,,P,prés,,,1011,-0.001368,44.982103
2021-528176,2021-03-20,000001,Vente,28000,,,LE BOURG-SUD,B015,33660,33347,Puynormand,33,,,333470000B1160,,,,,,,,,,,,,0,,,,,S,sols,,,97,-0.001319,44.982286
2021-530091,2021-05-27,000001,Vente,35000,,,RAZAT,B075,33660,33347,Puynormand,33,,,333470000A0420,,,,,,,,,,,,,0,,,,,T,terres,,,970,,
2021-530091,2021-05-27,000001,Vente,35000,,,RAZAT,B075,33660,33347,Puynormand,33,,,333470000A0421,,,,,,,,,,,,,0,,,,,T,terres,,,595,,
2021-531162,2021-06-07,000002,Echange,1,,,RAZAT,B075,33660,33347,Puynormand,33,,,333470000A1305,,,,,,,,,,,,,0,,,,,S,sols,,,27,0.00347,44.988397
2021-531162,2021-06-07,000003,Echange,1,,,RAZAT,B075,33660,33347,Puynormand,33,,,333470000A1303,,,,,,,,,,,,,0,,,,,S,sols,,,1,0.003359,44.988388
2021-531712,2021-06-01,000001,Vente,3000,,,LE BOURG-SUD,B015,33660,33347,Puynormand,33,,,333470000B1160,,,,,,,,,,,,,0,,,,,S,sols,,,97,-0.001319,44.982286
2021-534201,2021-07-20,000001,Vente,90000,,,LE BOURG NORD,B011,33660,33347,Puynormand,33,,,333470000A0094,,,,,,,,,,,,,0,,,,,S,sols,,,60,-0.001474,44.983152
2021-534201,2021-07-20,000001,Vente,90000,10,,LE BOURG NORD,B011,33660,33347,Puynormand,33,,,333470000A0972,,,,,,,,,,,,,0,1,Maison,66,3,S,sols,,,335,-0.00134,44.983243
2021-534201,2021-07-20,000001,Vente,90000,,,LE BOURG NORD,B011,33660,33347,Puynormand,33,,,333470000A1052,,,,,,,,,,,,,0,,,,,S,sols,,,206,-0.00133,44.983384
2021-534887,2021-07-28,000001,Vente,169000,136,,REGE LONGUE,B076,33660,33347,Puynormand,33,,,333470000A1049,,,,,,,,,,,,,0,1,Maison,85,4,S,sols,,,1239,0.003793,44.988003
2021-534887,2021-07-28,000001,Vente,169000,136,,REGE LONGUE,B076,33660,33347,Puynormand,33,,,333470000A1049,,,,,,,,,,,,,0,1,Maison,85,4,P,prés,,,1587,0.003793,44.988003
2021-534887,2021-07-28,000001,Vente,169000,,,REGE LONGUE,B076,33660,33347,Puynormand,33,,,333470000A1050,,,,,,,,,,,,,0,,,,,P,prés,,,873,0.004082,44.987908
2021-535516,2021-07-13,000001,Vente,241000,16,,LE BOURG NORD,B011,33660,33347,Puynormand,33,,,333470000A1252,,,,,,,,,,,,,0,1,Maison,58,2,S,sols,,,734,0.000438,44.983029
2021-535516,2021-07-13,000001,Vente,241000,16,,LE BOURG NORD,B011,33660,33347,Puynormand,33,,,333470000A1252,,,,,,,,,,,,,0,3,Dépendance,,0,S,sols,,,734,0.000438,44.983029
2021-535516,2021-07-13,000001,Vente,241000,,,LE BOURG-SUD,B015,33660,33347,Puynormand,33,,,333470000B0935,,,,,,,,,,,,,0,,,,,T,terres,,,324,0.000981,44.9829
2021-537150,2021-08-25,000001,Vente,180600,,,LE BOURG NORD,B011,33660,33347,Puynormand,33,,,333470000A0107,,,,,,,,,,,,,0,,,,,T,terres,,,1845,0.00056,44.983574
2021-537150,2021-08-25,000001,Vente,180600,14,,LE BOURG NORD,B011,33660,33347,Puynormand,33,,,333470000A0108,,,,,,,,,,,,,0,1,Maison,156,4,S,sols,,,680,0.000692,44.983357
2021-537538,2021-06-07,000001,Vente,160000,,,RAZAT,B075,33660,33347,Puynormand,33,,,333470000A1303,,,,,,,,,,,,,0,,,,,S,sols,,,1,0.003359,44.988388
2021-537538,2021-06-07,000001,Vente,160000,11,,RAZAT,B075,33660,33347,Puynormand,33,,,333470000A1304,,,,,,,,,,,,,0,1,Maison,90,4,S,sols,,,646,0.003409,44.988559
2021-537538,2021-06-07,000001,Vente,160000,11,,RAZAT,B075,33660,33347,Puynormand,33,,,333470000A1304,,,,,,,,,,,,,0,3,Dépendance,,0,S,sols,,,646,0.003409,44.988559
2021-537538,2021-06-07,000001,Vente,160000,11,,RAZAT,B075,33660,33347,Puynormand,33,,,333470000A1304,,,,,,,,,,,,,0,3,Dépendance,,0,S,sols,,,646,0.003409,44.988559
2021-538277,2021-09-08,000001,Vente,55000,,,PRE DE RIEUX,B068,33660,33347,Puynormand,33,,,33347000ZA0087,,,,,,,,,,,,,0,,,,,T,terres,,,2344,0.001025,44.995138
2021-538277,2021-09-08,000001,Vente,55000,,,PRE DE RIEUX,B068,33660,33347,Puynormand,33,,,33347000ZA0087,,,,,,,,,,,,,0,,,,,VI,vignes,,,4855,0.001025,44.995138
2021-538277,2021-09-08,000001,Vente,55000,,,PRE DE RIEUX,B068,33660,33347,Puynormand,33,,,33347000ZA0087,,,,,,,,,,,,,0,,,,,S,sols,,,423,0.001025,44.995138
2021-541158,2021-10-20,000001,Vente,45000,,,AU LOYAU,B047,33660,33347,Puynormand,33,,,333470000B0443,,,,,,,,,,,,,0,,,,,VI,vignes,,,2745,0.004862,44.969877
2021-541158,2021-10-20,000001,Vente,45000,,,AU LOYAU,B047,33660,33347,Puynormand,33,,,333470000B0444,,,,,,,,,,,,,0,,,,,P,prés,,,3750,0.004712,44.970179
2021-541158,2021-10-20,000001,Vente,45000,,,AU LOYAU,B047,33660,33347,Puynormand,33,,,333470000B0445,,,,,,,,,,,,,0,,,,,P,prés,,,5380,0.004479,44.970674
2021-541158,2021-10-20,000001,Vente,45000,,,AU LOYAU,B047,33660,33347,Puynormand,33,,,333470000B0446,,,,,,,,,,,,,0,,,,,VI,vignes,,,1705,0.005477,44.971126
2021-541158,2021-10-20,000001,Vente,45000,,,AU LOYAU,B047,33660,33347,Puynormand,33,,,333470000B0448,,,,,,,,,,,,,0,,,,,T,terres,,,1800,0.005366,44.970756
2021-541158,2021-10-20,000001,Vente,45000,,,LE DROUILLA,B031,33660,33347,Puynormand,33,,,333470000B0541,,,,,,,,,,,,,0,,,,,VI,vignes,,,11580,0.005699,44.971744
2021-541158,2021-10-20,000001,Vente,45000,,,LE DROUILLA,B031,33660,33347,Puynormand,33,,,333470000B0542,,,,,,,,,,,,,0,,,,,VI,vignes,,,635,0.004873,44.971638
2021-541158,2021-10-20,000001,Vente,45000,,,LE COUNIASSOU,B027,33660,33347,Puynormand,33,,,333470000B0565,,,,,,,,,,,,,0,,,,,VI,vignes,,,3380,0.004036,44.973259
2021-541158,2021-10-20,000001,Vente,45000,,,LE COUNIASSOU,B027,33660,33347,Puynormand,33,,,333470000B0566,,,,,,,,,,,,,0,,,,,VI,vignes,,,6860,0.003076,44.973169
2021-541158,2021-10-20,000001,Vente,45000,,,LE COUNIASSOU,B027,33660,33347,Puynormand,33,,,333470000B0567,,,,,,,,,,,,,0,,,,,VI,vignes,,,1595,0.003492,44.973778
2021-541158,2021-10-20,000001,Vente,45000,,,LE COUNIASSOU,B027,33660,33347,Puynormand,33,,,333470000B0568,,,,,,,,,,,,,0,,,,,VI,vignes,,,1740,0.003602,44.973847
2021-541158,2021-10-20,000001,Vente,45000,,,LE COUNIASSOU,B027,33660,33347,Puynormand,33,,,333470000B0569,,,,,,,,,,,,,0,,,,,T,terres,,,890,0.003688,44.973926
2021-541158,2021-10-20,000001,Vente,45000,,,LE COUNIASSOU,B027,33660,33347,Puynormand,33,,,333470000B0569,,,,,,,,,,,,,0,,,,,VI,vignes,,,1120,0.003688,44.973926
2021-541158,2021-10-20,000001,Vente,45000,,,LE COUNIASSOU,B027,33660,33347,Puynormand,33,,,333470000B0571,,,,,,,,,,,,,0,,,,,VI,vignes,,,900,0.004465,44.973886
2021-541158,2021-10-20,000001,Vente,45000,,,LE COUNIASSOU,B027,33660,33347,Puynormand,33,,,333470000B0573,,,,,,,,,,,,,0,,,,,VI,vignes,,,2775,0.003473,44.974217
2021-541158,2021-10-20,000001,Vente,45000,,,AU LOYAU,B047,33660,33347,Puynormand,33,,,333470000B0913,,,,,,,,,,,,,0,,,,,VI,vignes,,,2920,0.005056,44.969632
2021-541158,2021-10-20,000001,Vente,45000,,,LE DROUILLA,B031,33660,33347,Puynormand,33,,,333470000B0928,,,,,,,,,,,,,0,,,,,J,jardins,,,855,0.004197,44.970939
2021-541158,2021-10-20,000001,Vente,45000,,,AU LOYAU,B047,33660,33347,Puynormand,33,,,333470000B0939,,,,,,,,,,,,,0,,,,,VI,vignes,,,618,0.006489,44.971497
2021-541158,2021-10-20,000001,Vente,45000,,,AU LOYAU,B047,33660,33347,Puynormand,33,,,333470000B0940,,,,,,,,,,,,,0,,,,,T,terres,,,5462,0.006089,44.971111
2021-541158,2021-10-20,000001,Vente,45000,,,LE DROUILLA,B031,33660,33347,Puynormand,33,,,333470000B1125,,,,,,,,,,,,,0,,,,,VI,vignes,,,6528,0.00767,44.970946
2021-543334,2021-11-15,000001,Vente,102000,,,RAZAT,B075,33660,33347,Puynormand,33,,,333470000A0437,,,,,,,,,,,,,0,,,,,P,prés,,,600,0.003161,44.988826
2021-543334,2021-11-15,000001,Vente,102000,,,RAZAT,B075,33660,33347,Puynormand,33,,,333470000A0438,,,,,,,,,,,,,0,,,,,P,prés,,,290,0.00292,44.988786
2021-543334,2021-11-15,000001,Vente,102000,,,RAZAT,B075,33660,33347,Puynormand,33,,,333470000A0439,,,,,,,,,,,,,0,,,,,P,prés,,,290,0.002771,44.988717
2021-543334,2021-11-15,000001,Vente,102000,16,,RAZAT,B075,33660,33347,Puynormand,33,,,333470000A0440,,,,,,,,,,,,,0,1,Maison,157,5,S,sols,,,525,0.002845,44.988571
2021-543354,2021-10-28,000001,Vente,224500,,,VILLATTE EST,B096,33660,33347,Puynormand,33,,,333470000B0846,,,,,,,,,,,,,0,,,,,T,terres,,,7188,0.005988,44.984833
2021-543354,2021-10-28,000001,Vente,224500,97,,VILLATTE EST,B096,33660,33347,Puynormand,33,,,333470000B0847,,,,,,,,,,,,,0,1,Maison,175,6,S,sols,,,1474,0.005723,44.984373
2021-543354,2021-10-28,000001,Vente,224500,,,VILLATTE EST,B096,33660,33347,Puynormand,33,,,333470000B0848,,,,,,,,,,,,,0,,,,,T,terres,,,967,0.006187,44.984677
2021-543354,2021-10-28,000001,Vente,224500,,,VILLATTE EST,B096,33660,33347,Puynormand,33,,,333470000B0849,,,,,,,,,,,,,0,,,,,T,terres,,,275,0.006453,44.985281
2021-543354,2021-10-28,000001,Vente,224500,,,VILLATTE EST,B096,33660,33347,Puynormand,33,,,333470000B1007,,,,,,,,,,,,,0,,,,,T,terres,,,421,0.006538,44.985354
2021-543354,2021-10-28,000001,Vente,224500,,,VILLATTE EST,B096,33660,33347,Puynormand,33,,,333470000B1009,,,,,,,,,,,,,0,,,,,T,terres,,,688,0.00631,44.984586
2021-544667,2021-11-16,000001,Vente,3273.14,,,LES BOUIGES,B009,33660,33347,Puynormand,33,,,333470000B0202,,,,,,,,,,,,,0,,,,,BP,peupleraies,,,1088,0.009674,44.976719
2021-544667,2021-11-16,000001,Vente,3273.14,,,LE GRAND BARRADIS,B038,33660,33347,Puynormand,33,,,333470000C0321,,,,,,,,,,,,,0,,,,,BT,taillis simples,,,21897,-0.018237,44.984236
2021-545106,2021-11-18,000001,Vente,45300,,,LE BOURG-SUD,B015,33660,33347,Puynormand,33,,,333470000B0705,,,,,,,,,,,,,0,,,,,P,prés,,,580,-0.000345,44.982403
2021-545106,2021-11-18,000001,Vente,45300,76,,LE BOURG-SUD,B015,33660,33347,Puynormand,33,,,333470000B0942,,,,,,,,,,,,,0,3,Dépendance,,0,S,sols,,,372,-0.000157,44.982453
2021-545106,2021-11-18,000001,Vente,45300,76,,LE BOURG-SUD,B015,33660,33347,Puynormand,33,,,333470000B0942,,,,,,,,,,,,,0,1,Maison,120,5,S,sols,,,372,-0.000157,44.982453
