id_mutation,date_mutation,numero_disposition,nature_mutation,valeur_fonciere,adresse_numero,adresse_suffixe,adresse_nom_voie,adresse_code_voie,code_postal,code_commune,nom_commune,code_departement,ancien_code_commune,ancien_nom_commune,id_parcelle,ancien_id_parcelle,numero_volume,lot1_numero,lot1_surface_carrez,lot2_numero,lot2_surface_carrez,lot3_numero,lot3_surface_carrez,lot4_numero,lot4_surface_carrez,lot5_numero,lot5_surface_carrez,nombre_lots,code_type_local,type_local,surface_reelle_bati,nombre_pieces_principales,code_nature_culture,nature_culture,code_nature_culture_speciale,nature_culture_speciale,surface_terrain,longitude,latitude
2021-526970,2021-01-08,000001,Vente,460450,1,,AU CLOU,B011,33126,33356,La Rivière,33,,,333560000A0002,,,,,,,,,,,,,0,1,Maison,250,6,S,sols,,,450,-0.326954,44.934333
2021-526970,2021-01-08,000001,Vente,460450,,,AU CLOU,B011,33126,33356,La Rivière,33,,,333560000A0310,,,,,,,,,,,,,0,,,,,P,prés,,,14389,-0.326904,44.934781
2021-526970,2021-01-08,000001,Vente,460450,,,AU CLOU,B011,33126,33356,La Rivière,33,,,333560000A0432,,,,,,,,,,,,,0,,,,,P,prés,,,1818,-0.32829,44.936279
2021-528456,2021-04-09,000001,Vente,228900,57,,RUE DES COTEAUX,0300,33126,33356,La Rivière,33,,,333560000B0776,,,,,,,,,,,,,0,1,Maison,93,4,T,terres,,,943,-0.312435,44.936861
2021-528456,2021-04-09,000001,Vente,228900,57,,RUE DES COTEAUX,0300,33126,33356,La Rivière,33,,,333560000B0776,,,,,,,,,,,,,0,1,Maison,93,4,S,sols,,,500,-0.312435,44.936861
2021-534214,2021-06-28,000001,Vente,385000,64,,RUE DES COTEAUX,0300,33126,33356,La Rivière,33,,,333560000B0771,,,,,,,,,,,,,0,3,Dépendance,,0,S,sols,,,500,-0.312553,44.937653
2021-534214,2021-06-28,000001,Vente,385000,64,,RUE DES COTEAUX,0300,33126,33356,La Rivière,33,,,333560000B0771,,,,,,,,,,,,,0,1,Maison,129,4,S,sols,,,500,-0.312553,44.937653
2021-534214,2021-06-28,000001,Vente,385000,64,,RUE DES COTEAUX,0300,33126,33356,La Rivière,33,,,333560000B0771,,,,,,,,,,,,,0,3,Dépendance,,0,S,sols,,,500,-0.312553,44.937653
2021-534214,2021-06-28,000001,Vente,385000,64,,RUE DES COTEAUX,0300,33126,33356,La Rivière,33,,,333560000B0771,,,,,,,,,,,,,0,3,Dépendance,,0,S,sols,,,500,-0.312553,44.937653
2021-534214,2021-06-28,000001,Vente,385000,64,,RUE DES COTEAUX,0300,33126,33356,La Rivière,33,,,333560000B0771,,,,,,,,,,,,,0,3,Dépendance,,0,S,sols,,,500,-0.312553,44.937653
2021-534214,2021-06-28,000001,Vente,385000,64,,RUE DES COTEAUX,0300,33126,33356,La Rivière,33,,,333560000B0771,,,,,,,,,,,,,0,1,Maison,129,4,T,terres,,,730,-0.312553,44.937653
2021-534214,2021-06-28,000001,Vente,385000,64,,RUE DES COTEAUX,0300,33126,33356,La Rivière,33,,,333560000B0771,,,,,,,,,,,,,0,3,Dépendance,,0,T,terres,,,730,-0.312553,44.937653
2021-534214,2021-06-28,000001,Vente,385000,64,,RUE DES COTEAUX,0300,33126,33356,La Rivière,33,,,333560000B0771,,,,,,,,,,,,,0,3,Dépendance,,0,T,terres,,,730,-0.312553,44.937653
2021-534214,2021-06-28,000001,Vente,385000,64,,RUE DES COTEAUX,0300,33126,33356,La Rivière,33,,,333560000B0771,,,,,,,,,,,,,0,3,Dépendance,,0,T,terres,,,730,-0.312553,44.937653
2021-534214,2021-06-28,000001,Vente,385000,64,,RUE DES COTEAUX,0300,33126,33356,La Rivière,33,,,333560000B0771,,,,,,,,,,,,,0,3,Dépendance,,0,T,terres,,,730,-0.312553,44.937653
2021-539747,2021-09-20,000001,Vente,44917.6,,,LA CLIDE,B010,33126,33356,La Rivière,33,,,333560000A0010,,,,,,,,,,,,,0,,,,,VI,vignes,,,14167,-0.323935,44.941095
2021-539747,2021-09-20,000001,Vente,44917.6,,,LA CLIDE,B010,33126,33356,La Rivière,33,,,333560000A0011,,,,,,,,,,,,,0,,,,,VI,vignes,,,3835,-0.322818,44.940908
2021-539747,2021-09-20,000001,Vente,44917.6,,,LE PASTIN,B024,33126,33356,La Rivière,33,,,333560000A0202,,,,,,,,,,,,,0,,,,,VI,vignes,,,5380,-0.317004,44.936445
2021-539747,2021-09-20,000001,Vente,44917.6,,,LES GRANDES HAGUES,B014,33126,33356,La Rivière,33,,,333560000B0034,,,,,,,,,,,,,0,,,,,VI,vignes,,,8960,-0.317301,44.933706
2021-539747,2021-09-20,000001,Vente,44917.6,,,LES GRANDES HAGUES,B014,33126,33356,La Rivière,33,,,333560000B0034,,,,,,,,,,,,,0,,,,,T,terres,,,850,-0.317301,44.933706
2021-539747,2021-09-20,000001,Vente,44917.6,,,LES GRANDES HAGUES,B014,33126,33356,La Rivière,33,,,333560000B0035,,,,,,,,,,,,,0,,,,,VI,vignes,,,2610,-0.316835,44.933964
2021-539747,2021-09-20,000001,Vente,44917.6,,,LEYGAT,B017,33126,33356,La Rivière,33,,,333560000B0093,,,,,,,,,,,,,0,,,,,VI,vignes,,,1805,-0.31297,44.933135
2021-539747,2021-09-20,000001,Vente,44917.6,,,LEYGAT,B017,33126,33356,La Rivière,33,,,333560000B0094,,,,,,,,,,,,,0,,,,,VI,vignes,,,3430,-0.312754,44.933349
2021-539747,2021-09-20,000001,Vente,44917.6,,,NICOUET,B023,33126,33356,La Rivière,33,,,333560000B0280,,,,,,,,,,,,,0,,,,,VI,vignes,,,2360,-0.308642,44.941649
2021-539747,2021-09-20,000001,Vente,44917.6,,,LES GRANDES HAGUES,B014,33126,33356,La Rivière,33,,,333560000B0488,,,,,,,,,,,,,0,,,,,T,terres,,,1310,-0.316174,44.933207
2021-539747,2021-09-20,000001,Vente,44917.6,,,LES GRANDES HAGUES,B014,33126,33356,La Rivière,33,,,333560000B0608,,,,,,,,,,,,,0,,,,,VI,vignes,,,5380,-0.316169,44.933714
2021-543526,2021-10-28,000001,Vente,239000,47,,RUE DES COTEAUX,0300,33126,33356,La Rivière,33,,,333560000B0825,,,,,,,,,,,,,0,3,Dépendance,,0,S,sols,,,604,-0.311595,44.935921
2021-543526,2021-10-28,000001,Vente,239000,47,,RUE DES COTEAUX,0300,33126,33356,La Rivière,33,,,333560000B0825,,,,,,,,,,,,,0,1,Maison,91,4,S,sols,,,604,-0.311595,44.935921
