id_mutation,date_mutation,numero_disposition,nature_mutation,valeur_fonciere,adresse_numero,adresse_suffixe,adresse_nom_voie,adresse_code_voie,code_postal,code_commune,nom_commune,code_departement,ancien_code_commune,ancien_nom_commune,id_parcelle,ancien_id_parcelle,numero_volume,lot1_numero,lot1_surface_carrez,lot2_numero,lot2_surface_carrez,lot3_numero,lot3_surface_carrez,lot4_numero,lot4_surface_carrez,lot5_numero,lot5_surface_carrez,nombre_lots,code_type_local,type_local,surface_reelle_bati,nombre_pieces_principales,code_nature_culture,nature_culture,code_nature_culture_speciale,nature_culture_speciale,surface_terrain,longitude,latitude
2021-530731,2021-05-27,000001,Vente,7000,,,LEPINE,B029,33540,33443,Saint-Martin-de-Lerm,33,,,334430000B0070,,,,,,,,,,,,,0,,,,,P,prés,,,2195,-0.037135,44.636973
2021-530731,2021-05-27,000001,Vente,7000,,,LEPINE,B029,33540,33443,Saint-Martin-de-Lerm,33,,,334430000B0071,,,,,,,,,,,,,0,,,,,P,prés,,,2344,-0.036772,44.637168
2021-530731,2021-05-27,000001,Vente,7000,,,LEPINE,B029,33540,33443,Saint-Martin-de-Lerm,33,,,334430000B0072,,,,,,,,,,,,,0,,,,,T,terres,,,7742,-0.036843,44.637526
2021-530731,2021-05-27,000001,Vente,7000,,,LEPINE,B029,33540,33443,Saint-Martin-de-Lerm,33,,,334430000B0075,,,,,,,,,,,,,0,,,,,P,prés,,,2048,-0.035429,44.635556
2021-537689,2021-08-30,000001,Vente,568045,,,LABOURJADE,B027,33540,33443,Saint-Martin-de-Lerm,33,,,334430000A0311,,,,,,,,,,,,,0,,,,,P,prés,,,22623,-0.035248,44.645286
2021-537689,2021-08-30,000001,Vente,568045,,,LABOURJADE,B027,33540,33443,Saint-Martin-de-Lerm,33,,,334430000A0312,,,,,,,,,,,,,0,,,,,T,terres,,,3860,-0.035674,44.646054
2021-537689,2021-08-30,000001,Vente,568045,,,LABOURJADE,B027,33540,33443,Saint-Martin-de-Lerm,33,,,334430000A0313,,,,,,,,,,,,,0,,,,,T,terres,,,5407,-0.036558,44.645865
2021-537689,2021-08-30,000001,Vente,568045,5084,F,LABOURJADE,B027,33540,33443,Saint-Martin-de-Lerm,33,,,334430000A0315,,,,,,,,,,,,,0,3,Dépendance,,0,BT,taillis simples,ACACI,Acacias,1018,-0.034507,44.644804
2021-537689,2021-08-30,000001,Vente,568045,,,LABOURJADE,B027,33540,33443,Saint-Martin-de-Lerm,33,,,334430000A0316,,,,,,,,,,,,,0,,,,,P,prés,,,659,-0.034335,44.645052
2021-537689,2021-08-30,000001,Vente,568045,,,LABOURJADE,B027,33540,33443,Saint-Martin-de-Lerm,33,,,334430000A0406,,,,,,,,,,,,,0,,,,,T,terres,,,1772,-0.036816,44.646267
2021-537689,2021-08-30,000001,Vente,568045,2,,LABOURJADE,B027,33540,33443,Saint-Martin-de-Lerm,33,,,334430000A0465,,,,,,,,,,,,,0,1,Maison,300,9,S,sols,,,2408,-0.034919,44.644835
2021-537689,2021-08-30,000001,Vente,568045,2,,LABOURJADE,B027,33540,33443,Saint-Martin-de-Lerm,33,,,334430000A0465,,,,,,,,,,,,,0,1,Maison,90,2,S,sols,,,2408,-0.034919,44.644835
2021-537689,2021-08-30,000001,Vente,568045,,,LABOURJADE,B027,33540,33443,Saint-Martin-de-Lerm,33,,,334430000A0466,,,,,,,,,,,,,0,,,,,S,sols,,,48,-0.035028,44.645334
2021-537689,2021-08-30,000001,Vente,568045,,,LABOURJADE,B027,33540,33443,Saint-Martin-de-Lerm,33,,,334430000A0467,,,,,,,,,,,,,0,,,,,S,sols,,,12,-0.034401,44.645074
2021-537689,2021-08-30,000001,Vente,568045,,,LABOURJADE,B027,33540,33443,Saint-Martin-de-Lerm,33,,,334430000A0468,,,,,,,,,,,,,0,,,,,S,sols,,,36,-0.034267,44.645072
2021-537689,2021-08-30,000001,Vente,568045,,,LABOURJADE,B027,33540,33443,Saint-Martin-de-Lerm,33,,,334430000A0481,,,,,,,,,,,,,0,,,,,BS,taillis sous futaie,,,17893,-0.03442,44.64502
2021-540875,2021-10-13,000001,Vente,14500,,,SAUVETRE,B036,33540,33443,Saint-Martin-de-Lerm,33,,,334430000C0709,,,,,,,,,,,,,0,,,,,BT,taillis simples,,,3862,-0.05781,44.645712
2021-540875,2021-10-13,000001,Vente,14500,,,SAUVETRE,B036,33540,33443,Saint-Martin-de-Lerm,33,,,334430000C0711,,,,,,,,,,,,,0,,,,,BT,taillis simples,,,1919,-0.0584,44.645262
2021-540875,2021-10-13,000001,Vente,14500,,,SAUVETRE,B036,33540,33443,Saint-Martin-de-Lerm,33,,,334430000C0720,,,,,,,,,,,,,0,,,,,BT,taillis simples,,,723,-0.059628,44.645597
2021-540875,2021-10-13,000001,Vente,14500,,,SAUVETRE,B036,33540,33443,Saint-Martin-de-Lerm,33,,,334430000C0720,,,,,,,,,,,,,0,,,,,BT,taillis simples,,,18377,-0.059628,44.645597
2021-540875,2021-10-13,000001,Vente,14500,,,CHANSONNET,B016,33540,33443,Saint-Martin-de-Lerm,33,,,334430000C0871,,,,,,,,,,,,,0,,,,,BT,taillis simples,,,356,-0.059344,44.646359
2021-541299,2021-10-01,000001,Vente,120000,5,,CHAULET,B019,33540,33443,Saint-Martin-de-Lerm,33,,,334430000C0799,,,,,,,,,,,,,0,1,Maison,69,3,S,sols,,,676,-0.047686,44.638486
2021-541299,2021-10-01,000001,Vente,120000,,,CHAULET,B019,33540,33443,Saint-Martin-de-Lerm,33,,,334430000C0802,,,,,,,,,,,,,0,,,,,T,terres,,,141,-0.047585,44.638272
2021-542027,2021-10-28,000001,Vente,730,,,LES AUBITRIES,B001,33540,33443,Saint-Martin-de-Lerm,33,,,334430000C0208,,,,,,,,,,,,,0,,,,,BT,taillis simples,,,4060,-0.057968,44.654103
2021-543233,2021-10-21,000001,Vente,357300,9,,BOIMIER,B005,33540,33443,Saint-Martin-de-Lerm,33,,,334430000B0326,,,,,,,,,,,,,0,3,Dépendance,,0,S,sols,,,590,-0.044605,44.6374
2021-543233,2021-10-21,000001,Vente,357300,9,,BOIMIER,B005,33540,33443,Saint-Martin-de-Lerm,33,,,334430000B0326,,,,,,,,,,,,,0,1,Maison,337,10,S,sols,,,590,-0.044605,44.6374
2021-543233,2021-10-21,000001,Vente,357300,9,Q,BOIMIER,B005,33540,33443,Saint-Martin-de-Lerm,33,,,334430000B0329,,,,,,,,,,,,,0,3,Dépendance,,0,S,sols,,,500,-0.04433,44.637201
2021-543233,2021-10-21,000001,Vente,357300,9,Q,BOIMIER,B005,33540,33443,Saint-Martin-de-Lerm,33,,,334430000B0329,,,,,,,,,,,,,0,3,Dépendance,,0,AG,terrains d'agrément,,,2000,-0.04433,44.637201
2021-543233,2021-10-21,000001,Vente,357300,9,Q,BOIMIER,B005,33540,33443,Saint-Martin-de-Lerm,33,,,334430000B0329,,,,,,,,,,,,,0,3,Dépendance,,0,P,prés,,,3240,-0.04433,44.637201
2021-543283,2021-11-10,000001,Vente,14000,,,LES AUBITRIES,B001,33540,33443,Saint-Martin-de-Lerm,33,,,334430000C0136,,,,,,,,,,,,,0,,,,,BT,taillis simples,,,4872,-0.052524,44.652005
2021-543283,2021-11-10,000001,Vente,14000,,,LES AUBITRIES,B001,33540,33443,Saint-Martin-de-Lerm,33,,,334430000C0141,,,,,,,,,,,,,0,,,,,BT,taillis simples,,,2135,-0.051747,44.653361
2021-543283,2021-11-10,000001,Vente,14000,,,LES AUBITRIES,B001,33540,33443,Saint-Martin-de-Lerm,33,,,334430000C0142,,,,,,,,,,,,,0,,,,,BT,taillis simples,,,3703,-0.052349,44.653491
2021-543283,2021-11-10,000001,Vente,14000,,,LES AUBITRIES,B001,33540,33443,Saint-Martin-de-Lerm,33,,,334430000C0143,,,,,,,,,,,,,0,,,,,BT,taillis simples,,,2059,-0.05246,44.652696
2021-543283,2021-11-10,000001,Vente,14000,,,LES AUBITRIES,B001,33540,33443,Saint-Martin-de-Lerm,33,,,334430000C0144,,,,,,,,,,,,,0,,,,,S,sols,,,6,-0.052454,44.652578
2021-543283,2021-11-10,000001,Vente,14000,,,LES AUBITRIES,B001,33540,33443,Saint-Martin-de-Lerm,33,,,334430000C0146,,,,,,,,,,,,,0,,,,,BT,taillis simples,,,2200,-0.053121,44.653594
2021-543283,2021-11-10,000001,Vente,14000,,,LES AUBITRIES,B001,33540,33443,Saint-Martin-de-Lerm,33,,,334430000C0898,,,,,,,,,,,,,0,,,,,BT,taillis simples,,,4577,-0.052261,44.650688
2021-544060,2021-11-24,000001,Vente,2129,,,CHANSONNET,B016,33540,33443,Saint-Martin-de-Lerm,33,,,334430000C0398,,,,,,,,,,,,,0,,,,,BT,taillis simples,,,10460,-0.054329,44.64551
2021-544062,2021-11-24,000001,Vente,1975,,,LES AUBITRIES,B001,33540,33443,Saint-Martin-de-Lerm,33,,,334430000C0122,,,,,,,,,,,,,0,,,,,BR,futaies résineuses,PIN,Pins,10972,-0.053758,44.651419
2021-544069,2021-11-24,000001,Vente,3805,,,LES AUBITRIES,B001,33540,33443,Saint-Martin-de-Lerm,33,,,334430000C0137,,,,,,,,,,,,,0,,,,,BT,taillis simples,,,10310,-0.051153,44.652488
2021-544069,2021-11-24,000001,Vente,3805,,,SAUVETRE,B036,33540,33443,Saint-Martin-de-Lerm,33,,,334430000C0708,,,,,,,,,,,,,0,,,,,BT,taillis simples,,,2375,-0.057881,44.646152
2021-544076,2021-11-24,000001,Vente,2211,,,BOIS DES RAVAUX,B009,33540,33443,Saint-Martin-de-Lerm,33,,,334430000A0006,,,,,,,,,,,,,0,,,,,BT,taillis simples,,,3200,-0.039932,44.659296
2021-544076,2021-11-24,000001,Vente,2211,,,BOIS DES RAVAUX,B009,33540,33443,Saint-Martin-de-Lerm,33,,,334430000A0009,,,,,,,,,,,,,0,,,,,BT,taillis simples,,,1427,-0.039008,44.659385
2021-544076,2021-11-24,000001,Vente,2211,,,BOIS DES RAVAUX,B009,33540,33443,Saint-Martin-de-Lerm,33,,,334430000A0027,,,,,,,,,,,,,0,,,,,BT,taillis simples,,,1146,-0.040774,44.658661
2021-544076,2021-11-24,000001,Vente,2211,,,BOIS DE LAROCHE,B007,33540,33443,Saint-Martin-de-Lerm,33,,,334430000A0189,,,,,,,,,,,,,0,,,,,BT,taillis simples,,,6510,-0.036228,44.65851
2021-544082,2021-11-23,000001,Vente,3297,,,BRANDARD,B012,33540,33443,Saint-Martin-de-Lerm,33,,,334430000C0830,,,,,,,,,,,,,0,,,,,P,prés,,,13190,-0.046068,44.648291
2021-544087,2021-11-23,000001,Vente,4540,,,CHARBON,B018,33540,33443,Saint-Martin-de-Lerm,33,,,334430000A0388,,,,,,,,,,,,,0,,,,,BT,taillis simples,,,22424,-0.044831,44.654125
2021-544109,2021-11-23,000001,Vente,3063,,,VILLEPREUX,B037,33540,33443,Saint-Martin-de-Lerm,33,,,334430000C0043,,,,,,,,,,,,,0,,,,,BT,taillis simples,,,3340,-0.058013,44.656043
2021-544109,2021-11-23,000001,Vente,3063,,,LES AUBITRIES,B001,33540,33443,Saint-Martin-de-Lerm,33,,,334430000C0112,,,,,,,,,,,,,0,,,,,BT,taillis simples,,,683,-0.051566,44.650024
2021-544109,2021-11-23,000001,Vente,3063,,,LES AUBITRIES,B001,33540,33443,Saint-Martin-de-Lerm,33,,,334430000C0114,,,,,,,,,,,,,0,,,,,BT,taillis simples,,,2059,-0.051214,44.651142
2021-544109,2021-11-23,000001,Vente,3063,,,LES AUBITRIES,B001,33540,33443,Saint-Martin-de-Lerm,33,,,334430000C0119,,,,,,,,,,,,,0,,,,,BT,taillis simples,,,1735,-0.049651,44.651765
2021-544109,2021-11-23,000001,Vente,3063,,,LES AUBITRIES,B001,33540,33443,Saint-Martin-de-Lerm,33,,,334430000C0199,,,,,,,,,,,,,0,,,,,BT,taillis simples,,,3869,-0.058037,44.655747
2021-544117,2021-11-24,000001,Vente,1253,,,LES AUBITRIES,B001,33540,33443,Saint-Martin-de-Lerm,33,,,334430000C0169,,,,,,,,,,,,,0,,,,,BT,taillis simples,,,5548,-0.051726,44.654484
2021-544117,2021-11-24,000001,Vente,1253,,,LES AUBITRIES,B001,33540,33443,Saint-Martin-de-Lerm,33,,,334430000C0173,,,,,,,,,,,,,0,,,,,BT,taillis simples,,,1409,-0.051917,44.654967
2021-544135,2021-11-23,000001,Vente,1296,,,CHARBON,B018,33540,33443,Saint-Martin-de-Lerm,33,,,334430000A0369,,,,,,,,,,,,,0,,,,,BT,taillis simples,,,7200,-0.043575,44.652
2021-544143,2021-11-23,000001,Vente,3465,,,LES AUBITRIES,B001,33540,33443,Saint-Martin-de-Lerm,33,,,334430000C0148,,,,,,,,,,,,,0,,,,,BT,taillis simples,,,5740,-0.05433,44.653686
2021-544143,2021-11-23,000001,Vente,3465,,,GRAMET,B024,33540,33443,Saint-Martin-de-Lerm,33,,,334430000C0426,,,,,,,,,,,,,0,,,,,BT,taillis simples,,,2487,-0.051828,44.649295
2021-544143,2021-11-23,000001,Vente,3465,,,GRAMET,B024,33540,33443,Saint-Martin-de-Lerm,33,,,334430000C0429,,,,,,,,,,,,,0,,,,,BT,taillis simples,,,450,-0.050941,44.64978
2021-544143,2021-11-23,000001,Vente,3465,,,GRAMET,B024,33540,33443,Saint-Martin-de-Lerm,33,,,334430000C0433,,,,,,,,,,,,,0,,,,,BT,taillis simples,,,3497,-0.050332,44.648966
2021-544143,2021-11-23,000001,Vente,3465,,,GRAMET,B024,33540,33443,Saint-Martin-de-Lerm,33,,,334430000C0441,,,,,,,,,,,,,0,,,,,BT,taillis simples,,,1949,-0.050385,44.645903
2021-546021,2021-12-22,000001,Vente,14500,,,CHANSONNET,B016,33540,33443,Saint-Martin-de-Lerm,33,,,334430000C0351,,,,,,,,,,,,,0,,,,,BR,futaies résineuses,PIN,Pins,42848,-0.059362,44.648838
2021-547970,2021-02-18,000001,Vente,525000,,,DELUILE,B020,33540,33443,Saint-Martin-de-Lerm,33,,,334430000B0050,,,,,,,,,,,,,0,,,,,BT,taillis simples,,,1133,-0.031137,44.642311
2021-547970,2021-02-18,000001,Vente,525000,,,DELUILE,B020,33540,33443,Saint-Martin-de-Lerm,33,,,334430000B0051,,,,,,,,,,,,,0,,,,,BT,taillis simples,,,1540,-0.030937,44.642456
2021-547970,2021-02-18,000001,Vente,525000,,,LEPINE,B029,33540,33443,Saint-Martin-de-Lerm,33,,,334430000B0053,,,,,,,,,,,,,0,,,,,BT,taillis simples,,,578,-0.030932,44.64135
2021-547970,2021-02-18,000001,Vente,525000,1,,LEPINE,B029,33540,33443,Saint-Martin-de-Lerm,33,,,334430000B0054,,,,,,,,,,,,,0,1,Maison,28,1,S,sols,,,674,-0.030637,44.641725
2021-547970,2021-02-18,000001,Vente,525000,1,B,LEPINE,B029,33540,33443,Saint-Martin-de-Lerm,33,,,334430000B0055,,,,,,,,,,,,,0,3,Dépendance,,0,P,prés,,,3500,-0.030088,44.641572
2021-547970,2021-02-18,000001,Vente,525000,1,B,LEPINE,B029,33540,33443,Saint-Martin-de-Lerm,33,,,334430000B0055,,,,,,,,,,,,,0,3,Dépendance,,0,S,sols,,,100,-0.030088,44.641572
2021-547970,2021-02-18,000001,Vente,525000,,,LEPINE,B029,33540,33443,Saint-Martin-de-Lerm,33,,,334430000B0056,,,,,,,,,,,,,0,,,,,P,prés,,,9340,-0.029813,44.640908
2021-547970,2021-02-18,000001,Vente,525000,,,LEPINE,B029,33540,33443,Saint-Martin-de-Lerm,33,,,334430000B0220,,,,,,,,,,,,,0,,,,,S,sols,,,512,-0.030774,44.641654
2021-547970,2021-02-18,000001,Vente,525000,,,LEPINE,B029,33540,33443,Saint-Martin-de-Lerm,33,,,334430000B0288,,,,,,,,,,,,,0,,,,,S,sols,,,226,-0.030546,44.641855
2021-547970,2021-02-18,000001,Vente,525000,,,LEPINE,B029,33540,33443,Saint-Martin-de-Lerm,33,,,334430000B0289,,,,,,,,,,,,,0,,,,,P,prés,,,583,-0.030182,44.640916
2021-548001,2021-02-26,000002,Vente,129000,2,B,POITEVIN,B031,33540,33443,Saint-Martin-de-Lerm,33,,,334430000A0457,,,,,,,,,,,,,0,1,Maison,70,2,S,sols,,,624,-0.031053,44.652435
2021-548001,2021-02-26,000002,Vente,129000,2,B,POITEVIN,B031,33540,33443,Saint-Martin-de-Lerm,33,,,334430000A0457,,,,,,,,,,,,,0,1,Maison,45,3,S,sols,,,624,-0.031053,44.652435
2021-548001,2021-02-26,000002,Vente,129000,,,POITEVIN,B031,33540,33443,Saint-Martin-de-Lerm,33,,,334430000A0458,,,,,,,,,,,,,0,,,,,S,sols,,,20,-0.030861,44.652346
2021-548001,2021-02-26,000002,Vente,129000,,,POITEVIN,B031,33540,33443,Saint-Martin-de-Lerm,33,,,334430000A0487,,,,,,,,,,,,,0,,,,,T,terres,,,5679,-0.030794,44.652481
2021-548011,2021-03-05,000001,Vente,39000,,,CHAULET,B019,33540,33443,Saint-Martin-de-Lerm,33,,,334430000C0838,,,,,,,,,,,,,0,,,,,T,terres,,,2044,-0.04798,44.636012
2021-548027,2021-03-02,000001,Vente,15500,,,LEPINE,B029,33540,33443,Saint-Martin-de-Lerm,33,,,334430000B0085,,,,,,,,,,,,,0,,,,,P,prés,,,19850,-0.032944,44.635726
2021-548027,2021-03-02,000001,Vente,15500,,,LEPINE,B029,33540,33443,Saint-Martin-de-Lerm,33,,,334430000B0086,,,,,,,,,,,,,0,,,,,P,prés,,,11100,-0.034353,44.635198
2021-548073,2021-03-18,000001,Vente,5000,,,CHANSONNET,B016,33540,33443,Saint-Martin-de-Lerm,33,,,334430000C0375,,,,,,,,,,,,,0,,,,,BT,taillis simples,,,1507,-0.057964,44.64701
2021-548073,2021-03-18,000001,Vente,5000,,,CHAULET,B019,33540,33443,Saint-Martin-de-Lerm,33,,,334430000C0623,,,,,,,,,,,,,0,,,,,BT,taillis simples,ACACI,Acacias,1580,-0.051729,44.642242
2021-548073,2021-03-18,000001,Vente,5000,,,SAUVETRE,B036,33540,33443,Saint-Martin-de-Lerm,33,,,334430000C0653,,,,,,,,,,,,,0,,,,,BT,taillis simples,,,7140,-0.052088,44.642294
2021-548073,2021-03-18,000001,Vente,5000,,,SAUVETRE,B036,33540,33443,Saint-Martin-de-Lerm,33,,,334430000C0713,,,,,,,,,,,,,0,,,,,BT,taillis simples,ACACI,Acacias,1775,-0.058777,44.644408
2021-548168,2021-04-15,000001,Vente,7500,,,LES SABLES,B035,33540,33443,Saint-Martin-de-Lerm,33,,,334430000B0026,,,,,,,,,,,,,0,,,,,T,terres,,,7869,-0.04096,44.64052
2021-548168,2021-04-15,000001,Vente,7500,,,LES SABLES,B035,33540,33443,Saint-Martin-de-Lerm,33,,,334430000B0027,,,,,,,,,,,,,0,,,,,T,terres,,,7928,-0.040789,44.639682
