id_mutation,date_mutation,numero_disposition,nature_mutation,valeur_fonciere,adresse_numero,adresse_suffixe,adresse_nom_voie,adresse_code_voie,code_postal,code_commune,nom_commune,code_departement,ancien_code_commune,ancien_nom_commune,id_parcelle,ancien_id_parcelle,numero_volume,lot1_numero,lot1_surface_carrez,lot2_numero,lot2_surface_carrez,lot3_numero,lot3_surface_carrez,lot4_numero,lot4_surface_carrez,lot5_numero,lot5_surface_carrez,nombre_lots,code_type_local,type_local,surface_reelle_bati,nombre_pieces_principales,code_nature_culture,nature_culture,code_nature_culture_speciale,nature_culture_speciale,surface_terrain,longitude,latitude
2021-532047,2021-06-17,000001,Vente,320000,,,LAGRUZERE,B027,33540,33446,Saint-Martin-du-Puy,33,,,334460000B0413,,,,,,,,,,,,,0,,,,,S,sols,,,804,-0.021021,44.669463
2021-532047,2021-06-17,000001,Vente,320000,,,LAGRUZERE,B027,33540,33446,Saint-Martin-du-Puy,33,,,334460000B0413,,,,,,,,,,,,,0,,,,,P,prés,,,5626,-0.021021,44.669463
2021-532047,2021-06-17,000001,Vente,320000,1,B,LAGRUZERE,B027,33540,33446,Saint-Martin-du-Puy,33,,,334460000B0414,,,,,,,,,,,,,0,1,Maison,150,4,S,sols,,,980,-0.020956,44.66957
2021-532047,2021-06-17,000001,Vente,320000,1,B,LAGRUZERE,B027,33540,33446,Saint-Martin-du-Puy,33,,,334460000B0414,,,,,,,,,,,,,0,3,Dépendance,,0,S,sols,,,980,-0.020956,44.66957
2021-532047,2021-06-17,000001,Vente,320000,1,B,LAGRUZERE,B027,33540,33446,Saint-Martin-du-Puy,33,,,334460000B0414,,,,,,,,,,,,,0,3,Dépendance,,0,S,sols,,,980,-0.020956,44.66957
2021-532047,2021-06-17,000001,Vente,320000,1,B,LAGRUZERE,B027,33540,33446,Saint-Martin-du-Puy,33,,,334460000B0414,,,,,,,,,,,,,0,1,Maison,150,6,S,sols,,,980,-0.020956,44.66957
2021-532047,2021-06-17,000001,Vente,320000,,,LAGRUZERE,B027,33540,33446,Saint-Martin-du-Puy,33,,,334460000B0415,,,,,,,,,,,,,0,,,,,P,prés,,,5397,-0.021076,44.669051
2021-532047,2021-06-17,000001,Vente,320000,,,LAGRUZERE,B027,33540,33446,Saint-Martin-du-Puy,33,,,334460000B0416,,,,,,,,,,,,,0,,,,,T,terres,,,3806,-0.021253,44.668762
2021-533733,2021-07-06,000001,Vente,70000,73,,LAGRUZERE,B027,33540,33446,Saint-Martin-du-Puy,33,,,334460000B0410,,,,,,,,,,,,,0,1,Maison,115,4,S,sols,,,471,-0.022593,44.670118
2021-533733,2021-07-06,000001,Vente,70000,,,LAGRUZERE,B027,33540,33446,Saint-Martin-du-Puy,33,,,334460000B0775,,,,,,,,,,,,,0,,,,,P,prés,,,83,-0.022585,44.670205
2021-533733,2021-07-06,000001,Vente,70000,,,LAGRUZERE,B027,33540,33446,Saint-Martin-du-Puy,33,,,334460000B0777,,,,,,,,,,,,,0,,,,,P,prés,,,718,-0.022457,44.670099
2021-533733,2021-07-06,000001,Vente,70000,,,LAGRUZERE,B027,33540,33446,Saint-Martin-du-Puy,33,,,334460000B0777,,,,,,,,,,,,,0,,,,,S,sols,,,688,-0.022457,44.670099
2021-535853,2021-08-05,000001,Vente,28000,,,CASTELMORON,B008,33540,33446,Saint-Martin-du-Puy,33,,,334460000B0802,,,,,,,,,,,,,0,,,,,VI,vignes,,,340,-0.01765,44.680602
2021-537164,2021-08-27,000001,Vente,5000,,,AUX RIVIERES,B040,33540,33446,Saint-Martin-du-Puy,33,,,33446000ZE0010,,,,,,,,,,,,,0,,,,,BT,taillis simples,,,11843,-0.039032,44.682606
2021-548020,2021-02-24,000002,Echange,7500,,,CHAMPS DE SAINT MARTIN,B012,33540,33446,Saint-Martin-du-Puy,33,,,33446000ZD0023,,,,,,,,,,,,,0,,,,,VI,vignes,,,4675,-0.027207,44.673799
2021-548020,2021-02-24,000003,Echange,7500,,,CHAMPS DE SAINT MARTIN,B012,33540,33446,Saint-Martin-du-Puy,33,,,33446000ZD0056,,,,,,,,,,,,,0,,,,,VI,vignes,,,1922,-0.027911,44.673045
2021-548175,2021-04-14,000001,Echange,9918,,,DUMILHAT,B019,33540,33446,Saint-Martin-du-Puy,33,,,33446000ZB0021,,,,,,,,,,,,,0,,,,,VI,vignes,,,4959,-0.047749,44.669894
2021-548176,2021-04-14,000002,Echange,8848,,,LE TROU DE LA BARRIQUE,B042,33540,33446,Saint-Martin-du-Puy,33,,,33446000ZC0016,,,,,,,,,,,,,0,,,,,VI,vignes,,,4424,-0.047112,44.669551
