id_mutation,date_mutation,numero_disposition,nature_mutation,valeur_fonciere,adresse_numero,adresse_suffixe,adresse_nom_voie,adresse_code_voie,code_postal,code_commune,nom_commune,code_departement,ancien_code_commune,ancien_nom_commune,id_parcelle,ancien_id_parcelle,numero_volume,lot1_numero,lot1_surface_carrez,lot2_numero,lot2_surface_carrez,lot3_numero,lot3_surface_carrez,lot4_numero,lot4_surface_carrez,lot5_numero,lot5_surface_carrez,nombre_lots,code_type_local,type_local,surface_reelle_bati,nombre_pieces_principales,code_nature_culture,nature_culture,code_nature_culture_speciale,nature_culture_speciale,surface_terrain,longitude,latitude
2021-530734,2021-05-28,000001,Vente,266980,,,PAGNAUD,B078,33760,33464,Saint-Pierre-de-Bat,33,,,334640000C0134,,,,,,,,,,,,,0,,,,,P,prés,,,1903,-0.228394,44.664023
2021-530734,2021-05-28,000001,Vente,266980,,,PAGNAUD,B078,33760,33464,Saint-Pierre-de-Bat,33,,,334640000C0620,,,,,,,,,,,,,0,,,,,VI,vignes,,,233,-0.228345,44.664294
2021-530734,2021-05-28,000001,Vente,266980,,,PAGNAUD,B078,33760,33464,Saint-Pierre-de-Bat,33,,,334640000C0621,,,,,,,,,,,,,0,,,,,S,sols,,,532,-0.227936,44.664451
2021-530734,2021-05-28,000001,Vente,266980,2,,CHE DE PAGNAUD,0060,33760,33464,Saint-Pierre-de-Bat,33,,,334640000C0623,,,,,,,,,,,,,0,1,Maison,145,5,S,sols,,,652,-0.228036,44.664366
2021-534978,2021-07-30,000001,Vente,166628,24,,CHE DE JAUFFRION,0032,33760,33464,Saint-Pierre-de-Bat,33,,,334640000C0323,,,,,,,,,,,,,0,1,Maison,80,2,S,sols,,,433,-0.233811,44.667723
2021-534978,2021-07-30,000001,Vente,166628,,,JAUFFRION,B048,33760,33464,Saint-Pierre-de-Bat,33,,,334640000C0550,,,,,,,,,,,,,0,,,,,T,terres,,,32,-0.233668,44.667448
2021-534978,2021-07-30,000001,Vente,166628,,,JAUFFRION,B048,33760,33464,Saint-Pierre-de-Bat,33,,,334640000C0553,,,,,,,,,,,,,0,,,,,P,prés,,,1058,-0.233751,44.667765
2021-534978,2021-07-30,000001,Vente,166628,,,JAUFFRION,B048,33760,33464,Saint-Pierre-de-Bat,33,,,334640000C0555,,,,,,,,,,,,,0,,,,,T,terres,,,144,-0.233833,44.667487
2021-535022,2021-07-13,000001,Echange,900,,,CALAMA,B017,33760,33464,Saint-Pierre-de-Bat,33,,,334640000C0304,,,,,,,,,,,,,0,,,,,P,prés,,,1773,-0.231824,44.668201
2021-535022,2021-07-13,000002,Echange,900,,,PRAT BARRAT,B093,33760,33464,Saint-Pierre-de-Bat,33,,,334640000C0245,,,,,,,,,,,,,0,,,,,T,terres,,,875,-0.232061,44.661387
2021-541126,2021-10-19,000001,Vente,780000,23,,RTE DE LAURENCON,0040,33760,33464,Saint-Pierre-de-Bat,33,,,334640000D0297,,,,,,,,,,,,,0,1,Maison,38,2,S,sols,,,960,-0.222132,44.670515
2021-541126,2021-10-19,000001,Vente,780000,,,LAURENCON,B054,33760,33464,Saint-Pierre-de-Bat,33,,,334640000D0298,,,,,,,,,,,,,0,,,,,AG,terrains d'agrément,,,6420,-0.221918,44.670163
2021-541126,2021-10-19,000001,Vente,780000,,,LAURENCON,B054,33760,33464,Saint-Pierre-de-Bat,33,,,334640000D0300,,,,,,,,,,,,,0,,,,,J,jardins,,,1620,-0.222132,44.669757
2021-541126,2021-10-19,000001,Vente,780000,,,LAURENCON,B054,33760,33464,Saint-Pierre-de-Bat,33,,,334640000D0301,,,,,,,,,,,,,0,,,,,E,eaux,ETANG,Etangs,615,-0.221966,44.669622
2021-541126,2021-10-19,000001,Vente,780000,,,LAURENCON,B054,33760,33464,Saint-Pierre-de-Bat,33,,,334640000D0302,,,,,,,,,,,,,0,,,,,BT,taillis simples,,,7020,-0.223095,44.669746
2021-541126,2021-10-19,000001,Vente,780000,,,LAURENCON,B054,33760,33464,Saint-Pierre-de-Bat,33,,,334640000D0303,,,,,,,,,,,,,0,,,,,P,prés,,,13130,-0.222857,44.67018
2021-541126,2021-10-19,000001,Vente,780000,1,,CHATEAU DE LAURENCON,X015,33760,33464,Saint-Pierre-de-Bat,33,,,334640000D0759,,,,,,,,,,,,,0,1,Maison,30,2,S,sols,,,1378,-0.222011,44.669808
2021-541126,2021-10-19,000001,Vente,780000,1,,CHATEAU DE LAURENCON,X015,33760,33464,Saint-Pierre-de-Bat,33,,,334640000D0759,,,,,,,,,,,,,0,3,Dépendance,,0,S,sols,,,1378,-0.222011,44.669808
2021-541126,2021-10-19,000001,Vente,780000,1,,CHATEAU DE LAURENCON,X015,33760,33464,Saint-Pierre-de-Bat,33,,,334640000D0759,,,,,,,,,,,,,0,1,Maison,371,11,S,sols,,,1378,-0.222011,44.669808
2021-541126,2021-10-19,000001,Vente,780000,,,LAURENCON,B054,33760,33464,Saint-Pierre-de-Bat,33,,,334640000D0760,,,,,,,,,,,,,0,,,,,S,sols,,,20,-0.222501,44.669713
2021-542821,2021-11-09,000001,Vente,25000,,,CALAMA,B017,33760,33464,Saint-Pierre-de-Bat,33,,,334640000C0633,,,,,,,,,,,,,0,,,,,S,sols,,,80,-0.230403,44.666135
2021-542880,2021-11-10,000001,Vente,500,,,LES LINCES,B055,33760,33464,Saint-Pierre-de-Bat,33,,,33464000ZB0009,,,,,,,,,,,,,0,,,,,T,terres,,,1880,-0.203206,44.661978
2021-543488,2021-11-16,000001,Vente,800,,,JOUANNET,B050,33760,33464,Saint-Pierre-de-Bat,33,,,334640000A0489,,,,,,,,,,,,,0,,,,,P,prés,,,3496,-0.216408,44.675067
2021-546228,2021-12-02,000001,Vente,275000,,,PAGNAUD,B078,33760,33464,Saint-Pierre-de-Bat,33,,,334640000C0135,,,,,,,,,,,,,0,,,,,J,jardins,,,1722,-0.227936,44.663849
2021-546228,2021-12-02,000001,Vente,275000,1,,CHE DE PAGNAUD,0060,33760,33464,Saint-Pierre-de-Bat,33,,,334640000C0525,,,,,,,,,,,,,0,3,Dépendance,,0,S,sols,,,1470,-0.227423,44.664351
2021-546228,2021-12-02,000001,Vente,275000,1,,CHE DE PAGNAUD,0060,33760,33464,Saint-Pierre-de-Bat,33,,,334640000C0525,,,,,,,,,,,,,0,1,Maison,129,5,S,sols,,,1470,-0.227423,44.664351
2021-546288,2021-12-22,000001,Vente,318625,,,BEILLERAND,B005,33760,33464,Saint-Pierre-de-Bat,33,,,334640000C0559,,,,,,,,,,,,,0,,,,,S,sols,,,24,-0.235594,44.672279
2021-546288,2021-12-22,000001,Vente,318625,2,B,CHE DE GUICHE ARNAUD,0020,33760,33464,Saint-Pierre-de-Bat,33,,,334640000C0744,,,,,,,,,,,,,0,1,Maison,100,2,S,sols,,,406,-0.23544,44.672377
2021-546288,2021-12-22,000001,Vente,318625,2,B,CHE DE GUICHE ARNAUD,0020,33760,33464,Saint-Pierre-de-Bat,33,,,334640000C0744,,,,,,,,,,,,,0,3,Dépendance,,0,S,sols,,,406,-0.23544,44.672377
2021-546288,2021-12-22,000001,Vente,318625,2,B,CHE DE GUICHE ARNAUD,0020,33760,33464,Saint-Pierre-de-Bat,33,,,334640000C0745,,2,,,,,,,,,,,0,,,,,,,,,,-0.235426,44.672461
2021-546288,2021-12-22,000001,Vente,318625,,,BEILLERAND,B005,33760,33464,Saint-Pierre-de-Bat,33,,,334640000C0746,,,,,,,,,,,,,0,,,,,P,prés,,,917,-0.235128,44.67226
2021-546288,2021-12-22,000001,Vente,318625,,,BEILLERAND,B005,33760,33464,Saint-Pierre-de-Bat,33,,,334640000C0748,,,,,,,,,,,,,0,,,,,AG,terrains d'agrément,,,172,-0.234966,44.672307
2021-547963,2021-03-01,000001,Vente,160000,5,,LA FONT,B030,33760,33464,Saint-Pierre-de-Bat,33,,,334640000A0861,,,,,,,,,,,,,0,1,Maison,101,5,S,sols,,,500,-0.206489,44.674911
2021-547963,2021-03-01,000001,Vente,160000,5,,LA FONT,B030,33760,33464,Saint-Pierre-de-Bat,33,,,334640000A0861,,,,,,,,,,,,,0,1,Maison,101,5,AG,terrains d'agrément,,,1400,-0.206489,44.674911
2021-548057,2021-03-17,000001,Vente,4000,,,CALAMA,B017,33760,33464,Saint-Pierre-de-Bat,33,,,334640000C0286,,,,,,,,,,,,,0,,,,,T,terres,,,7030,-0.233208,44.665664
2021-548057,2021-03-17,000001,Vente,4000,,,MARCHAND,B058,33760,33464,Saint-Pierre-de-Bat,33,,,334640000C0355,,,,,,,,,,,,,0,,,,,T,terres,,,5929,-0.234007,44.66561
2021-548197,2021-04-14,000001,Vente,245000,1,B,RTE DE GUILLEMET,0024,33760,33464,Saint-Pierre-de-Bat,33,,,334640000A0910,,,,,,,,,,,,,0,1,Maison,108,5,AG,terrains d'agrément,,,1013,-0.212187,44.675352
2021-548197,2021-04-14,000001,Vente,245000,1,B,RTE DE GUILLEMET,0024,33760,33464,Saint-Pierre-de-Bat,33,,,334640000A0910,,,,,,,,,,,,,0,1,Maison,108,5,S,sols,,,500,-0.212187,44.675352
