id_mutation,date_mutation,numero_disposition,nature_mutation,valeur_fonciere,adresse_numero,adresse_suffixe,adresse_nom_voie,adresse_code_voie,code_postal,code_commune,nom_commune,code_departement,ancien_code_commune,ancien_nom_commune,id_parcelle,ancien_id_parcelle,numero_volume,lot1_numero,lot1_surface_carrez,lot2_numero,lot2_surface_carrez,lot3_numero,lot3_surface_carrez,lot4_numero,lot4_surface_carrez,lot5_numero,lot5_surface_carrez,nombre_lots,code_type_local,type_local,surface_reelle_bati,nombre_pieces_principales,code_nature_culture,nature_culture,code_nature_culture_speciale,nature_culture_speciale,surface_terrain,longitude,latitude
2021-575405,2021-01-05,000001,Vente,30000,,,LA GRANGE DE SALLELES,B137,34510,34101,Florensac,34,,,341010000E1351,,,,,,,,,,,,,0,,,,,VI,vignes,,,2240,3.49853,43.370354
2021-575416,2021-01-06,000001,Vente,79806,3,,RUE CORDAT,0095,34510,34101,Florensac,34,,,34101000AB0417,,,2,66.91,,,,,,,,,1,1,Maison,55,3,,,,,,3.462321,43.382178
2021-575427,2021-01-07,000001,Vente,2300,,,PUECH DES MASQUES,B208,34510,34101,Florensac,34,,,341010000D2091,,,,,,,,,,,,,0,,,,,VI,vignes,,,830,3.469211,43.397968
2021-575427,2021-01-07,000001,Vente,2300,,,PUECH DES MASQUES,B208,34510,34101,Florensac,34,,,341010000D2092,,,,,,,,,,,,,0,,,,,VI,vignes,,,924,3.469299,43.398036
2021-575427,2021-01-07,000001,Vente,2300,,,PUECH DES MASQUES,B208,34510,34101,Florensac,34,,,341010000D3318,,,,,,,,,,,,,0,,,,,VI,vignes,,,2420,3.470865,43.398571
2021-575427,2021-01-07,000001,Vente,2300,,,PUECH DES MASQUES,B208,34510,34101,Florensac,34,,,341010000D3322,,,,,,,,,,,,,0,,,,,VI,vignes,,,500,3.470117,43.39806
2021-575427,2021-01-07,000001,Vente,2300,,,PUECH DES MASQUES,B208,34510,34101,Florensac,34,,,341010000D3323,,,,,,,,,,,,,0,,,,,T,terres,,,3375,3.469129,43.397791
2021-575444,2021-01-11,000001,Vente,186900,14,,RUE PASTEUR,0315,34510,34101,Florensac,34,,,34101000AI0184,,,,,,,,,,,,,0,1,Maison,75,4,S,sols,,,130,3.467149,43.38242
2021-575564,2021-01-18,000001,Vente,62000,41,,RUE GENERAL MONTBRUN,0175,34510,34101,Florensac,34,,,34101000AA0099,,,,,,,,,,,,,0,1,Maison,54,2,S,sols,,,73,3.464021,43.38123
2021-575594,2021-01-15,000001,Vente,267000,20,,RUE DU COUCHANT,0096,34510,34101,Florensac,34,,,34101000AR0015,,,,,,,,,,,,,0,1,Maison,95,5,S,sols,,,424,3.473675,43.392729
2021-575723,2021-01-21,000001,Vente,85650,1,,RUE DES ACACIAS,0003,34510,34101,Florensac,34,,,34101000AW0118,,,,,,,,,,,,,0,1,Maison,74,3,S,sols,,,400,3.47744,43.385418
2021-575995,2021-01-18,000001,Vente,175000,21,,RUE FERNAND CHAMAYOU,0143,34510,34101,Florensac,34,,,34101000AB0602,,,,,,,,,,,,,0,3,Dépendance,,0,S,sols,,,127,3.464396,43.383151
2021-575995,2021-01-18,000001,Vente,175000,21,,RUE FERNAND CHAMAYOU,0143,34510,34101,Florensac,34,,,34101000AB0602,,,,,,,,,,,,,0,2,Appartement,120,4,S,sols,,,127,3.464396,43.383151
2021-575999,2021-01-25,000001,Vente,73660,8,,RUE GENERAL MONTBRUN,0175,34510,34101,Florensac,34,,,34101000AA0289,,,,,,,,,,,,,0,1,Maison,45,2,S,sols,,,33,3.462647,43.381114
2021-576062,2021-01-04,000001,Vente,52000,31,,RUE FERNAND CHAMAYOU,0143,34510,34101,Florensac,34,,,34101000AB0583,,,,,,,,,,,,,0,1,Maison,35,4,S,sols,,,30,3.463804,43.383375
2021-576117,2021-01-25,000001,Vente,8000,,,CHEMIN BAS D AGDE,B072,34510,34101,Florensac,34,,,341010000F0390,,,,,,,,,,,,,0,,,,,T,terres,,,3260,3.458969,43.372837
2021-576131,2021-01-22,000002,Vente,343.2,,,LA POUCHETTE,B204,34510,34101,Florensac,34,,,341010000D4773,,,,,,,,,,,,,0,,,,,VI,vignes,,,156,3.466898,43.409835
2021-576438,2021-01-29,000001,Vente,185000,69,,RUE DE LA REPUBLIQUE,0400,34510,34101,Florensac,34,,,34101000AA0070,,,,,,,,,,,,,0,2,Appartement,65,3,S,sols,,,83,3.463293,43.381628
2021-576438,2021-01-29,000001,Vente,185000,69,,RUE DE LA REPUBLIQUE,0400,34510,34101,Florensac,34,,,34101000AA0070,,,,,,,,,,,,,0,2,Appartement,65,3,S,sols,,,83,3.463293,43.381628
2021-576438,2021-01-29,000001,Vente,185000,69,,RUE DE LA REPUBLIQUE,0400,34510,34101,Florensac,34,,,34101000AA0070,,,,,,,,,,,,,0,2,Appartement,65,3,S,sols,,,83,3.463293,43.381628
2021-576438,2021-01-29,000001,Vente,185000,69,,RUE DE LA REPUBLIQUE,0400,34510,34101,Florensac,34,,,34101000AA0070,,,,,,,,,,,,,0,2,Appartement,65,3,S,sols,,,83,3.463293,43.381628
2021-576451,2021-02-04,000001,Vente,1700,,,LES ARENASSES,B006,34510,34101,Florensac,34,,,341010000C1703,,,,,,,,,,,,,0,,,,,T,terres,,,720,3.45312,43.404284
2021-576451,2021-02-04,000001,Vente,1700,,,LES ARENASSES,B006,34510,34101,Florensac,34,,,341010000C1705,,,,,,,,,,,,,0,,,,,T,terres,,,1370,3.453479,43.403831
2021-576451,2021-02-04,000001,Vente,1700,,,LES ARENASSES,B006,34510,34101,Florensac,34,,,341010000C1704,,,,,,,,,,,,,0,,,,,T,terres,,,720,3.452883,43.40427
2021-576451,2021-02-04,000001,Vente,1700,,,LES ARENASSES,B006,34510,34101,Florensac,34,,,341010000C1706,,,,,,,,,,,,,0,,,,,VI,vignes,,,1370,3.453434,43.403619
2021-576573,2021-02-15,000001,Vente,6490,,,LA POUCHETTE,B204,34510,34101,Florensac,34,,,341010000D1230,,,,,,,,,,,,,0,,,,,T,terres,,,465,3.462859,43.412047
2021-576573,2021-02-15,000001,Vente,6490,,,LA POUCHETTE,B204,34510,34101,Florensac,34,,,341010000D1231,,,,,,,,,,,,,0,,,,,T,terres,,,395,3.462979,43.41202
2021-576573,2021-02-15,000001,Vente,6490,,,LA POUCHETTE,B204,34510,34101,Florensac,34,,,341010000D1232,,,,,,,,,,,,,0,,,,,L,landes,,,315,3.463099,43.412004
2021-576573,2021-02-15,000001,Vente,6490,,,LA POUCHETTE,B204,34510,34101,Florensac,34,,,341010000D1233,,,,,,,,,,,,,0,,,,,VI,vignes,,,2750,3.463525,43.411852
2021-576573,2021-02-15,000001,Vente,6490,,,LA POUCHETTE,B204,34510,34101,Florensac,34,,,341010000D1234,,,,,,,,,,,,,0,,,,,VI,vignes,,,1950,3.463006,43.411729
2021-576648,2021-01-28,000003,Vente,523100,,,AV DU PEYROU,0323,34510,34101,Florensac,34,,,34101000AH0021,,,,,,,,,,,,,0,,,,,S,sols,,,1128,3.467444,43.385831
2021-576648,2021-01-28,000003,Vente,523100,,,AV DU PEYROU,0323,34510,34101,Florensac,34,,,34101000AH0091,,,,,,,,,,,,,0,,,,,T,terres,,,2280,3.468027,43.385766
2021-576708,2021-02-16,000001,Vente,272605,4,,RUE FRIBOULE,0161,34510,34101,Florensac,34,,,34101000AO0186,,,,,,,,,,,,,0,3,Dépendance,,0,S,sols,,,469,3.467409,43.390193
2021-576708,2021-02-16,000001,Vente,272605,4,,RUE FRIBOULE,0161,34510,34101,Florensac,34,,,34101000AO0186,,,,,,,,,,,,,0,1,Maison,96,4,S,sols,,,469,3.467409,43.390193
2021-576731,2021-01-08,000001,Vente,188000,,,LES FANGASSES,B108,34510,34101,Florensac,34,,,341010000E2331,,,,,,,,,,,,,0,,,,,VI,vignes,,,1400,3.488912,43.354038
2021-576731,2021-01-08,000001,Vente,188000,,,LES FANGASSES,B108,34510,34101,Florensac,34,,,341010000E2332,,,,,,,,,,,,,0,,,,,VI,vignes,,,670,3.488917,43.354409
2021-576731,2021-01-08,000001,Vente,188000,,,LES FANGASSES,B108,34510,34101,Florensac,34,,,341010000E2333,,,,,,,,,,,,,0,,,,,VI,vignes,,,1520,3.489381,43.354729
2021-576731,2021-01-08,000001,Vente,188000,,,LES FANGASSES,B108,34510,34101,Florensac,34,,,341010000E2334,,,,,,,,,,,,,0,,,,,VI,vignes,,,1500,3.489046,43.354787
2021-576731,2021-01-08,000001,Vente,188000,,,LES FANGASSES,B108,34510,34101,Florensac,34,,,341010000E2335,,,,,,,,,,,,,0,,,,,VI,vignes,,,1500,3.488743,43.354785
2021-576731,2021-01-08,000001,Vente,188000,,,LES FANGASSES,B108,34510,34101,Florensac,34,,,341010000E2820,,,,,,,,,,,,,0,,,,,VI,vignes,,,10939,3.489663,43.3544
2021-576731,2021-01-08,000001,Vente,188000,,,CHEMIN BAS D AGDE,B072,34510,34101,Florensac,34,,,341010000F0292,,,,,,,,,,,,,0,,,,,VI,vignes,,,7640,3.465947,43.370391
2021-576731,2021-01-08,000001,Vente,188000,,,CHEMIN BAS D AGDE,B072,34510,34101,Florensac,34,,,341010000F0826,,,,,,,,,,,,,0,,,,,VI,vignes,,,8006,3.465407,43.370434
2021-576868,2021-02-12,000001,Vente,15293,,,LA GOURGUE,B133,34510,34101,Florensac,34,,,341010000F0666,,,,,,,,,,,,,0,,,,,T,terres,,,4500,3.467673,43.360503
2021-576868,2021-02-12,000001,Vente,15293,,,LA GOURGUE,B133,34510,34101,Florensac,34,,,341010000F0667,,,,,,,,,,,,,0,,,,,T,terres,,,5850,3.468289,43.360681
2021-576868,2021-02-12,000001,Vente,15293,,,LA GOURGUE,B133,34510,34101,Florensac,34,,,341010000F0668,,,,,,,,,,,,,0,,,,,T,terres,,,2050,3.468309,43.360032
2021-576868,2021-02-12,000001,Vente,15293,,,LA GOURGUE,B133,34510,34101,Florensac,34,,,341010000F0683,,,,,,,,,,,,,0,,,,,T,terres,,,1150,3.467864,43.361189
2021-576868,2021-02-12,000001,Vente,15293,,,LA GOURGUE,B133,34510,34101,Florensac,34,,,341010000F0900,,,,,,,,,,,,,0,,,,,T,terres,,,5646,3.468971,43.360942
2021-576906,2021-02-12,000001,Vente,178348,,,CORBIAN,B078,34510,34101,Florensac,34,,,341010000F0259,,,,,,,,,,,,,0,,,,,T,terres,,,3500,3.473481,43.362608
2021-576906,2021-02-12,000001,Vente,178348,,,CORBIAN,B078,34510,34101,Florensac,34,,,341010000F0260,,,,,,,,,,,,,0,,,,,T,terres,,,1250,3.473493,43.362903
2021-576906,2021-02-12,000001,Vente,178348,,,CORBIAN,B078,34510,34101,Florensac,34,,,341010000F0261,,,,,,,,,,,,,0,,,,,L,landes,,,550,3.473493,43.363023
2021-576906,2021-02-12,000001,Vente,178348,,,CORBIAN,B078,34510,34101,Florensac,34,,,341010000F0262,,,,,,,,,,,,,0,,,,,L,landes,,,550,3.473441,43.363076
2021-576906,2021-02-12,000001,Vente,178348,,,CORBIAN,B078,34510,34101,Florensac,34,,,341010000F0263,,,,,,,,,,,,,0,,,,,L,landes,,,1460,3.473563,43.36324
2021-576906,2021-02-12,000001,Vente,178348,6279,,DOM DE LA GAUFREZE,B274,34510,34101,Florensac,34,,,341010000F0273,,,,,,,,,,,,,0,1,Maison,56,2,S,sols,,,950,3.472266,43.362049
2021-576906,2021-02-12,000001,Vente,178348,,,LA GAUFREZE,B132,34510,34101,Florensac,34,,,341010000F0274,,,,,,,,,,,,,0,,,,,S,sols,,,2250,3.471463,43.362662
2021-576906,2021-02-12,000001,Vente,178348,,,LA GAUFREZE,B132,34510,34101,Florensac,34,,,341010000F0274,,,,,,,,,,,,,0,,,,,T,terres,,,36550,3.471463,43.362662
2021-576906,2021-02-12,000001,Vente,178348,,,LA ROQUE,B218,34510,34101,Florensac,34,,,341010000F0489,,,,,,,,,,,,,0,,,,,T,terres,,,600,3.477185,43.360059
2021-576909,2021-02-12,000001,Vente,36000,,,LA GAUFREZE,B132,34510,34101,Florensac,34,,,341010000F0275,,,,,,,,,,,,,0,,,,,BR,futaies résineuses,PIN,Pins,35500,3.468936,43.362767
2021-576909,2021-02-12,000001,Vente,36000,,,LA GAUFREZE,B132,34510,34101,Florensac,34,,,341010000F0275,,,,,,,,,,,,,0,,,,,BP,peupleraies,,,3730,3.468936,43.362767
2021-576909,2021-02-12,000001,Vente,36000,,,LA GAUFREZE,B132,34510,34101,Florensac,34,,,341010000F0276,,,,,,,,,,,,,0,,,,,S,sols,,,160,3.468862,43.361879
2021-576911,2021-02-12,000001,Vente,10359,,,LES MEJARIES,B152,34510,34101,Florensac,34,,,341010000G0954,,,,,,,,,,,,,0,,,,,T,terres,,,7250,3.457911,43.345609
2021-576911,2021-02-12,000001,Vente,10359,,,LES MEJARIES,B152,34510,34101,Florensac,34,,,341010000G0957,,,,,,,,,,,,,0,,,,,T,terres,,,5700,3.458654,43.346217
2021-576913,2021-02-17,000001,Vente,61110,5745,,RUE DU CENTRE,0070,34510,34101,Florensac,34,,,34101000AB0352,,,,,,,,,,,,,0,1,Maison,25,1,S,sols,,,28,3.463648,43.382615
2021-577012,2021-02-10,000001,Vente,415000,5715,,IMP DE LA TREILLE,0465,34510,34101,Florensac,34,,,34101000AX0111,,,,,,,,,,,,,0,1,Maison,100,4,S,sols,,,980,3.467863,43.383594
2021-577012,2021-02-10,000001,Vente,415000,28,,AV ROGER SALENGRO,0410,34510,34101,Florensac,34,,,34101000AX0112,,,,,,,,,,,,,0,,,,,S,sols,,,870,3.467929,43.383843
2021-577031,2021-02-05,000001,Vente,287700,13,,AV DE LA GARDIE,0165,34510,34101,Florensac,34,,,34101000AH0088,,,,,,,,,,,,,0,1,Maison,122,4,,,,,,3.469192,43.386035
2021-577049,2021-02-26,000001,Vente,3000,,,LES ARENASSES,B006,34510,34101,Florensac,34,,,341010000C1198,,,,,,,,,,,,,0,,,,,VI,vignes,,,1900,3.456785,43.403129
2021-577049,2021-02-26,000001,Vente,3000,,,LES ARENASSES,B006,34510,34101,Florensac,34,,,341010000C1201,,,,,,,,,,,,,0,,,,,T,terres,,,1100,3.45674,43.403912
2021-577237,2021-03-03,000001,Vente,48000,,,LA CAPELETTE,B054,34510,34101,Florensac,34,,,341010000D0837,,,,,,,,,,,,,0,,,,,VI,vignes,,,1220,3.469777,43.413072
2021-577237,2021-03-03,000001,Vente,48000,,,LA CAPELETTE,B054,34510,34101,Florensac,34,,,341010000D0838,,,,,,,,,,,,,0,,,,,VI,vignes,,,1155,3.470155,43.412959
2021-577237,2021-03-03,000001,Vente,48000,,,LA CAPELETTE,B054,34510,34101,Florensac,34,,,341010000D0839,,,,,,,,,,,,,0,,,,,VI,vignes,,,2390,3.470788,43.413005
2021-577237,2021-03-03,000001,Vente,48000,,,LA CAPELETTE,B054,34510,34101,Florensac,34,,,341010000D0840,,,,,,,,,,,,,0,,,,,VI,vignes,,,2405,3.471043,43.413333
2021-577237,2021-03-03,000001,Vente,48000,,,LA CAPELETTE,B054,34510,34101,Florensac,34,,,341010000D0841,,,,,,,,,,,,,0,,,,,VI,vignes,,,1155,3.470453,43.413352
2021-577237,2021-03-03,000001,Vente,48000,,,LA CAPELETTE,B054,34510,34101,Florensac,34,,,341010000D0842,,,,,,,,,,,,,0,,,,,VI,vignes,,,1290,3.47023,43.413513
2021-577237,2021-03-03,000001,Vente,48000,,,LA CAPELETTE,B054,34510,34101,Florensac,34,,,341010000D0843,,,,,,,,,,,,,0,,,,,VI,vignes,,,1510,3.4707,43.413677
2021-577237,2021-03-03,000001,Vente,48000,,,LA CAPELETTE,B054,34510,34101,Florensac,34,,,341010000D0851,,,,,,,,,,,,,0,,,,,VI,vignes,,,1790,3.47059,43.414091
2021-577237,2021-03-03,000001,Vente,48000,,,LA CAPELETTE,B054,34510,34101,Florensac,34,,,341010000D0852,,,,,,,,,,,,,0,,,,,VI,vignes,,,1700,3.471122,43.413792
2021-577237,2021-03-03,000001,Vente,48000,,,LA CAPELETTE,B054,34510,34101,Florensac,34,,,341010000D0853,,,,,,,,,,,,,0,,,,,VI,vignes,,,2210,3.471315,43.413967
2021-577237,2021-03-03,000001,Vente,48000,,,LA CAPELETTE,B054,34510,34101,Florensac,34,,,341010000D3953,,,,,,,,,,,,,0,,,,,VI,vignes,,,330,3.469862,43.41335
2021-577237,2021-03-03,000001,Vente,48000,,,LA CAPELETTE,B054,34510,34101,Florensac,34,,,341010000D4035,,,,,,,,,,,,,0,,,,,VI,vignes,,,2599,3.47022,43.414445
2021-577237,2021-03-03,000001,Vente,48000,,,LA CAPELETTE,B054,34510,34101,Florensac,34,,,341010000D4037,,,,,,,,,,,,,0,,,,,VI,vignes,,,4829,3.469707,43.413433
2021-577237,2021-03-03,000001,Vente,48000,,,LA CAPELETTE,B054,34510,34101,Florensac,34,,,341010000D4039,,,,,,,,,,,,,0,,,,,VI,vignes,,,730,3.469259,43.413125
2021-577237,2021-03-03,000001,Vente,48000,,,LA CAPELETTE,B054,34510,34101,Florensac,34,,,341010000D4050,,,,,,,,,,,,,0,,,,,VI,vignes,,,2282,3.470205,43.413893
2021-577323,2021-03-05,000001,Vente,73155.57,,,L AUMORNE,B009,34510,34101,Florensac,34,,,34101000AS0158,,,,,,,,,,,,,0,,,,,AB,terrains a bâtir,,,1347,3.476058,43.390518
2021-577331,2021-02-19,000001,Vente,264400,3,,RUE DES MESANGES,0272,34510,34101,Florensac,34,,,34101000AP0080,,,,,,,,,,,,,0,1,Maison,90,4,S,sols,,,500,3.470888,43.391097
2021-577365,2021-03-02,000001,Vente,17000,,,LES BELLES,B024,34510,34101,Florensac,34,,,341010000E0429,,,,,,,,,,,,,0,,,,,T,terres,,,318,3.483595,43.378436
2021-577365,2021-03-02,000001,Vente,17000,,,LES BELLES,B024,34510,34101,Florensac,34,,,341010000E0429,,,,,,,,,,,,,0,,,,,VI,vignes,,,3432,3.483595,43.378436
2021-577365,2021-03-02,000001,Vente,17000,,,LES BELLES,B024,34510,34101,Florensac,34,,,341010000E2753,,,,,,,,,,,,,0,,,,,T,terres,,,439,3.484162,43.378991
2021-577365,2021-03-02,000001,Vente,17000,,,LES BELLES,B024,34510,34101,Florensac,34,,,341010000E2753,,,,,,,,,,,,,0,,,,,VI,vignes,,,7026,3.484162,43.378991
2021-577688,2021-03-05,000001,Vente,93000,22,,AV FRANCOIS MIOCH,0160,34510,34101,Florensac,34,,,34101000AK0083,,,19,,,,,,,,,,1,2,Appartement,39,2,,,,,,3.467232,43.381384
2021-577688,2021-03-05,000001,Vente,93000,22,,AV FRANCOIS MIOCH,0160,34510,34101,Florensac,34,,,34101000AK0083,,,2,,,,,,,,,,1,3,Dépendance,,0,,,,,,3.467232,43.381384
2021-577823,2021-03-18,000001,Vente,13000,41,,RUE DOCTEUR CORBIN,0123,34510,34101,Florensac,34,,,34101000AB0383,,,,,,,,,,,,,0,1,Maison,48,1,S,sols,,,27,3.462581,43.38212
2021-577828,2021-03-19,000001,Vente,93000,,,LE PEYROU,B174,34510,34101,Florensac,34,,,34101000AP0177,,,,,,,,,,,,,0,,,,,AB,terrains a bâtir,,,11,3.467039,43.391984
2021-577828,2021-03-19,000001,Vente,93000,,,LE PEYROU,B174,34510,34101,Florensac,34,,,34101000AP0209,,,,,,,,,,,,,0,,,,,AB,terrains a bâtir,,,329,3.467038,43.39194
2021-577909,2021-03-23,000001,Vente,65000,5829,F,RUE DES CAPUCINES,0062,34510,34101,Florensac,34,,,34101000AX0105,,,,,,,,,,,,,0,3,Dépendance,,0,S,sols,,,236,3.469409,43.382289
2021-577928,2021-03-23,000001,Vente,85000,,,LE PEYROU,B174,34510,34101,Florensac,34,,,34101000AP0188,,,,,,,,,,,,,0,,,,,AB,terrains a bâtir,,,142,3.468626,43.391712
2021-577928,2021-03-23,000001,Vente,85000,,,LE PEYROU,B174,34510,34101,Florensac,34,,,34101000AP0213,,,,,,,,,,,,,0,,,,,AB,terrains a bâtir,,,149,3.468601,43.3916
2021-578011,2021-03-12,000001,Vente,204980,9,,RUE DE LA TRAMONTANE,0463,34510,34101,Florensac,34,,,34101000AS0021,,,,,,,,,,,,,0,1,Maison,95,4,S,sols,,,427,3.471749,43.389793
2021-578023,2021-03-29,000001,Vente,60000,8,,IMP DU QUATORZE JUILLET,0369,34510,34101,Florensac,34,,,34101000AI0140,,,,,,,,,,,,,0,1,Maison,56,4,S,sols,,,72,3.466524,43.383076
2021-578047,2021-03-25,000001,Vente,9000,,,LE CACHAT,B052,34510,34101,Florensac,34,,,341010000C0600,,,,,,,,,,,,,0,,,,,VI,vignes,,,4700,3.453728,43.414556
2021-578047,2021-03-25,000001,Vente,9000,,,LE CACHAT,B052,34510,34101,Florensac,34,,,341010000C0601,,,,,,,,,,,,,0,,,,,L,landes,,,240,3.454416,43.414356
2021-578047,2021-03-25,000001,Vente,9000,,,LE CACHAT,B052,34510,34101,Florensac,34,,,341010000C0601,,,,,,,,,,,,,0,,,,,VI,vignes,,,1100,3.454416,43.414356
2021-578048,2021-03-23,000001,Vente,1500,,,LA CROIX DE FAUGE,B089,34510,34101,Florensac,34,,,341010000E1567,,,,,,,,,,,,,0,,,,,T,terres,,,1300,3.493455,43.365224
2021-578070,2021-03-26,000002,Vente terrain à bâtir,4680,19,,RUE DE L'ARTISANAT,0026,34510,34101,Florensac,34,,,34101000AS0167,,,,,,,,,,,,,0,4,Local industriel. commercial ou assimilé,287,0,S,sols,,,71,3.477458,43.390253
2021-578185,2021-03-05,000001,Vente,40000,10,,IMP DU FIGUIER,0145,34510,34101,Florensac,34,,,34101000AI0117,,,,,,,,,,,,,0,1,Maison,25,1,S,sols,,,28,3.467287,43.383131
2021-578208,2021-03-22,000001,Vente,156600,6458,,RUE DU CENTRE,0070,34510,34101,Florensac,34,,,34101000AB0351,,,,,,,,,,,,,0,1,Maison,80,4,S,sols,,,141,3.463745,43.38257
2021-578245,2021-03-26,000001,Vente,69000,5,,RUE DES ALBIGEOIS,0015,34510,34101,Florensac,34,,,34101000AA0029,,,,,,,,,,,,,0,1,Maison,59,2,S,sols,,,30,3.462308,43.381704
2021-578270,2021-03-29,000001,Vente,4000,,,CHEMIN DES MOULINS,B075,34510,34101,Florensac,34,,,341010000G0027,,,,,,,,,,,,,0,,,,,VI,vignes,,,1220,3.44206,43.380502
2021-578331,2021-03-25,000001,Vente,85000,,,LE PEYROU,B174,34510,34101,Florensac,34,,,34101000AP0197,,,,,,,,,,,,,0,,,,,AB,terrains a bâtir,,,299,3.467946,43.391866
2021-578377,2021-04-02,000001,Vente,84000,34,,RUE CARNOT,0065,34510,34101,Florensac,34,,,34101000AB0594,,,,,,,,,,,,,0,1,Maison,65,4,S,sols,,,65,3.463957,43.383327
2021-578478,2021-04-06,000001,Vente,85000,,,LE PEYROU,B174,34510,34101,Florensac,34,,,34101000AP0186,,,,,,,,,,,,,0,,,,,AB,terrains a bâtir,,,142,3.467986,43.391675
2021-578478,2021-04-06,000001,Vente,85000,,,LE PEYROU,B174,34510,34101,Florensac,34,,,34101000AP0217,,,,,,,,,,,,,0,,,,,AB,terrains a bâtir,,,149,3.467958,43.391562
2021-578587,2021-04-01,000001,Vente,20000,,,LES PLOGES,B193,34510,34101,Florensac,34,,,341010000E3561,,,,,,,,,,,,,0,,,,,VI,vignes,,,23410,3.499055,43.365373
2021-578610,2021-04-12,000001,Vente,84500,,,LE PEYROU,B174,34510,34101,Florensac,34,,,34101000AP0190,,,,,,,,,,,,,0,,,,,AB,terrains a bâtir,,,142,3.468306,43.391694
2021-578610,2021-04-12,000001,Vente,84500,,,LE PEYROU,B174,34510,34101,Florensac,34,,,34101000AP0215,,,,,,,,,,,,,0,,,,,AB,terrains a bâtir,,,148,3.468286,43.391581
2021-578614,2021-04-09,000001,Vente,2975.6,,,LA FIGAIROLLE,B112,34510,34101,Florensac,34,,,341010000E0925,,,,,,,,,,,,,0,,,,,VI,vignes,,,1300,3.472655,43.370188
2021-578614,2021-04-09,000001,Vente,2975.6,,,LA FIGAIROLLE,B112,34510,34101,Florensac,34,,,341010000E0926,,,,,,,,,,,,,0,,,,,VI,vignes,,,610,3.47275,43.369984
2021-578671,2021-04-13,000001,Vente,91000,,,LE PEYROU,B174,34510,34101,Florensac,34,,,34101000AP0187,,,,,,,,,,,,,0,,,,,AB,terrains a bâtir,,,162,3.468813,43.39172
2021-578671,2021-04-13,000001,Vente,91000,,,LE PEYROU,B174,34510,34101,Florensac,34,,,34101000AP0212,,,,,,,,,,,,,0,,,,,AB,terrains a bâtir,,,170,3.468811,43.391622
2021-578672,2021-04-15,000001,Vente,24300,,,MONTJOUI,B160,34510,34101,Florensac,34,,,341010000F0184,,,,,,,,,,,,,0,,,,,VI,vignes,,,1120,3.471477,43.368136
2021-578672,2021-04-15,000001,Vente,24300,,,MONTJOUI,B160,34510,34101,Florensac,34,,,341010000F0185,,,,,,,,,,,,,0,,,,,VI,vignes,,,1060,3.471178,43.368325
2021-578672,2021-04-15,000001,Vente,24300,,,MONTJOUI,B160,34510,34101,Florensac,34,,,341010000F0186,,,,,,,,,,,,,0,,,,,VI,vignes,,,1070,3.471114,43.368461
2021-578672,2021-04-15,000001,Vente,24300,,,MONTJOUI,B160,34510,34101,Florensac,34,,,341010000F0187,,,,,,,,,,,,,0,,,,,VI,vignes,,,1070,3.471058,43.36861
2021-578672,2021-04-15,000001,Vente,24300,,,MONTJOUI,B160,34510,34101,Florensac,34,,,341010000F0188,,,,,,,,,,,,,0,,,,,VI,vignes,,,2190,3.47118,43.368791
2021-578672,2021-04-15,000001,Vente,24300,,,MONTJOUI,B160,34510,34101,Florensac,34,,,341010000F0189,,,,,,,,,,,,,0,,,,,VI,vignes,,,2030,3.471274,43.369033
2021-578672,2021-04-15,000001,Vente,24300,,,MONTJOUI,B160,34510,34101,Florensac,34,,,341010000F0190,,,,,,,,,,,,,0,,,,,VI,vignes,,,650,3.471222,43.369197
2021-578672,2021-04-15,000001,Vente,24300,,,MONTJOUI,B160,34510,34101,Florensac,34,,,341010000F0191,,,,,,,,,,,,,0,,,,,VI,vignes,,,1330,3.47136,43.369384
2021-578672,2021-04-15,000001,Vente,24300,,,MONTJOUI,B160,34510,34101,Florensac,34,,,341010000F0197,,,,,,,,,,,,,0,,,,,VI,vignes,,,1000,3.471784,43.37065
2021-578672,2021-04-15,000001,Vente,24300,,,MONTJOUI,B160,34510,34101,Florensac,34,,,341010000F0198,,,,,,,,,,,,,0,,,,,VI,vignes,,,1010,3.47187,43.370433
2021-578672,2021-04-15,000001,Vente,24300,,,MONTJOUI,B160,34510,34101,Florensac,34,,,341010000F0199,,,,,,,,,,,,,0,,,,,VI,vignes,,,1210,3.471566,43.370242
2021-578672,2021-04-15,000001,Vente,24300,,,MONTJOUI,B160,34510,34101,Florensac,34,,,341010000F0200,,,,,,,,,,,,,0,,,,,VI,vignes,,,1100,3.4717,43.370131
2021-578672,2021-04-15,000001,Vente,24300,,,MONTJOUI,B160,34510,34101,Florensac,34,,,341010000F0201,,,,,,,,,,,,,0,,,,,VI,vignes,,,1110,3.471717,43.36994
2021-578672,2021-04-15,000001,Vente,24300,,,MONTJOUI,B160,34510,34101,Florensac,34,,,341010000F0202,,,,,,,,,,,,,0,,,,,VI,vignes,,,830,3.471808,43.369867
2021-578672,2021-04-15,000001,Vente,24300,,,MONTJOUI,B160,34510,34101,Florensac,34,,,341010000F0203,,,,,,,,,,,,,0,,,,,VI,vignes,,,810,3.471768,43.369746
2021-578672,2021-04-15,000001,Vente,24300,,,MONTJOUI,B160,34510,34101,Florensac,34,,,341010000F0204,,,,,,,,,,,,,0,,,,,VI,vignes,,,1990,3.471984,43.36962
2021-578672,2021-04-15,000001,Vente,24300,,,MONTJOUI,B160,34510,34101,Florensac,34,,,341010000F0208,,,,,,,,,,,,,0,,,,,T,terres,,,1180,3.471882,43.369214
2021-578747,2021-04-15,000001,Vente,16964,,,LA TRAVATELLE,B243,34510,34101,Florensac,34,,,341010000B0686,,,,,,,,,,,,,0,,,,,VI,vignes,,,3770,3.455222,43.388441
2021-578747,2021-04-15,000001,Vente,16964,,,LA TRAVATELLE,B243,34510,34101,Florensac,34,,,341010000B0687,,,,,,,,,,,,,0,,,,,VI,vignes,,,3580,3.455284,43.388731
2021-578747,2021-04-15,000001,Vente,16964,,,LA TRAVATELLE,B243,34510,34101,Florensac,34,,,341010000B0691,,,,,,,,,,,,,0,,,,,VI,vignes,,,1780,3.45621,43.388543
2021-578747,2021-04-15,000001,Vente,16964,,,LA TRAVATELLE,B243,34510,34101,Florensac,34,,,341010000B1157,,,,,,,,,,,,,0,,,,,VI,vignes,,,4110,3.455829,43.388992
2021-578747,2021-04-15,000001,Vente,16964,,,LA TRAVATELLE,B243,34510,34101,Florensac,34,,,341010000B1158,,,,,,,,,,,,,0,,,,,VI,vignes,,,2190,3.455194,43.389481
2021-578748,2021-04-08,000002,Vente,130000,,,LA GRANGE DE SALLELES,B137,34510,34101,Florensac,34,,,341010000E1342,,,,,,,,,,,,,0,,,,,S,sols,,,35,3.502206,43.369804
2021-578748,2021-04-08,000002,Vente,130000,,,LA GRANGE DE SALLELES,B137,34510,34101,Florensac,34,,,341010000E3734,,,,,,,,,,,,,0,,,,,VI,vignes,,,1919,3.502434,43.369735
2021-578844,2021-03-23,000001,Vente,155000,35,,RUE GENERAL FRAISSE,0155,34510,34101,Florensac,34,,,34101000AB0215,,,,,,,,,,,,,0,1,Maison,119,5,S,sols,,,187,3.464074,43.382967
2021-579064,2021-04-23,000001,Vente,213200,4,,RUE DES VIOLETTES,0478,34510,34101,Florensac,34,,,34101000AX0022,,,,,,,,,,,,,0,1,Maison,88,4,S,sols,,,343,3.469858,43.383869