id_mutation,date_mutation,numero_disposition,nature_mutation,valeur_fonciere,adresse_numero,adresse_suffixe,adresse_nom_voie,adresse_code_voie,code_postal,code_commune,nom_commune,code_departement,ancien_code_commune,ancien_nom_commune,id_parcelle,ancien_id_parcelle,numero_volume,lot1_numero,lot1_surface_carrez,lot2_numero,lot2_surface_carrez,lot3_numero,lot3_surface_carrez,lot4_numero,lot4_surface_carrez,lot5_numero,lot5_surface_carrez,nombre_lots,code_type_local,type_local,surface_reelle_bati,nombre_pieces_principales,code_nature_culture,nature_culture,code_nature_culture_speciale,nature_culture_speciale,surface_terrain,longitude,latitude
2021-548992,2021-01-12,000001,Vente,1040350,596,,CHE DE LA TRAMONTANE,0160,34980,34169,Montferrier-sur-Lez,34,,,34169000AX0031,,,,,,,,,,,,,0,3,Dépendance,,0,S,sols,,,500,3.846901,43.671696
2021-548992,2021-01-12,000001,Vente,1040350,596,,CHE DE LA TRAMONTANE,0160,34980,34169,Montferrier-sur-Lez,34,,,34169000AX0031,,,,,,,,,,,,,0,1,Maison,278,6,AG,terrains d'agrément,,,3937,3.846901,43.671696
2021-548992,2021-01-12,000001,Vente,1040350,596,,CHE DE LA TRAMONTANE,0160,34980,34169,Montferrier-sur-Lez,34,,,34169000AX0031,,,,,,,,,,,,,0,3,Dépendance,,0,AG,terrains d'agrément,,,3937,3.846901,43.671696
2021-548992,2021-01-12,000001,Vente,1040350,596,,CHE DE LA TRAMONTANE,0160,34980,34169,Montferrier-sur-Lez,34,,,34169000AX0031,,,,,,,,,,,,,0,3,Dépendance,,0,S,sols,,,500,3.846901,43.671696
2021-548992,2021-01-12,000001,Vente,1040350,596,,CHE DE LA TRAMONTANE,0160,34980,34169,Montferrier-sur-Lez,34,,,34169000AX0031,,,,,,,,,,,,,0,3,Dépendance,,0,AG,terrains d'agrément,,,3937,3.846901,43.671696
2021-548992,2021-01-12,000001,Vente,1040350,596,,CHE DE LA TRAMONTANE,0160,34980,34169,Montferrier-sur-Lez,34,,,34169000AX0031,,,,,,,,,,,,,0,1,Maison,278,6,S,sols,,,500,3.846901,43.671696
2021-549010,2021-01-15,000001,Vente,1130000,,,LES GRESES,B016,34980,34169,Montferrier-sur-Lez,34,,,34169000AS0145,,,,,,,,,,,,,0,,,,,L,landes,,,149,3.861112,43.66933
2021-549010,2021-01-15,000001,Vente,1130000,72,A,CHE DE LA GRAND FONT,0092,34980,34169,Montferrier-sur-Lez,34,,,34169000AS0146,,,,,,,,,,,,,0,2,Appartement,19,1,S,sols,,,2650,3.861041,43.669624
2021-549010,2021-01-15,000001,Vente,1130000,72,A,CHE DE LA GRAND FONT,0092,34980,34169,Montferrier-sur-Lez,34,,,34169000AS0146,,,,,,,,,,,,,0,2,Appartement,19,1,S,sols,,,2650,3.861041,43.669624
2021-549010,2021-01-15,000001,Vente,1130000,72,A,CHE DE LA GRAND FONT,0092,34980,34169,Montferrier-sur-Lez,34,,,34169000AS0146,,,,,,,,,,,,,0,2,Appartement,19,1,S,sols,,,2650,3.861041,43.669624
2021-549010,2021-01-15,000001,Vente,1130000,72,A,CHE DE LA GRAND FONT,0092,34980,34169,Montferrier-sur-Lez,34,,,34169000AS0146,,,,,,,,,,,,,0,2,Appartement,19,1,S,sols,,,2650,3.861041,43.669624
2021-549010,2021-01-15,000001,Vente,1130000,72,A,CHE DE LA GRAND FONT,0092,34980,34169,Montferrier-sur-Lez,34,,,34169000AS0146,,,,,,,,,,,,,0,2,Appartement,19,1,S,sols,,,2650,3.861041,43.669624
2021-549010,2021-01-15,000001,Vente,1130000,72,A,CHE DE LA GRAND FONT,0092,34980,34169,Montferrier-sur-Lez,34,,,34169000AS0146,,,,,,,,,,,,,0,2,Appartement,19,1,S,sols,,,2650,3.861041,43.669624
2021-549010,2021-01-15,000001,Vente,1130000,72,A,CHE DE LA GRAND FONT,0092,34980,34169,Montferrier-sur-Lez,34,,,34169000AS0146,,,,,,,,,,,,,0,2,Appartement,19,1,S,sols,,,2650,3.861041,43.669624
2021-549010,2021-01-15,000001,Vente,1130000,72,A,CHE DE LA GRAND FONT,0092,34980,34169,Montferrier-sur-Lez,34,,,34169000AS0146,,,,,,,,,,,,,0,2,Appartement,19,1,S,sols,,,2650,3.861041,43.669624
2021-549010,2021-01-15,000001,Vente,1130000,72,A,CHE DE LA GRAND FONT,0092,34980,34169,Montferrier-sur-Lez,34,,,34169000AS0146,,,,,,,,,,,,,0,2,Appartement,19,1,S,sols,,,2650,3.861041,43.669624
2021-549010,2021-01-15,000001,Vente,1130000,72,A,CHE DE LA GRAND FONT,0092,34980,34169,Montferrier-sur-Lez,34,,,34169000AS0146,,,,,,,,,,,,,0,2,Appartement,19,1,S,sols,,,2650,3.861041,43.669624
2021-549010,2021-01-15,000001,Vente,1130000,72,A,CHE DE LA GRAND FONT,0092,34980,34169,Montferrier-sur-Lez,34,,,34169000AS0146,,,,,,,,,,,,,0,2,Appartement,19,1,S,sols,,,2650,3.861041,43.669624
2021-549010,2021-01-15,000001,Vente,1130000,72,A,CHE DE LA GRAND FONT,0092,34980,34169,Montferrier-sur-Lez,34,,,34169000AS0146,,,,,,,,,,,,,0,2,Appartement,19,1,S,sols,,,2650,3.861041,43.669624
2021-549010,2021-01-15,000001,Vente,1130000,72,A,CHE DE LA GRAND FONT,0092,34980,34169,Montferrier-sur-Lez,34,,,34169000AS0146,,,,,,,,,,,,,0,2,Appartement,19,1,S,sols,,,2650,3.861041,43.669624
2021-549010,2021-01-15,000001,Vente,1130000,72,A,CHE DE LA GRAND FONT,0092,34980,34169,Montferrier-sur-Lez,34,,,34169000AS0146,,,,,,,,,,,,,0,2,Appartement,19,1,S,sols,,,2650,3.861041,43.669624
2021-549010,2021-01-15,000001,Vente,1130000,72,A,CHE DE LA GRAND FONT,0092,34980,34169,Montferrier-sur-Lez,34,,,34169000AS0146,,,,,,,,,,,,,0,2,Appartement,19,1,S,sols,,,2650,3.861041,43.669624
2021-549010,2021-01-15,000001,Vente,1130000,72,A,CHE DE LA GRAND FONT,0092,34980,34169,Montferrier-sur-Lez,34,,,34169000AS0146,,,,,,,,,,,,,0,2,Appartement,19,1,S,sols,,,2650,3.861041,43.669624
2021-549010,2021-01-15,000001,Vente,1130000,72,A,CHE DE LA GRAND FONT,0092,34980,34169,Montferrier-sur-Lez,34,,,34169000AS0146,,,,,,,,,,,,,0,2,Appartement,19,1,S,sols,,,2650,3.861041,43.669624
2021-549010,2021-01-15,000001,Vente,1130000,72,A,CHE DE LA GRAND FONT,0092,34980,34169,Montferrier-sur-Lez,34,,,34169000AS0146,,,,,,,,,,,,,0,2,Appartement,19,1,S,sols,,,2650,3.861041,43.669624
2021-549010,2021-01-15,000001,Vente,1130000,72,A,CHE DE LA GRAND FONT,0092,34980,34169,Montferrier-sur-Lez,34,,,34169000AS0146,,,,,,,,,,,,,0,2,Appartement,19,1,S,sols,,,2650,3.861041,43.669624
2021-549010,2021-01-15,000001,Vente,1130000,72,A,CHE DE LA GRAND FONT,0092,34980,34169,Montferrier-sur-Lez,34,,,34169000AS0146,,,,,,,,,,,,,0,2,Appartement,19,1,S,sols,,,2650,3.861041,43.669624
2021-549010,2021-01-15,000001,Vente,1130000,72,A,CHE DE LA GRAND FONT,0092,34980,34169,Montferrier-sur-Lez,34,,,34169000AS0146,,,,,,,,,,,,,0,2,Appartement,19,1,S,sols,,,2650,3.861041,43.669624
2021-549010,2021-01-15,000001,Vente,1130000,72,A,CHE DE LA GRAND FONT,0092,34980,34169,Montferrier-sur-Lez,34,,,34169000AS0146,,,,,,,,,,,,,0,2,Appartement,19,1,S,sols,,,2650,3.861041,43.669624
2021-549010,2021-01-15,000001,Vente,1130000,72,A,CHE DE LA GRAND FONT,0092,34980,34169,Montferrier-sur-Lez,34,,,34169000AS0146,,,,,,,,,,,,,0,2,Appartement,19,1,S,sols,,,2650,3.861041,43.669624
2021-549010,2021-01-15,000001,Vente,1130000,72,A,CHE DE LA GRAND FONT,0092,34980,34169,Montferrier-sur-Lez,34,,,34169000AS0146,,,,,,,,,,,,,0,2,Appartement,19,1,S,sols,,,2650,3.861041,43.669624
2021-549010,2021-01-15,000001,Vente,1130000,72,A,CHE DE LA GRAND FONT,0092,34980,34169,Montferrier-sur-Lez,34,,,34169000AS0146,,,,,,,,,,,,,0,2,Appartement,19,1,S,sols,,,2650,3.861041,43.669624
2021-549010,2021-01-15,000001,Vente,1130000,72,A,CHE DE LA GRAND FONT,0092,34980,34169,Montferrier-sur-Lez,34,,,34169000AS0146,,,,,,,,,,,,,0,2,Appartement,19,1,S,sols,,,2650,3.861041,43.669624
2021-549010,2021-01-15,000001,Vente,1130000,72,A,CHE DE LA GRAND FONT,0092,34980,34169,Montferrier-sur-Lez,34,,,34169000AS0146,,,,,,,,,,,,,0,2,Appartement,19,1,S,sols,,,2650,3.861041,43.669624
2021-549010,2021-01-15,000001,Vente,1130000,72,A,CHE DE LA GRAND FONT,0092,34980,34169,Montferrier-sur-Lez,34,,,34169000AS0146,,,,,,,,,,,,,0,2,Appartement,19,1,S,sols,,,2650,3.861041,43.669624
2021-549010,2021-01-15,000001,Vente,1130000,72,A,CHE DE LA GRAND FONT,0092,34980,34169,Montferrier-sur-Lez,34,,,34169000AS0146,,,,,,,,,,,,,0,2,Appartement,19,1,S,sols,,,2650,3.861041,43.669624
2021-549010,2021-01-15,000001,Vente,1130000,72,A,CHE DE LA GRAND FONT,0092,34980,34169,Montferrier-sur-Lez,34,,,34169000AS0146,,,,,,,,,,,,,0,2,Appartement,19,1,S,sols,,,2650,3.861041,43.669624
2021-549010,2021-01-15,000001,Vente,1130000,72,A,CHE DE LA GRAND FONT,0092,34980,34169,Montferrier-sur-Lez,34,,,34169000AS0146,,,,,,,,,,,,,0,3,Dépendance,,0,S,sols,,,2650,3.861041,43.669624
2021-549010,2021-01-15,000001,Vente,1130000,72,A,CHE DE LA GRAND FONT,0092,34980,34169,Montferrier-sur-Lez,34,,,34169000AS0146,,,,,,,,,,,,,0,3,Dépendance,,0,S,sols,,,2650,3.861041,43.669624
2021-549010,2021-01-15,000001,Vente,1130000,72,A,CHE DE LA GRAND FONT,0092,34980,34169,Montferrier-sur-Lez,34,,,34169000AS0146,,,,,,,,,,,,,0,3,Dépendance,,0,S,sols,,,2650,3.861041,43.669624
2021-549010,2021-01-15,000001,Vente,1130000,72,A,CHE DE LA GRAND FONT,0092,34980,34169,Montferrier-sur-Lez,34,,,34169000AS0146,,,,,,,,,,,,,0,3,Dépendance,,0,S,sols,,,2650,3.861041,43.669624
2021-549010,2021-01-15,000001,Vente,1130000,72,A,CHE DE LA GRAND FONT,0092,34980,34169,Montferrier-sur-Lez,34,,,34169000AS0146,,,,,,,,,,,,,0,3,Dépendance,,0,S,sols,,,2650,3.861041,43.669624
2021-549010,2021-01-15,000001,Vente,1130000,72,A,CHE DE LA GRAND FONT,0092,34980,34169,Montferrier-sur-Lez,34,,,34169000AS0146,,,,,,,,,,,,,0,3,Dépendance,,0,S,sols,,,2650,3.861041,43.669624
2021-549010,2021-01-15,000001,Vente,1130000,72,A,CHE DE LA GRAND FONT,0092,34980,34169,Montferrier-sur-Lez,34,,,34169000AS0146,,,,,,,,,,,,,0,3,Dépendance,,0,S,sols,,,2650,3.861041,43.669624
2021-549010,2021-01-15,000001,Vente,1130000,72,A,CHE DE LA GRAND FONT,0092,34980,34169,Montferrier-sur-Lez,34,,,34169000AS0146,,,,,,,,,,,,,0,3,Dépendance,,0,S,sols,,,2650,3.861041,43.669624
2021-549010,2021-01-15,000001,Vente,1130000,72,A,CHE DE LA GRAND FONT,0092,34980,34169,Montferrier-sur-Lez,34,,,34169000AS0146,,,,,,,,,,,,,0,3,Dépendance,,0,S,sols,,,2650,3.861041,43.669624
2021-549010,2021-01-15,000001,Vente,1130000,72,A,CHE DE LA GRAND FONT,0092,34980,34169,Montferrier-sur-Lez,34,,,34169000AS0146,,,,,,,,,,,,,0,3,Dépendance,,0,S,sols,,,2650,3.861041,43.669624
2021-549010,2021-01-15,000001,Vente,1130000,72,A,CHE DE LA GRAND FONT,0092,34980,34169,Montferrier-sur-Lez,34,,,34169000AS0146,,,,,,,,,,,,,0,3,Dépendance,,0,S,sols,,,2650,3.861041,43.669624
2021-549010,2021-01-15,000001,Vente,1130000,72,A,CHE DE LA GRAND FONT,0092,34980,34169,Montferrier-sur-Lez,34,,,34169000AS0146,,,,,,,,,,,,,0,3,Dépendance,,0,S,sols,,,2650,3.861041,43.669624
2021-549010,2021-01-15,000001,Vente,1130000,72,A,CHE DE LA GRAND FONT,0092,34980,34169,Montferrier-sur-Lez,34,,,34169000AS0146,,,,,,,,,,,,,0,3,Dépendance,,0,S,sols,,,2650,3.861041,43.669624
2021-549010,2021-01-15,000001,Vente,1130000,72,A,CHE DE LA GRAND FONT,0092,34980,34169,Montferrier-sur-Lez,34,,,34169000AS0146,,,,,,,,,,,,,0,3,Dépendance,,0,S,sols,,,2650,3.861041,43.669624
2021-549010,2021-01-15,000001,Vente,1130000,72,A,CHE DE LA GRAND FONT,0092,34980,34169,Montferrier-sur-Lez,34,,,34169000AS0146,,,,,,,,,,,,,0,3,Dépendance,,0,S,sols,,,2650,3.861041,43.669624
2021-549010,2021-01-15,000001,Vente,1130000,72,A,CHE DE LA GRAND FONT,0092,34980,34169,Montferrier-sur-Lez,34,,,34169000AS0146,,,,,,,,,,,,,0,3,Dépendance,,0,S,sols,,,2650,3.861041,43.669624
2021-549010,2021-01-15,000001,Vente,1130000,72,A,CHE DE LA GRAND FONT,0092,34980,34169,Montferrier-sur-Lez,34,,,34169000AS0146,,,,,,,,,,,,,0,3,Dépendance,,0,S,sols,,,2650,3.861041,43.669624
2021-549010,2021-01-15,000001,Vente,1130000,72,A,CHE DE LA GRAND FONT,0092,34980,34169,Montferrier-sur-Lez,34,,,34169000AS0146,,,,,,,,,,,,,0,3,Dépendance,,0,S,sols,,,2650,3.861041,43.669624
2021-549010,2021-01-15,000001,Vente,1130000,72,A,CHE DE LA GRAND FONT,0092,34980,34169,Montferrier-sur-Lez,34,,,34169000AS0146,,,,,,,,,,,,,0,3,Dépendance,,0,S,sols,,,2650,3.861041,43.669624
2021-549010,2021-01-15,000001,Vente,1130000,72,A,CHE DE LA GRAND FONT,0092,34980,34169,Montferrier-sur-Lez,34,,,34169000AS0146,,,,,,,,,,,,,0,3,Dépendance,,0,S,sols,,,2650,3.861041,43.669624
2021-549010,2021-01-15,000001,Vente,1130000,72,A,CHE DE LA GRAND FONT,0092,34980,34169,Montferrier-sur-Lez,34,,,34169000AS0146,,,,,,,,,,,,,0,3,Dépendance,,0,S,sols,,,2650,3.861041,43.669624
2021-549010,2021-01-15,000001,Vente,1130000,72,A,CHE DE LA GRAND FONT,0092,34980,34169,Montferrier-sur-Lez,34,,,34169000AS0146,,,,,,,,,,,,,0,3,Dépendance,,0,S,sols,,,2650,3.861041,43.669624
2021-549010,2021-01-15,000001,Vente,1130000,72,A,CHE DE LA GRAND FONT,0092,34980,34169,Montferrier-sur-Lez,34,,,34169000AS0146,,,,,,,,,,,,,0,3,Dépendance,,0,S,sols,,,2650,3.861041,43.669624
2021-549010,2021-01-15,000001,Vente,1130000,72,A,CHE DE LA GRAND FONT,0092,34980,34169,Montferrier-sur-Lez,34,,,34169000AS0146,,,,,,,,,,,,,0,3,Dépendance,,0,S,sols,,,2650,3.861041,43.669624
2021-549010,2021-01-15,000001,Vente,1130000,72,A,CHE DE LA GRAND FONT,0092,34980,34169,Montferrier-sur-Lez,34,,,34169000AS0146,,,,,,,,,,,,,0,3,Dépendance,,0,S,sols,,,2650,3.861041,43.669624
2021-549010,2021-01-15,000001,Vente,1130000,72,A,CHE DE LA GRAND FONT,0092,34980,34169,Montferrier-sur-Lez,34,,,34169000AS0146,,,,,,,,,,,,,0,3,Dépendance,,0,S,sols,,,2650,3.861041,43.669624
2021-549010,2021-01-15,000001,Vente,1130000,72,A,CHE DE LA GRAND FONT,0092,34980,34169,Montferrier-sur-Lez,34,,,34169000AS0146,,,,,,,,,,,,,0,3,Dépendance,,0,S,sols,,,2650,3.861041,43.669624
2021-549010,2021-01-15,000001,Vente,1130000,72,A,CHE DE LA GRAND FONT,0092,34980,34169,Montferrier-sur-Lez,34,,,34169000AS0146,,,,,,,,,,,,,0,3,Dépendance,,0,S,sols,,,2650,3.861041,43.669624
2021-549010,2021-01-15,000001,Vente,1130000,72,A,CHE DE LA GRAND FONT,0092,34980,34169,Montferrier-sur-Lez,34,,,34169000AS0146,,,,,,,,,,,,,0,3,Dépendance,,0,S,sols,,,2650,3.861041,43.669624
2021-549299,2021-01-15,000001,Vente,290000,,,LE TINAL,B046,34980,34169,Montferrier-sur-Lez,34,,,34169000AO0073,,,,,,,,,,,,,0,,,,,S,sols,,,23,3.860973,43.662483
2021-549337,2021-01-29,000001,Vente,763130,157,,ALL FRANCOIS-XAVIER FABRE,0075,34980,34169,Montferrier-sur-Lez,34,,,34169000AY0094,,,,,,,,,,,,,0,3,Dépendance,,0,S,sols,,,801,3.854071,43.675021
2021-549337,2021-01-29,000001,Vente,763130,157,,ALL FRANCOIS-XAVIER FABRE,0075,34980,34169,Montferrier-sur-Lez,34,,,34169000AY0094,,,,,,,,,,,,,0,1,Maison,164,5,S,sols,,,801,3.854071,43.675021
2021-549403,2021-02-02,000001,Vente,608000,224,,CHE DU BOUT DE GAIL,0036,34980,34169,Montferrier-sur-Lez,34,,,34169000AZ0033,,,,,,,,,,,,,0,1,Maison,134,5,S,sols,,,1350,3.854118,43.672419
2021-549403,2021-02-02,000001,Vente,608000,,,LE POUGET,B030,34980,34169,Montferrier-sur-Lez,34,,,34169000AZ0198,,,,,,,,,,,,,0,,,,,L,landes,,,262,3.854068,43.672161
2021-549634,2021-01-15,000001,Vente,164000,2,A,CHE DU RAPATEL,0151,34980,34169,Montferrier-sur-Lez,34,,,34169000AB0005,,,1,,12,,13,,,,,,3,3,Dépendance,,0,,,,,,3.861544,43.653546
2021-549634,2021-01-15,000001,Vente,164000,2,A,CHE DU RAPATEL,0151,34980,34169,Montferrier-sur-Lez,34,,,34169000AB0005,,,1,,12,,13,,,,,,3,2,Appartement,45,2,,,,,,3.861544,43.653546
2021-550038,2021-02-12,000001,Vente,170000,2800,,RTE DE MENDE,0109,34980,34169,Montferrier-sur-Lez,34,,,34169000BH0097,,,130,,8,,,,,,,,2,2,Appartement,42,2,,,,,,3.868683,43.674941
2021-550074,2021-01-29,000001,Vente,257000,2,,PL DE L'EGLISE,0071,34980,34169,Montferrier-sur-Lez,34,,,34169000AR0276,,,,,,,,,,,,,0,1,Maison,48,3,S,sols,,,38,3.860823,43.666461
2021-550318,2021-02-18,000001,Vente,550000,,,CHE DE VERSAILLES,0166,34980,34169,Montferrier-sur-Lez,34,,,34169000AL0065,,,,,,,,,,,,,0,,,,,AB,terrains a bâtir,,,107,3.848164,43.663422
2021-550318,2021-02-18,000001,Vente,550000,8,,LOT LE VERSAILLES I,A022,34980,34169,Montferrier-sur-Lez,34,,,34169000AL0066,,,,,,,,,,,,,0,1,Maison,143,6,S,sols,,,502,3.848105,43.663275
2021-550318,2021-02-18,000001,Vente,550000,8,,LOT LE VERSAILLES I,A022,34980,34169,Montferrier-sur-Lez,34,,,34169000AL0066,,,,,,,,,,,,,0,1,Maison,143,6,AG,terrains d'agrément,,,400,3.848105,43.663275
2021-550332,2021-02-11,000001,Vente,560000,420,,CHE DE LA SERANNE,0158,34980,34169,Montferrier-sur-Lez,34,,,34169000AX0125,,,,,,,,,,,,,0,,,,,AB,terrains a bâtir,,,2911,3.84935,43.670636
2021-550334,2021-02-25,000001,Vente,413000,724,,CHE DU PIOCH DE BAILLOS,0135,34980,34169,Montferrier-sur-Lez,34,,,34169000AI0123,,,,,,,,,,,,,0,,,,,AB,terrains a bâtir,,,1000,3.853835,43.660051
2021-550355,2021-02-12,000001,Vente,305000,8,,CHE DU RAPATEL,0151,34980,34169,Montferrier-sur-Lez,34,,,34169000AB0163,,,,,,,,,,,,,0,,,,,AB,terrains a bâtir,,,684,3.862613,43.652938
2021-550439,2021-02-25,000001,Vente,825000,22,,CHE DES AIGUEILLERES,0004,34980,34169,Montferrier-sur-Lez,34,,,34169000AM0093,,,,,,,,,,,,,0,3,Dépendance,,0,AG,terrains d'agrément,,,1002,3.852013,43.663596
2021-550439,2021-02-25,000001,Vente,825000,22,,CHE DES AIGUEILLERES,0004,34980,34169,Montferrier-sur-Lez,34,,,34169000AM0093,,,,,,,,,,,,,0,1,Maison,259,6,S,sols,,,1000,3.852013,43.663596
2021-550439,2021-02-25,000001,Vente,825000,22,,CHE DES AIGUEILLERES,0004,34980,34169,Montferrier-sur-Lez,34,,,34169000AM0093,,,,,,,,,,,,,0,3,Dépendance,,0,S,sols,,,1000,3.852013,43.663596
2021-550439,2021-02-25,000001,Vente,825000,22,,CHE DES AIGUEILLERES,0004,34980,34169,Montferrier-sur-Lez,34,,,34169000AM0093,,,,,,,,,,,,,0,1,Maison,259,6,AG,terrains d'agrément,,,1002,3.852013,43.663596
2021-550660,2021-02-26,000001,Vente,920000,9000,,IMP DES ARCEAUX,0010,34980,34169,Montferrier-sur-Lez,34,,,34169000AD0058,,,,,,,,,,,,,0,1,Maison,233,6,S,sols,,,1000,3.859419,43.653493
2021-550660,2021-02-26,000001,Vente,920000,9000,,IMP DES ARCEAUX,0010,34980,34169,Montferrier-sur-Lez,34,,,34169000AD0058,,,,,,,,,,,,,0,1,Maison,233,6,AG,terrains d'agrément,,,1025,3.859419,43.653493
2021-550929,2021-02-22,000001,Vente,740000,,,PLAN DES ROMARINS,0156,34980,34169,Montferrier-sur-Lez,34,,,34169000AT0007,,,,,,,,,,,,,0,,,,,AB,terrains a bâtir,,,551,3.850061,43.670201
2021-550929,2021-02-22,000001,Vente,740000,,,SOUS-COSTE,B036,34980,34169,Montferrier-sur-Lez,34,,,34169000AW0001,,,,,,,,,,,,,0,,,,,AB,terrains a bâtir,,,249,3.842517,43.67054
2021-550929,2021-02-22,000001,Vente,740000,,,SOUS-COSTE,B036,34980,34169,Montferrier-sur-Lez,34,,,34169000AW0004,,,,,,,,,,,,,0,,,,,AB,terrains a bâtir,,,470,3.841817,43.670185
2021-550929,2021-02-22,000001,Vente,740000,,,SOUS-COSTE,B036,34980,34169,Montferrier-sur-Lez,34,,,34169000AW0005,,,,,,,,,,,,,0,,,,,AB,terrains a bâtir,,,1220,3.841878,43.668292
2021-550929,2021-02-22,000001,Vente,740000,9,,CHE DU MAS DU PRIOU,0107,34980,34169,Montferrier-sur-Lez,34,,,34169000AW0009,,,,,,,,,,,,,0,,,,,AB,terrains a bâtir,,,244,3.843425,43.66913
2021-550929,2021-02-22,000001,Vente,740000,,,SOUS-COSTE,B036,34980,34169,Montferrier-sur-Lez,34,,,34169000AW0023,,,,,,,,,,,,,0,,,,,AB,terrains a bâtir,,,473,3.845834,43.668699
2021-550929,2021-02-22,000001,Vente,740000,,,IMP DES LAVANDES,0100,34980,34169,Montferrier-sur-Lez,34,,,34169000AW0082,,,,,,,,,,,,,0,,,,,AB,terrains a bâtir,,,1290,3.847222,43.669105
2021-550929,2021-02-22,000001,Vente,740000,,,IMP DES LAVANDES,0100,34980,34169,Montferrier-sur-Lez,34,,,34169000AW0084,,,,,,,,,,,,,0,,,,,AB,terrains a bâtir,,,515,3.848309,43.669182
2021-550929,2021-02-22,000001,Vente,740000,,,SOUS-COSTE,B036,34980,34169,Montferrier-sur-Lez,34,,,34169000AW0091,,,,,,,,,,,,,0,,,,,AB,terrains a bâtir,,,471,3.848769,43.670094
2021-550929,2021-02-22,000001,Vente,740000,,,CHE DE LA SERANNE,0158,34980,34169,Montferrier-sur-Lez,34,,,34169000AW0095,,,,,,,,,,,,,0,,,,,AB,terrains a bâtir,,,5690,3.845363,43.669576
2021-550929,2021-02-22,000001,Vente,740000,,,SOUS-COSTE,B036,34980,34169,Montferrier-sur-Lez,34,,,34169000AW0097,,,,,,,,,,,,,0,,,,,AB,terrains a bâtir,,,107,3.845826,43.668884
2021-550929,2021-02-22,000001,Vente,740000,,,COTE DES LAURIERS TINS,0102,34980,34169,Montferrier-sur-Lez,34,,,34169000AW0104,,,,,,,,,,,,,0,,,,,AB,terrains a bâtir,,,554,3.845466,43.670524
2021-550929,2021-02-22,000001,Vente,740000,,,SOUS-COSTE,B036,34980,34169,Montferrier-sur-Lez,34,,,34169000AW0105,,,,,,,,,,,,,0,,,,,AB,terrains a bâtir,,,45,3.845096,43.670458
2021-550929,2021-02-22,000001,Vente,740000,,,LA DEVESE,B009,34980,34169,Montferrier-sur-Lez,34,,,34169000AW0110,,,,,,,,,,,,,0,,,,,AB,terrains a bâtir,,,1363,3.843916,43.669913
2021-550929,2021-02-22,000001,Vente,740000,,,SOUS-COSTE,B036,34980,34169,Montferrier-sur-Lez,34,,,34169000AW0113,,,,,,,,,,,,,0,,,,,AB,terrains a bâtir,,,40,3.847965,43.669151
2021-550929,2021-02-22,000001,Vente,740000,,,IMP DES LAVANDES,0100,34980,34169,Montferrier-sur-Lez,34,,,34169000AW0174,,,,,,,,,,,,,0,,,,,AG,terrains d'agrément,,,1312,3.848521,43.668999
2021-550929,2021-02-22,000001,Vente,740000,,,LA DEVESE,B009,34980,34169,Montferrier-sur-Lez,34,,,34169000AX0003,,,,,,,,,,,,,0,,,,,AB,terrains a bâtir,,,573,3.843165,43.67108
2021-550929,2021-02-22,000001,Vente,740000,,,LA DEVESE,B009,34980,34169,Montferrier-sur-Lez,34,,,34169000AX0004,,,,,,,,,,,,,0,,,,,AB,terrains a bâtir,,,983,3.843738,43.671974
2021-550929,2021-02-22,000001,Vente,740000,,,LA DEVESE,B009,34980,34169,Montferrier-sur-Lez,34,,,34169000AX0006,,,,,,,,,,,,,0,,,,,L,landes,,,332,3.843363,43.672017
2021-550929,2021-02-22,000001,Vente,740000,,,LA DEVESE,B009,34980,34169,Montferrier-sur-Lez,34,,,34169000AX0007,,,,,,,,,,,,,0,,,,,AB,terrains a bâtir,,,736,3.842703,43.671442
2021-550929,2021-02-22,000001,Vente,740000,,,LA DEVESE,B009,34980,34169,Montferrier-sur-Lez,34,,,34169000AX0009,,,,,,,,,,,,,0,,,,,AB,terrains a bâtir,,,5380,3.844969,43.672557
2021-550929,2021-02-22,000001,Vente,740000,,,LA DEVESE,B009,34980,34169,Montferrier-sur-Lez,34,,,34169000AX0011,,,,,,,,,,,,,0,,,,,AB,terrains a bâtir,,,217,3.846691,43.673713
2021-550929,2021-02-22,000001,Vente,740000,,,LA DEVESE,B009,34980,34169,Montferrier-sur-Lez,34,,,34169000AX0012,,,,,,,,,,,,,0,,,,,AB,terrains a bâtir,,,251,3.848513,43.674117
2021-550929,2021-02-22,000001,Vente,740000,,,LA DEVESE,B009,34980,34169,Montferrier-sur-Lez,34,,,34169000AX0023,,,,,,,,,,,,,0,,,,,AB,terrains a bâtir,,,1195,3.850116,43.6738
2021-550929,2021-02-22,000001,Vente,740000,,,LA DEVESE,B009,34980,34169,Montferrier-sur-Lez,34,,,34169000AX0049,,,,,,,,,,,,,0,,,,,AB,terrains a bâtir,,,1368,3.848878,43.670879
2021-550929,2021-02-22,000001,Vente,740000,,,LA DEVESE,B009,34980,34169,Montferrier-sur-Lez,34,,,34169000AX0056,,,,,,,,,,,,,0,,,,,AB,terrains a bâtir,,,8797,3.848546,43.671122
2021-550929,2021-02-22,000001,Vente,740000,,,LA DEVESE,B009,34980,34169,Montferrier-sur-Lez,34,,,34169000AX0057,,,,,,,,,,,,,0,,,,,AB,terrains a bâtir,,,648,3.846426,43.671698
2021-550929,2021-02-22,000001,Vente,740000,,,LA DEVESE,B009,34980,34169,Montferrier-sur-Lez,34,,,34169000AX0064,,,,,,,,,,,,,0,,,,,AB,terrains a bâtir,,,25,3.846015,43.670615
2021-550929,2021-02-22,000001,Vente,740000,,,LA DEVESE,B009,34980,34169,Montferrier-sur-Lez,34,,,34169000AX0069,,,,,,,,,,,,,0,,,,,AB,terrains a bâtir,,,54,3.843719,43.669942
2021-550929,2021-02-22,000001,Vente,740000,,,LA DEVESE,B009,34980,34169,Montferrier-sur-Lez,34,,,34169000AX0072,,,,,,,,,,,,,0,,,,,AB,terrains a bâtir,,,352,3.843808,43.670528
2021-550929,2021-02-22,000001,Vente,740000,,,LA DEVESE,B009,34980,34169,Montferrier-sur-Lez,34,,,34169000AX0078,,,,,,,,,,,,,0,,,,,AB,terrains a bâtir,,,350,3.844376,43.672244
2021-550929,2021-02-22,000001,Vente,740000,,,LA DEVESE,B009,34980,34169,Montferrier-sur-Lez,34,,,34169000AX0079,,,,,,,,,,,,,0,,,,,AB,terrains a bâtir,,,2976,3.845781,43.672502
2021-550929,2021-02-22,000001,Vente,740000,,,LA DEVESE,B009,34980,34169,Montferrier-sur-Lez,34,,,34169000AX0084,,,,,,,,,,,,,0,,,,,AB,terrains a bâtir,,,37,3.84641,43.671166
2021-550929,2021-02-22,000001,Vente,740000,,,LA DEVESE,B009,34980,34169,Montferrier-sur-Lez,34,,,34169000AX0112,,,,,,,,,,,,,0,,,,,AB,terrains a bâtir,,,44,3.847441,43.672505
2021-550929,2021-02-22,000001,Vente,740000,,,LA DEVESE,B009,34980,34169,Montferrier-sur-Lez,34,,,34169000AX0113,,,,,,,,,,,,,0,,,,,AB,terrains a bâtir,,,1040,3.848415,43.672911
2021-551259,2021-03-12,000001,Vente,751000,3,,LOT LES ASPHODELES,A026,34980,34169,Montferrier-sur-Lez,34,,,34169000AZ0157,,,,,,,,,,,,,0,1,Maison,131,5,S,sols,,,1175,3.85658,43.672874
2021-551290,2021-03-16,000001,Vente,285000,,,LE TINAL,B046,34980,34169,Montferrier-sur-Lez,34,,,34169000AO0065,,,,,,,,,,,,,0,,,,,S,sols,,,610,3.860774,43.662017
2021-551864,2021-04-06,000001,Vente,170000,,,CHE DU MAS DE L'HUILE,0105,34980,34169,Montferrier-sur-Lez,34,,,34169000AT0035,,,,,,,,,,,,,0,,,,,BR,futaies résineuses,PIN,Pins,268,3.854217,43.670381