id_mutation,date_mutation,numero_disposition,nature_mutation,valeur_fonciere,adresse_numero,adresse_suffixe,adresse_nom_voie,adresse_code_voie,code_postal,code_commune,nom_commune,code_departement,ancien_code_commune,ancien_nom_commune,id_parcelle,ancien_id_parcelle,numero_volume,lot1_numero,lot1_surface_carrez,lot2_numero,lot2_surface_carrez,lot3_numero,lot3_surface_carrez,lot4_numero,lot4_surface_carrez,lot5_numero,lot5_surface_carrez,nombre_lots,code_type_local,type_local,surface_reelle_bati,nombre_pieces_principales,code_nature_culture,nature_culture,code_nature_culture_speciale,nature_culture_speciale,surface_terrain,longitude,latitude
2021-577146,2021-02-25,000001,Vente,46000,,,LA RIVIERE,B065,34390,34273,Saint-Martin-de-l'Arçon,34,,,342730000A0037,,,,,,,,,,,,,0,,,,,P,prés,,,190,2.979298,43.56791
2021-577146,2021-02-25,000001,Vente,46000,,,LA RIVIERE,B065,34390,34273,Saint-Martin-de-l'Arçon,34,,,342730000A0044,,,,,,,,,,,,,0,,,,,BT,taillis simples,CHENE,Chênes,1020,2.980208,43.568309
2021-577146,2021-02-25,000001,Vente,46000,,,LA RIVIERE,B065,34390,34273,Saint-Martin-de-l'Arçon,34,,,342730000A0064,,,,,,,,,,,,,0,,,,,L,landes,,,455,2.980471,43.566988
2021-577146,2021-02-25,000001,Vente,46000,,,LA RIVIERE,B065,34390,34273,Saint-Martin-de-l'Arçon,34,,,342730000A0091,,,,,,,,,,,,,0,,,,,T,terres,,,2100,2.982553,43.567312
2021-577146,2021-02-25,000001,Vente,46000,,,LA RIVIERE,B065,34390,34273,Saint-Martin-de-l'Arçon,34,,,342730000A0106,,,,,,,,,,,,,0,,,,,VI,vignes,,,3255,2.982289,43.567043
2021-577146,2021-02-25,000001,Vente,46000,,,LA RIVIERE,B065,34390,34273,Saint-Martin-de-l'Arçon,34,,,342730000A0123,,,,,,,,,,,,,0,,,,,VE,vergers,CERIS,Cerisaie ou cerisiers,490,2.981893,43.566199
2021-577146,2021-02-25,000001,Vente,46000,,,LA RIVIERE,B065,34390,34273,Saint-Martin-de-l'Arçon,34,,,342730000A0125,,,,,,,,,,,,,0,,,,,J,jardins,POTAG,Jardin potager,185,2.981697,43.565991
2021-577146,2021-02-25,000001,Vente,46000,,,LA RIVIERE,B065,34390,34273,Saint-Martin-de-l'Arçon,34,,,342730000A0125,,,,,,,,,,,,,0,,,,,L,landes,,,185,2.981697,43.565991
2021-577146,2021-02-25,000001,Vente,46000,,,LE REDONDEL,B061,34390,34273,Saint-Martin-de-l'Arçon,34,,,342730000A0266,,,,,,,,,,,,,0,,,,,BT,taillis simples,CHENE,Chênes,120,2.979937,43.571686
2021-577146,2021-02-25,000001,Vente,46000,,,LE REDONDEL,B061,34390,34273,Saint-Martin-de-l'Arçon,34,,,342730000A0279,,,,,,,,,,,,,0,,,,,VE,vergers,CHAT,Châtaigneraie,930,2.981475,43.572642
2021-577146,2021-02-25,000001,Vente,46000,,,LE REDONDEL,B061,34390,34273,Saint-Martin-de-l'Arçon,34,,,342730000A0293,,,,,,,,,,,,,0,,,,,VE,vergers,CHAT,Châtaigneraie,3910,2.982721,43.572599
2021-577146,2021-02-25,000001,Vente,46000,,,LA PLANTADE,B054,34390,34273,Saint-Martin-de-l'Arçon,34,,,342730000A0562,,,,,,,,,,,,,0,,,,,VE,vergers,CHAT,Châtaigneraie,1660,2.979911,43.575034
2021-577146,2021-02-25,000001,Vente,46000,,,LA COMBE,B024,34390,34273,Saint-Martin-de-l'Arçon,34,,,342730000A0618,,,,,,,,,,,,,0,,,,,BT,taillis simples,CHENE,Chênes,2490,2.982614,43.578083
2021-577146,2021-02-25,000001,Vente,46000,,,LE COUSTAS,B031,34390,34273,Saint-Martin-de-l'Arçon,34,,,342730000A0749,,,,,,,,,,,,,0,,,,,T,terres,,,390,2.986341,43.573255
2021-577146,2021-02-25,000001,Vente,46000,,,LE COUSTAS,B031,34390,34273,Saint-Martin-de-l'Arçon,34,,,342730000A0750,,,,,,,,,,,,,0,,,,,VI,vignes,,,550,2.986461,43.57325
2021-577146,2021-02-25,000001,Vente,46000,,,L USCLADE,B086,34390,34273,Saint-Martin-de-l'Arçon,34,,,342730000A0784,,,,,,,,,,,,,0,,,,,VI,vignes,,,3120,2.984622,43.572513
2021-577146,2021-02-25,000001,Vente,46000,,,L USCLADE,B086,34390,34273,Saint-Martin-de-l'Arçon,34,,,342730000A0785,,,,,,,,,,,,,0,,,,,VI,vignes,,,1750,2.9848,43.572251
2021-577146,2021-02-25,000001,Vente,46000,,,LE COMBAL,B023,34390,34273,Saint-Martin-de-l'Arçon,34,,,342730000A0917,,,,,,,,,,,,,0,,,,,T,terres,,,1020,2.988949,43.574904
2021-577146,2021-02-25,000001,Vente,46000,,,LE COMBAL,B023,34390,34273,Saint-Martin-de-l'Arçon,34,,,342730000A0918,,,,,,,,,,,,,0,,,,,T,terres,,,3740,2.988915,43.574399
2021-577146,2021-02-25,000001,Vente,46000,,,LE COMBAL,B023,34390,34273,Saint-Martin-de-l'Arçon,34,,,342730000A0919,,,,,,,,,,,,,0,,,,,VI,vignes,,,3220,2.989183,43.574126
2021-577146,2021-02-25,000001,Vente,46000,,,LE COMBAL,B023,34390,34273,Saint-Martin-de-l'Arçon,34,,,342730000A0926,,,,,,,,,,,,,0,,,,,VE,vergers,CHAT,Châtaigneraie,2070,2.988196,43.574825
2021-577146,2021-02-25,000001,Vente,46000,,,ROBEYRAS,B066,34390,34273,Saint-Martin-de-l'Arçon,34,,,342730000A0951,,,,,,,,,,,,,0,,,,,VI,vignes,,,1025,2.990068,43.573101
2021-577146,2021-02-25,000001,Vente,46000,,,ROBEYRAS,B066,34390,34273,Saint-Martin-de-l'Arçon,34,,,342730000A0956,,,,,,,,,,,,,0,,,,,T,terres,,,370,2.98917,43.572586
2021-577146,2021-02-25,000001,Vente,46000,,,BRETAGNES,B014,34390,34273,Saint-Martin-de-l'Arçon,34,,,342730000A1001,,,,,,,,,,,,,0,,,,,VE,vergers,CERIS,Cerisaie ou cerisiers,920,2.990075,43.57086
2021-577146,2021-02-25,000001,Vente,46000,,,BRETAGNES,B014,34390,34273,Saint-Martin-de-l'Arçon,34,,,342730000A1024,,,,,,,,,,,,,0,,,,,S,sols,,,15,2.991508,43.570442
2021-577146,2021-02-25,000001,Vente,46000,,,BRETAGNES,B014,34390,34273,Saint-Martin-de-l'Arçon,34,,,342730000A1025,,,,,,,,,,,,,0,,,,,VI,vignes,,,2490,2.991902,43.570193
2021-577146,2021-02-25,000001,Vente,46000,,,BRETAGNES,B014,34390,34273,Saint-Martin-de-l'Arçon,34,,,342730000A1026,,,,,,,,,,,,,0,,,,,VI,vignes,,,1630,2.991453,43.570197
2021-577146,2021-02-25,000001,Vente,46000,,,BRETAGNES,B014,34390,34273,Saint-Martin-de-l'Arçon,34,,,342730000A1031,,,,,,,,,,,,,0,,,,,T,terres,,,225,2.991623,43.569359
2021-577146,2021-02-25,000001,Vente,46000,,,BRETAGNES,B014,34390,34273,Saint-Martin-de-l'Arçon,34,,,342730000A1032,,,,,,,,,,,,,0,,,,,L,landes,,,660,2.991486,43.569149
2021-577146,2021-02-25,000001,Vente,46000,,,BRETAGNES,B014,34390,34273,Saint-Martin-de-l'Arçon,34,,,342730000A1032,,,,,,,,,,,,,0,,,,,VI,vignes,,,1150,2.991486,43.569149
2021-577146,2021-02-25,000001,Vente,46000,,,BRETAGNES,B014,34390,34273,Saint-Martin-de-l'Arçon,34,,,342730000A1033,,,,,,,,,,,,,0,,,,,VI,vignes,,,757,2.991172,43.569997
2021-577146,2021-02-25,000001,Vente,46000,,,BRETAGNES,B014,34390,34273,Saint-Martin-de-l'Arçon,34,,,342730000A1033,,,,,,,,,,,,,0,,,,,VI,vignes,,,757,2.991172,43.569997
2021-577146,2021-02-25,000001,Vente,46000,,,BRETAGNES,B014,34390,34273,Saint-Martin-de-l'Arçon,34,,,342730000A1033,,,,,,,,,,,,,0,,,,,VI,vignes,,,584,2.991172,43.569997
2021-577146,2021-02-25,000001,Vente,46000,,,BRETAGNES,B014,34390,34273,Saint-Martin-de-l'Arçon,34,,,342730000A1033,,,,,,,,,,,,,0,,,,,VI,vignes,,,583,2.991172,43.569997
2021-577146,2021-02-25,000001,Vente,46000,,,BRETAGNES,B014,34390,34273,Saint-Martin-de-l'Arçon,34,,,342730000A1033,,,,,,,,,,,,,0,,,,,T,terres,,,653,2.991172,43.569997
2021-577146,2021-02-25,000001,Vente,46000,,,BRETAGNES,B014,34390,34273,Saint-Martin-de-l'Arçon,34,,,342730000A1034,,,,,,,,,,,,,0,,,,,S,sols,,,16,2.991391,43.57045
2021-577146,2021-02-25,000001,Vente,46000,,,BRETAGNES,B014,34390,34273,Saint-Martin-de-l'Arçon,34,,,342730000A1035,,,,,,,,,,,,,0,,,,,T,terres,,,220,2.990949,43.570259
2021-577146,2021-02-25,000001,Vente,46000,,,BRETAGNES,B014,34390,34273,Saint-Martin-de-l'Arçon,34,,,342730000A1043,,,,,,,,,,,,,0,,,,,VI,vignes,,,410,2.990535,43.569588
2021-577146,2021-02-25,000001,Vente,46000,,,BRETAGNES,B014,34390,34273,Saint-Martin-de-l'Arçon,34,,,342730000A1044,,,,,,,,,,,,,0,,,,,VI,vignes,,,470,2.990891,43.569634
2021-577146,2021-02-25,000001,Vente,46000,,,LA RIVIERE,B065,34390,34273,Saint-Martin-de-l'Arçon,34,,,342730000A1085,,,,,,,,,,,,,0,,,,,VI,vignes,,,650,2.981901,43.566531
2021-577146,2021-02-25,000001,Vente,46000,,,BRETAGNES,B014,34390,34273,Saint-Martin-de-l'Arçon,34,,,342730000A1088,,,,,,,,,,,,,0,,,,,VI,vignes,,,220,2.990941,43.57042
2021-577146,2021-02-25,000001,Vente,46000,,,ROBEYRAS,B066,34390,34273,Saint-Martin-de-l'Arçon,34,,,342730000A1102,,,,,,,,,,,,,0,,,,,J,jardins,POTAG,Jardin potager,230,2.98994,43.572959
2021-577146,2021-02-25,000001,Vente,46000,,,ROBEYRAS,B066,34390,34273,Saint-Martin-de-l'Arçon,34,,,342730000A1104,,,,,,,,,,,,,0,,,,,VI,vignes,,,315,2.989737,43.572802
2021-579061,2021-04-06,000001,Vente,248000,5036,,VILLAGE,B088,34390,34273,Saint-Martin-de-l'Arçon,34,,,342730000A0525,,,,,,,,,,,,,0,1,Maison,125,4,S,sols,,,255,2.983018,43.575125
2021-579068,2021-04-14,000001,Vente,1000,,,VILLAGE,B088,34390,34273,Saint-Martin-de-l'Arçon,34,,,342730000A0512,,,,,,,,,,,,,0,,,,,T,terres,,,132,2.982834,43.575366
2021-582678,2021-06-28,000001,Vente,157500,,,LES COUSTILLES,B033,34390,34273,Saint-Martin-de-l'Arçon,34,,,342730000A1136,,,,,,,,,,,,,0,,,,,S,sols,,,348,2.986145,43.571036
2021-582678,2021-06-28,000001,Vente,157500,,,LES COUSTILLES,B033,34390,34273,Saint-Martin-de-l'Arçon,34,,,342730000A1137,,,,,,,,,,,,,0,,,,,S,sols,,,195,2.986419,43.571157
2021-582678,2021-06-28,000001,Vente,157500,5092,,LES COUSTILLES,B033,34390,34273,Saint-Martin-de-l'Arçon,34,,,342730000A1154,,,,,,,,,,,,,0,1,Maison,146,5,S,sols,,,265,2.986275,43.571232
2021-582678,2021-06-28,000001,Vente,157500,5092,,LES COUSTILLES,B033,34390,34273,Saint-Martin-de-l'Arçon,34,,,342730000A1154,,,,,,,,,,,,,0,3,Dépendance,,0,S,sols,,,265,2.986275,43.571232
2021-582678,2021-06-28,000001,Vente,157500,,,LES COUSTILLES,B033,34390,34273,Saint-Martin-de-l'Arçon,34,,,342730000A1156,,,,,,,,,,,,,0,,,,,S,sols,,,4,2.986246,43.571232
2021-582678,2021-06-28,000001,Vente,157500,,,LES COUSTILLES,B033,34390,34273,Saint-Martin-de-l'Arçon,34,,,342730000A1158,,,,,,,,,,,,,0,,,,,S,sols,,,45,2.986018,43.57105
2021-582678,2021-06-28,000001,Vente,157500,,,LES COUSTILLES,B033,34390,34273,Saint-Martin-de-l'Arçon,34,,,342730000A1159,,,,,,,,,,,,,0,,,,,S,sols,,,5,2.986001,43.571056
2021-582678,2021-06-28,000001,Vente,157500,,,LES COUSTILLES,B033,34390,34273,Saint-Martin-de-l'Arçon,34,,,342730000A1217,,,,,,,,,,,,,0,,,,,T,terres,,,96,2.986469,43.571244
2021-582678,2021-06-28,000001,Vente,157500,,,LES COUSTILLES,B033,34390,34273,Saint-Martin-de-l'Arçon,34,,,342730000A1219,,,,,,,,,,,,,0,,,,,T,terres,,,384,2.986482,43.571362
2021-584828,2021-08-31,000001,Vente,500000,,,VILLAGE,B088,34390,34273,Saint-Martin-de-l'Arçon,34,,,342730000A0473,,,,,,,,,,,,,0,,,,,S,sols,,,15,2.982989,43.57606
2021-584828,2021-08-31,000001,Vente,500000,5163,,VILLAGE,B088,34390,34273,Saint-Martin-de-l'Arçon,34,,,342730000A0474,,,,,,,,,,,,,0,3,Dépendance,,0,S,sols,,,138,2.982971,43.576165
2021-584828,2021-08-31,000001,Vente,500000,,,VILLAGE,B088,34390,34273,Saint-Martin-de-l'Arçon,34,,,342730000A0475,,,,,,,,,,,,,0,,,,,S,sols,,,50,2.982856,43.576185
2021-584828,2021-08-31,000001,Vente,500000,,,VILLAGE,B088,34390,34273,Saint-Martin-de-l'Arçon,34,,,342730000A0477,,,,,,,,,,,,,0,,,,,S,sols,,,41,2.983042,43.576251
2021-584828,2021-08-31,000001,Vente,500000,,,VILLAGE,B088,34390,34273,Saint-Martin-de-l'Arçon,34,,,342730000A0478,,,,,,,,,,,,,0,,,,,S,sols,,,19,2.983105,43.576191
2021-584828,2021-08-31,000001,Vente,500000,5030,,VILLAGE,B088,34390,34273,Saint-Martin-de-l'Arçon,34,,,342730000A0479,,,,,,,,,,,,,0,1,Maison,100,3,S,sols,,,95,2.983016,43.5763
2021-584828,2021-08-31,000001,Vente,500000,5109,,VILLAGE,B088,34390,34273,Saint-Martin-de-l'Arçon,34,,,342730000A0486,,,,,,,,,,,,,0,1,Maison,42,1,S,sols,,,53,2.983052,43.576448
2021-584828,2021-08-31,000001,Vente,500000,,,VILLAGE,B088,34390,34273,Saint-Martin-de-l'Arçon,34,,,342730000A0496,,,,,,,,,,,,,0,,,,,BT,taillis simples,CHENE,Chênes,240,2.982617,43.576607
2021-584828,2021-08-31,000001,Vente,500000,,,VILLAGE,B088,34390,34273,Saint-Martin-de-l'Arçon,34,,,342730000A0497,,,,,,,,,,,,,0,,,,,T,terres,,,735,2.982688,43.576499
2021-584828,2021-08-31,000001,Vente,500000,,,VILLAGE,B088,34390,34273,Saint-Martin-de-l'Arçon,34,,,342730000A0498,,,,,,,,,,,,,0,,,,,S,sols,,,45,2.982899,43.576529
2021-584828,2021-08-31,000001,Vente,500000,,,VILLAGE,B088,34390,34273,Saint-Martin-de-l'Arçon,34,,,342730000A0499,,,,,,,,,,,,,0,,,,,S,sols,,,210,2.982949,43.576408
2021-584828,2021-08-31,000001,Vente,500000,,,VILLAGE,B088,34390,34273,Saint-Martin-de-l'Arçon,34,,,342730000A0500,,,,,,,,,,,,,0,,,,,T,terres,,,300,2.982616,43.576272
2021-584828,2021-08-31,000001,Vente,500000,,,VILLAGE,B088,34390,34273,Saint-Martin-de-l'Arçon,34,,,342730000A0501,,,,,,,,,,,,,0,,,,,S,sols,,,107,2.98279,43.576209
2021-584828,2021-08-31,000001,Vente,500000,,,VILLAGE,B088,34390,34273,Saint-Martin-de-l'Arçon,34,,,342730000A1133,,,,,,,,,,,,,0,,,,,S,sols,,,104,2.982918,43.576094
2021-584828,2021-08-31,000001,Vente,500000,,,VILLAGE,B088,34390,34273,Saint-Martin-de-l'Arçon,34,,,342730000A1297,,,,,,,,,,,,,0,,,,,S,sols,,,28,2.983113,43.576328
2021-584828,2021-08-31,000001,Vente,500000,,,VILLAGE,B088,34390,34273,Saint-Martin-de-l'Arçon,34,,,342730000A1299,,,,,,,,,,,,,0,,,,,S,sols,,,25,2.983091,43.576408
2021-584828,2021-08-31,000001,Vente,500000,,,VILLAGE,B088,34390,34273,Saint-Martin-de-l'Arçon,34,,,342730000A1316,,,,,,,,,,,,,0,,,,,T,terres,,,96,2.983069,43.576494
2021-584828,2021-08-31,000001,Vente,500000,,,VILLAGE,B088,34390,34273,Saint-Martin-de-l'Arçon,34,,,342730000A1368,,,,,,,,,,,,,0,,,,,S,sols,,,100,2.983129,43.57625
2021-584998,2021-08-31,000001,Vente,1,,,VILLAGE,B088,34390,34273,Saint-Martin-de-l'Arçon,34,,,342730000A0476,,,,,,,,,,,,,0,,,,,S,sols,,,25,2.982975,43.576239
2021-586061,2021-09-29,000001,Vente,10000,,,LE COUSTAS,B031,34390,34273,Saint-Martin-de-l'Arçon,34,,,342730000A0733,,,,,,,,,,,,,0,,,,,T,terres,,,525,2.984675,43.574094
2021-587652,2021-11-05,000001,Vente,190000,5057,,LE COUSTAS,B031,34390,34273,Saint-Martin-de-l'Arçon,34,,,342730000A0766,,,,,,,,,,,,,0,1,Maison,110,4,S,sols,,,410,2.986084,43.572269
2021-587652,2021-11-05,000001,Vente,190000,5057,,LE COUSTAS,B031,34390,34273,Saint-Martin-de-l'Arçon,34,,,342730000A0766,,,,,,,,,,,,,0,3,Dépendance,,0,S,sols,,,410,2.986084,43.572269
2021-587652,2021-11-05,000001,Vente,190000,5057,,LE COUSTAS,B031,34390,34273,Saint-Martin-de-l'Arçon,34,,,342730000A0766,,,,,,,,,,,,,0,3,Dépendance,,0,S,sols,,,410,2.986084,43.572269
2021-587652,2021-11-05,000001,Vente,190000,,,LE COUSTAS,B031,34390,34273,Saint-Martin-de-l'Arçon,34,,,342730000A1170,,,,,,,,,,,,,0,,,,,L,landes,,,403,2.98603,43.5724
2021-588358,2021-11-10,000001,Vente,1500,,,BRETAGNES,B014,34390,34273,Saint-Martin-de-l'Arçon,34,,,342730000A1069,,,,,,,,,,,,,0,,,,,S,sols,,,528,2.987786,43.569465
2021-588358,2021-11-10,000001,Vente,1500,,,BRETAGNES,B014,34390,34273,Saint-Martin-de-l'Arçon,34,,,342730000A1070,,,,,,,,,,,,,0,,,,,VI,vignes,,,650,2.987912,43.56929
2021-588358,2021-11-10,000001,Vente,1500,,,BRETAGNES,B014,34390,34273,Saint-Martin-de-l'Arçon,34,,,342730000A1071,,,,,,,,,,,,,0,,,,,BT,taillis simples,CHENE,Chênes,560,2.98799,43.569033
2021-588358,2021-11-10,000001,Vente,1500,,,BRETAGNES,B014,34390,34273,Saint-Martin-de-l'Arçon,34,,,342730000A1090,,,,,,,,,,,,,0,,,,,BT,taillis simples,CHENE,Chênes,205,2.988208,43.569027
2021-588699,2021-11-10,000001,Vente,1000,,,BRETAGNES,B014,34390,34273,Saint-Martin-de-l'Arçon,34,,,342730000A1066,,,,,,,,,,,,,0,,,,,BT,taillis simples,CHENE,Chênes,450,2.988629,43.569064
2021-588699,2021-11-10,000001,Vente,1000,,,BRETAGNES,B014,34390,34273,Saint-Martin-de-l'Arçon,34,,,342730000A1067,,,,,,,,,,,,,0,,,,,T,terres,,,775,2.988292,43.569265
2021-588699,2021-11-10,000001,Vente,1000,,,BRETAGNES,B014,34390,34273,Saint-Martin-de-l'Arçon,34,,,342730000A1068,,,,,,,,,,,,,0,,,,,T,terres,,,2326,2.988369,43.569402
2021-588699,2021-11-10,000001,Vente,1000,,,BRETAGNES,B014,34390,34273,Saint-Martin-de-l'Arçon,34,,,342730000A1089,,,,,,,,,,,,,0,,,,,BT,taillis simples,CHENE,Chênes,215,2.988202,43.569113
2021-588699,2021-11-10,000001,Vente,1000,,,BRETAGNES,B014,34390,34273,Saint-Martin-de-l'Arçon,34,,,342730000A1188,,,,,,,,,,,,,0,,,,,T,terres,,,3255,2.988122,43.570351
2021-589895,2021-12-20,000001,Vente,55000,,,VILLAGE,B088,34390,34273,Saint-Martin-de-l'Arçon,34,,,342730000A1214,,,,,,,,,,,,,0,,,,,S,sols,,,18,2.983224,43.575155
2021-589895,2021-12-20,000001,Vente,55000,5008,,VILLAGE,B088,34390,34273,Saint-Martin-de-l'Arçon,34,,,342730000A1215,,,,,,,,,,,,,0,1,Maison,52,2,S,sols,,,47,2.983181,43.575139
