id_mutation,date_mutation,numero_disposition,nature_mutation,valeur_fonciere,adresse_numero,adresse_suffixe,adresse_nom_voie,adresse_code_voie,code_postal,code_commune,nom_commune,code_departement,ancien_code_commune,ancien_nom_commune,id_parcelle,ancien_id_parcelle,numero_volume,lot1_numero,lot1_surface_carrez,lot2_numero,lot2_surface_carrez,lot3_numero,lot3_surface_carrez,lot4_numero,lot4_surface_carrez,lot5_numero,lot5_surface_carrez,nombre_lots,code_type_local,type_local,surface_reelle_bati,nombre_pieces_principales,code_nature_culture,nature_culture,code_nature_culture_speciale,nature_culture_speciale,surface_terrain,longitude,latitude
2021-621686,2021-04-30,000001,Vente,6500,,,LA TONNERAIE,B784,35130,35102,Drouges,35,,,35102000ZH0093,,,,,,,,,,,,,0,,,,,T,terres,,,4725,-1.25516,47.900164
2021-621686,2021-04-30,000001,Vente,6500,,,LA TONNERAIE,B784,35130,35102,Drouges,35,,,35102000ZH0093,,,,,,,,,,,,,0,,,,,T,terres,,,4725,-1.25516,47.900164
2021-621904,2021-06-15,000001,Vente,100000,4,,LA TOUCHE,B785,35130,35102,Drouges,35,,,35102000ZK0086,,,,,,,,,,,,,0,1,Maison,81,5,S,sols,,,788,-1.263515,47.896237
2021-622068,2021-06-30,000001,Vente,12420,,,LES CHAMPS HUBERTS,B075,35130,35102,Drouges,35,,,35102000ZM0018,,,,,,,,,,,,,0,,,,,T,terres,,,13541,-1.285053,47.900357
2021-622068,2021-06-30,000001,Vente,12420,,,LES CHAMPS HUBERTS,B075,35130,35102,Drouges,35,,,35102000ZM0018,,,,,,,,,,,,,0,,,,,T,terres,,,7218,-1.285053,47.900357
2021-622071,2021-06-30,000001,Vente,19146.6,,,LA BASSE PINSONNIERE,B011,35130,35102,Drouges,35,,,35102000ZL0044,,,,,,,,,,,,,0,,,,,T,terres,,,35546,-1.280135,47.89363
2021-622071,2021-06-30,000001,Vente,19146.6,,,LA BASSE PINSONNIERE,B011,35130,35102,Drouges,35,,,35102000ZL0044,,,,,,,,,,,,,0,,,,,T,terres,,,1547,-1.280135,47.89363
2021-622071,2021-06-30,000001,Vente,19146.6,,,LA BASSE PINSONNIERE,B011,35130,35102,Drouges,35,,,35102000ZL0044,,,,,,,,,,,,,0,,,,,P,prés,,,5455,-1.280135,47.89363
2021-622073,2021-06-22,000001,Vente,14000,,,LE CHESNAY,B123,35130,35102,Drouges,35,,,35102000ZH0041,,,,,,,,,,,,,0,,,,,BT,taillis simples,,,1706,-1.25356,47.89964
2021-622073,2021-06-22,000001,Vente,14000,,,LE CHESNAY,B123,35130,35102,Drouges,35,,,35102000ZH0041,,,,,,,,,,,,,0,,,,,E,eaux,ETANG,Etangs,830,-1.25356,47.89964
2021-622073,2021-06-22,000001,Vente,14000,,,LE CHESNAY,B123,35130,35102,Drouges,35,,,35102000ZH0041,,,,,,,,,,,,,0,,,,,P,prés,,,1455,-1.25356,47.89964
2021-622073,2021-06-22,000001,Vente,14000,,,LA ROUAUDERIE,B769,35130,35102,Drouges,35,,,35102000ZH0086,,,,,,,,,,,,,0,,,,,E,eaux,ETANG,Etangs,1831,-1.254242,47.899012
2021-622073,2021-06-22,000001,Vente,14000,,,LA ROUAUDERIE,B769,35130,35102,Drouges,35,,,35102000ZH0086,,,,,,,,,,,,,0,,,,,P,prés,,,908,-1.254242,47.899012
2021-622106,2021-07-09,000001,Vente,167490,5016,,LA ROUSSELIERE,B772,35130,35102,Drouges,35,,,35102000ZE0032,,,,,,,,,,,,,0,3,Dépendance,,0,E,eaux,ETANG,Etangs,427,-1.23403,47.896602
2021-622106,2021-07-09,000001,Vente,167490,5016,,LA ROUSSELIERE,B772,35130,35102,Drouges,35,,,35102000ZE0032,,,,,,,,,,,,,0,1,Maison,104,3,P,prés,,,2874,-1.23403,47.896602
2021-622106,2021-07-09,000001,Vente,167490,5016,,LA ROUSSELIERE,B772,35130,35102,Drouges,35,,,35102000ZE0032,,,,,,,,,,,,,0,3,Dépendance,,0,P,prés,,,2874,-1.23403,47.896602
2021-622106,2021-07-09,000001,Vente,167490,5016,,LA ROUSSELIERE,B772,35130,35102,Drouges,35,,,35102000ZE0032,,,,,,,,,,,,,0,3,Dépendance,,0,P,prés,,,2874,-1.23403,47.896602
2021-622106,2021-07-09,000001,Vente,167490,5016,,LA ROUSSELIERE,B772,35130,35102,Drouges,35,,,35102000ZE0032,,,,,,,,,,,,,0,3,Dépendance,,0,P,prés,,,2874,-1.23403,47.896602
2021-622106,2021-07-09,000001,Vente,167490,5016,,LA ROUSSELIERE,B772,35130,35102,Drouges,35,,,35102000ZE0032,,,,,,,,,,,,,0,1,Maison,104,3,E,eaux,ETANG,Etangs,427,-1.23403,47.896602
2021-622106,2021-07-09,000001,Vente,167490,5016,,LA ROUSSELIERE,B772,35130,35102,Drouges,35,,,35102000ZE0032,,,,,,,,,,,,,0,3,Dépendance,,0,E,eaux,ETANG,Etangs,427,-1.23403,47.896602
2021-622106,2021-07-09,000001,Vente,167490,5016,,LA ROUSSELIERE,B772,35130,35102,Drouges,35,,,35102000ZE0032,,,,,,,,,,,,,0,3,Dépendance,,0,E,eaux,ETANG,Etangs,427,-1.23403,47.896602
2021-622106,2021-07-09,000001,Vente,167490,5016,,LA ROUSSELIERE,B772,35130,35102,Drouges,35,,,35102000ZE0032,,,,,,,,,,,,,0,1,Maison,104,3,S,sols,,,595,-1.23403,47.896602
2021-622106,2021-07-09,000001,Vente,167490,5016,,LA ROUSSELIERE,B772,35130,35102,Drouges,35,,,35102000ZE0032,,,,,,,,,,,,,0,3,Dépendance,,0,S,sols,,,595,-1.23403,47.896602
2021-622106,2021-07-09,000001,Vente,167490,5016,,LA ROUSSELIERE,B772,35130,35102,Drouges,35,,,35102000ZE0032,,,,,,,,,,,,,0,3,Dépendance,,0,S,sols,,,595,-1.23403,47.896602
2021-622106,2021-07-09,000001,Vente,167490,5016,,LA ROUSSELIERE,B772,35130,35102,Drouges,35,,,35102000ZE0032,,,,,,,,,,,,,0,3,Dépendance,,0,S,sols,,,595,-1.23403,47.896602
2021-622165,2021-07-21,000001,Vente,12500,5053,,LA FEUILLEE,B209,35130,35102,Drouges,35,,,35102000ZE0057,,,,,,,,,,,,,0,1,Maison,48,2,S,sols,,,146,-1.250759,47.89364
2021-622165,2021-07-21,000001,Vente,12500,,,LA FEUILLEE,B209,35130,35102,Drouges,35,,,35102000ZE0058,,,,,,,,,,,,,0,,,,,S,sols,,,50,-1.250973,47.893727
2021-622406,2021-08-18,000001,Vente,85500,,,LA COLINIERE,B158,35130,35102,Drouges,35,,,35102000ZB0024,,,,,,,,,,,,,0,,,,,T,terres,,,1706,-1.244594,47.909143
2021-622497,2021-08-13,000001,Vente,27692,5,,ALLEE DES VEYETTES,0090,35130,35102,Drouges,35,,,35102000ZO0051,,,,,,,,,,,,,0,,,,,AB,terrains a bâtir,,,644,-1.261688,47.902748
2021-622522,2021-08-13,000001,Vente,55000,1,,RUE DE L'ETANG,0018,35130,35102,Drouges,35,,,35102000AB0109,,,,,,,,,,,,,0,4,Local industriel. commercial ou assimilé,217,0,S,sols,,,1206,-1.263587,47.900682
2021-622522,2021-08-13,000001,Vente,55000,,,LOT RESIDENCE DE L'ETANG,A001,35130,35102,Drouges,35,,,35102000AB0113,,,,,,,,,,,,,0,,,,,AG,terrains d'agrément,,,121,-1.263742,47.900765
2021-623157,2021-12-03,000001,Vente,230000,,,LA TONNERAIE,B784,35130,35102,Drouges,35,,,35102000ZH0027,,,,,,,,,,,,,0,,,,,T,terres,,,700,-1.257164,47.898001
2021-623157,2021-12-03,000001,Vente,230000,,,LA TONNERAIE,B784,35130,35102,Drouges,35,,,35102000ZH0028,,,,,,,,,,,,,0,,,,,T,terres,,,192,-1.257041,47.898265
2021-623157,2021-12-03,000001,Vente,230000,,,LA TONNERAIE,B784,35130,35102,Drouges,35,,,35102000ZH0028,,,,,,,,,,,,,0,,,,,T,terres,,,779,-1.257041,47.898265
2021-623157,2021-12-03,000001,Vente,230000,5072,,LA TONNERAIE,B784,35130,35102,Drouges,35,,,35102000ZH0029,,,,,,,,,,,,,0,4,Local industriel. commercial ou assimilé,1239,0,S,sols,,,4219,-1.257238,47.898589
2021-623240,2021-12-14,000001,Vente,212500,,,FERME DE LA PINSONNIERE,B206,35130,35102,Drouges,35,,,35102000ZL0048,,,,,,,,,,,,,0,,,,,S,sols,,,4924,-1.284695,47.89503
2021-623240,2021-12-14,000001,Vente,212500,,,FERME DE LA PINSONNIERE,B206,35130,35102,Drouges,35,,,35102000ZL0048,,,,,,,,,,,,,0,,,,,T,terres,,,9199,-1.284695,47.89503
2021-623240,2021-12-14,000001,Vente,212500,,,LA PINSONNIERE,B617,35130,35102,Drouges,35,,,35102000ZL0072,,,,,,,,,,,,,0,,,,,S,sols,,,2450,-1.283594,47.895512
2021-623240,2021-12-14,000001,Vente,212500,,,LA PINSONNIERE,B617,35130,35102,Drouges,35,,,35102000ZL0072,,,,,,,,,,,,,0,,,,,T,terres,,,7440,-1.283594,47.895512
2021-623271,2021-12-14,000001,Vente,140000,5175,,LA PINSONNIERE,B617,35130,35102,Drouges,35,,,35102000ZL0082,,,,,,,,,,,,,0,1,Maison,93,5,,,,,,-1.284505,47.895437
2021-623284,2021-12-17,000001,Vente,155000,4,,PLACE ARMAND PIPARD,0007,35130,35102,Drouges,35,,,35102000AB0071,,,,,,,,,,,,,0,1,Maison,95,4,S,sols,,,266,-1.266674,47.900555
2021-623284,2021-12-17,000001,Vente,155000,4,,PLACE ARMAND PIPARD,0007,35130,35102,Drouges,35,,,35102000AB0071,,,,,,,,,,,,,0,3,Dépendance,,0,S,sols,,,266,-1.266674,47.900555
2021-623284,2021-12-17,000001,Vente,155000,4,,PLACE ARMAND PIPARD,0007,35130,35102,Drouges,35,,,35102000AB0071,,,,,,,,,,,,,0,3,Dépendance,,0,AG,terrains d'agrément,,,1026,-1.266674,47.900555
2021-623284,2021-12-17,000001,Vente,155000,4,,PLACE ARMAND PIPARD,0007,35130,35102,Drouges,35,,,35102000AB0071,,,,,,,,,,,,,0,1,Maison,95,4,AG,terrains d'agrément,,,1026,-1.266674,47.900555
