id_mutation,date_mutation,numero_disposition,nature_mutation,valeur_fonciere,adresse_numero,adresse_suffixe,adresse_nom_voie,adresse_code_voie,code_postal,code_commune,nom_commune,code_departement,ancien_code_commune,ancien_nom_commune,id_parcelle,ancien_id_parcelle,numero_volume,lot1_numero,lot1_surface_carrez,lot2_numero,lot2_surface_carrez,lot3_numero,lot3_surface_carrez,lot4_numero,lot4_surface_carrez,lot5_numero,lot5_surface_carrez,nombre_lots,code_type_local,type_local,surface_reelle_bati,nombre_pieces_principales,code_nature_culture,nature_culture,code_nature_culture_speciale,nature_culture_speciale,surface_terrain,longitude,latitude
2021-615092,2021-01-26,000001,Vente,21000,,,LE COURTIL DE LA FONTAINE,B517,35120,35104,Epiniac,35,,,351040000A1190,,,,,,,,,,,,,0,,,,,AB,terrains a bâtir,,,447,-1.698256,48.51225
2021-615092,2021-01-26,000001,Vente,21000,,,LE COURTIL DE LA FONTAINE,B517,35120,35104,Epiniac,35,,,351040000A1191,,,,,,,,,,,,,0,,,,,AB,terrains a bâtir,,,828,-1.698474,48.511896
2021-615378,2021-02-10,000002,Vente,65,,,LE CLOS DES EAUX,B357,35120,35104,Epiniac,35,,,351040000E1003,,,,,,,,,,,,,0,,,,,T,terres,,,214,-1.72106,48.48758
2021-615380,2021-02-10,000001,Vente,31990,,,LE COURTIL DE LA FONTAINE,B517,35120,35104,Epiniac,35,,,351040000A1176,,,,,,,,,,,,,0,,,,,AB,terrains a bâtir,,,457,-1.697118,48.512606
2021-615547,2021-02-18,000001,Vente,3500,,,LES PERTUS,B988,35120,35104,Epiniac,35,,,351040000C0273,,,,,,,,,,,,,0,,,,,T,terres,,,8665,-1.696918,48.479476
2021-615547,2021-02-18,000001,Vente,3500,,,PATURE DU GAGE,B970,35120,35104,Epiniac,35,,,351040000C0286,,,,,,,,,,,,,0,,,,,P,prés,,,1440,-1.700585,48.479606
2021-615547,2021-02-18,000001,Vente,3500,,,PRE DERRIERE,C228,35120,35104,Epiniac,35,,,351040000C0296,,,,,,,,,,,,,0,,,,,T,terres,,,1360,-1.699327,48.481174
2021-615875,2021-03-23,000001,Vente,23364,,,LES PETITES ALLEES,C100,35120,35104,Epiniac,35,,,351040000B0179,,,,,,,,,,,,,0,,,,,P,prés,,,5490,-1.675804,48.518582
2021-615916,2021-02-23,000001,Vente,465000,,,CHEM DU BOIS FUTAIE DE VIG,B208,35120,35104,Epiniac,35,,,351040000E0248,,,,,,,,,,,,,0,,,,,T,terres,,,2465,-1.727448,48.509237
2021-615916,2021-02-23,000001,Vente,465000,5212,,LA PETITE CORBONNAIS,C071,35120,35104,Epiniac,35,,,351040000E0249,,,,,,,,,,,,,0,1,Maison,79,3,S,sols,,,90,-1.72592,48.509232
2021-615916,2021-02-23,000001,Vente,465000,,,ETANG DE LA PETITE CORBONN,B579,35120,35104,Epiniac,35,,,351040000E0250,,,,,,,,,,,,,0,,,,,P,prés,,,6520,-1.72638,48.509005
2021-615916,2021-02-23,000001,Vente,465000,,,ETANG DE LA PETITE CORBONN,B579,35120,35104,Epiniac,35,,,351040000E0250,,,,,,,,,,,,,0,,,,,E,eaux,ETANG,Etangs,1700,-1.72638,48.509005
2021-615916,2021-02-23,000001,Vente,465000,,,BOIS FUTAIE DE LA VIGNE,B059,35120,35104,Epiniac,35,,,351040000E0251,,,,,,,,,,,,,0,,,,,BR,futaies résineuses,,,1845,-1.727683,48.508818
2021-615916,2021-02-23,000001,Vente,465000,,,BOIS FUTAIE DE LA VIGNE,B059,35120,35104,Epiniac,35,,,351040000E0252,,,,,,,,,,,,,0,,,,,P,prés,,,10605,-1.728786,48.508599
2021-615916,2021-02-23,000001,Vente,465000,,,GRANDE PRAIRIE DE VILHOET,B738,35120,35104,Epiniac,35,,,351040000E0263,,,,,,,,,,,,,0,,,,,P,prés,,,12190,-1.728128,48.508135
2021-615916,2021-02-23,000001,Vente,465000,,,GRANDE PRAIRIE DE VILHOET,B738,35120,35104,Epiniac,35,,,351040000E0264,,,,,,,,,,,,,0,,,,,BT,taillis simples,,,5445,-1.727286,48.508187
2021-615916,2021-02-23,000001,Vente,465000,,,LA PETITE CORBONNAIS,C071,35120,35104,Epiniac,35,,,351040000E0265,,,,,,,,,,,,,0,,,,,L,landes,,,930,-1.726504,48.508344
2021-615916,2021-02-23,000001,Vente,465000,,,LA PETITE CORBONNAIS,C071,35120,35104,Epiniac,35,,,351040000E0266,,,,,,,,,,,,,0,,,,,T,terres,,,2270,-1.726547,48.508349
2021-615916,2021-02-23,000001,Vente,465000,,,LA PETITE CORBONNAIS,C071,35120,35104,Epiniac,35,,,351040000E0267,,,,,,,,,,,,,0,,,,,J,jardins,POTAG,Jardin potager,645,-1.726159,48.508532
2021-615916,2021-02-23,000001,Vente,465000,,,LA PETITE CORBONNAIS,C071,35120,35104,Epiniac,35,,,351040000E0268,,,,,,,,,,,,,0,,,,,L,landes,,,420,-1.725941,48.508674
2021-615916,2021-02-23,000001,Vente,465000,5211,,LA PETITE CORBONNAIS,C071,35120,35104,Epiniac,35,,,351040000E0269,,,,,,,,,,,,,0,1,Maison,250,6,S,sols,,,3115,-1.725649,48.508436
2021-615916,2021-02-23,000001,Vente,465000,,,LA PETITE CORBONNAIS,C071,35120,35104,Epiniac,35,,,351040000E0270,,,,,,,,,,,,,0,,,,,T,terres,,,1570,-1.724932,48.508443
2021-615916,2021-02-23,000001,Vente,465000,,,BOIS FUTAIE DE LA CHESNAIE,B058,35120,35104,Epiniac,35,,,351040000E0743,,,,,,,,,,,,,0,,,,,BF,futaies feuillues,,,920,-1.725584,48.5081
2021-615916,2021-02-23,000001,Vente,465000,,,LE BOIS DE LA CHESNAIE,B042,35120,35104,Epiniac,35,,,351040000E0744,,,,,,,,,,,,,0,,,,,BR,futaies résineuses,,,1091,-1.724931,48.508184
2021-616450,2021-04-23,000001,Vente,108000,,,LA FOLTIERE,B596,35120,35104,Epiniac,35,,,351040000B0957,,,,,,,,,,,,,0,,,,,J,jardins,POTAG,Jardin potager,440,-1.691778,48.494944
2021-616450,2021-04-23,000001,Vente,108000,5105,,LA FOLTIERE,B596,35120,35104,Epiniac,35,,,351040000B1230,,,,,,,,,,,,,0,1,Maison,110,5,S,sols,,,175,-1.691792,48.49478
2021-616450,2021-04-23,000001,Vente,108000,,,LA FOLTIERE,B596,35120,35104,Epiniac,35,,,351040000B1346,,,,,,,,,,,,,0,,,,,S,sols,,,50,-1.691725,48.494727
2021-616584,2021-04-19,000002,Vente,85000,,,LA CROIX DE PIERRE,B541,35120,35104,Epiniac,35,,,351040000D0874,,,,,,,,,,,,,0,,,,,J,jardins,POTAG,Jardin potager,310,-1.700518,48.46124
2021-616584,2021-04-19,000002,Vente,85000,,,LA CROIX DE PIERRE,B541,35120,35104,Epiniac,35,,,351040000D1206,,,,,,,,,,,,,0,,,,,S,sols,,,1384,-1.700709,48.461254
2021-616585,2021-04-19,000001,Vente,65000,,,LA PERRIERE,B986,35120,35104,Epiniac,35,,,351040000D0877,,,,,,,,,,,,,0,,,,,T,terres,,,5725,-1.702225,48.461237
2021-616585,2021-04-19,000001,Vente,65000,5175,,LA CROIX DE PIERRE,B541,35120,35104,Epiniac,35,,,351040000D1205,,,,,,,,,,,,,0,1,Maison,63,3,S,sols,,,1247,-1.701114,48.461163
2021-616778,2021-05-05,000001,Vente,35000,,,LA CHEVRAIS,B271,35120,35104,Epiniac,35,,,351040000D0460,,,,,,,,,,,,,0,,,,,J,jardins,POTAG,Jardin potager,410,-1.718571,48.475892
2021-616778,2021-05-05,000001,Vente,35000,,,LA CHEVRAIS,B271,35120,35104,Epiniac,35,,,351040000D0461,,,,,,,,,,,,,0,,,,,S,sols,,,120,-1.71843,48.4757
2021-616778,2021-05-05,000001,Vente,35000,,,LA CHEVRAIS,B271,35120,35104,Epiniac,35,,,351040000D0462,,,,,,,,,,,,,0,,,,,S,sols,,,85,-1.718347,48.475758
2021-616778,2021-05-05,000001,Vente,35000,,,LA CHEVRAIS,B271,35120,35104,Epiniac,35,,,351040000D0463,,,,,,,,,,,,,0,,,,,J,jardins,POTAG,Jardin potager,354,-1.718442,48.475907
2021-616934,2021-05-10,000001,Vente,36540,,,LE COURTIL DE LA FONTAINE,B517,35120,35104,Epiniac,35,,,351040000A1164,,,,,,,,,,,,,0,,,,,AB,terrains a bâtir,,,522,-1.69704,48.513
2021-617178,2021-05-28,000001,Vente,54000,5411,,RUE DE LA MAIRIE,0033,35120,35104,Epiniac,35,,,35104000AB0506,,,,,,,,,,,,,0,4,Local industriel. commercial ou assimilé,280,0,S,sols,,,614,-1.698301,48.510469
2021-617184,2021-05-31,000001,Vente,33810,,,LE COURTIL DE LA FONTAINE,B517,35120,35104,Epiniac,35,,,351040000A1165,,,,,,,,,,,,,0,,,,,AB,terrains a bâtir,,,483,-1.696899,48.513148
2021-617237,2021-05-26,000001,Vente,73685,5000,,LA VIEUX VILLE,C441,35120,35104,Epiniac,35,,,351040000B0125,,,,,,,,,,,,,0,1,Maison,50,1,S,sols,,,370,-1.689115,48.525639
2021-617237,2021-05-26,000001,Vente,73685,,,LE MOULIN DE LA VIEUX VILL,B932,35120,35104,Epiniac,35,,,351040000B0126,,,,,,,,,,,,,0,,,,,S,sols,,,490,-1.688969,48.525791
2021-617237,2021-05-26,000001,Vente,73685,,,LE MOULIN DE LA VIEUX VILL,B932,35120,35104,Epiniac,35,,,351040000B0127,,,,,,,,,,,,,0,,,,,S,sols,,,700,-1.689232,48.525992
2021-617237,2021-05-26,000001,Vente,73685,,,LE MOULIN DE LA VIEUX VILL,B932,35120,35104,Epiniac,35,,,351040000B0131,,,,,,,,,,,,,0,,,,,L,landes,,,190,-1.688814,48.525969
2021-617591,2021-06-23,000001,Vente,170000,3,,RUE DE LA FLEURIAIS,0026,35120,35104,Epiniac,35,,,35104000AB0075,,,,,,,,,,,,,0,1,Maison,89,5,S,sols,,,808,-1.696106,48.510956
2021-617591,2021-06-23,000001,Vente,170000,,,LE BOURG,B076,35120,35104,Epiniac,35,,,35104000AB0076,,,,,,,,,,,,,0,,,,,J,jardins,POTAG,Jardin potager,144,-1.695716,48.510917
2021-617599,2021-07-02,000001,Vente,36400,,,LE COURTIL DE LA FONTAINE,B517,35120,35104,Epiniac,35,,,351040000A1163,,,,,,,,,,,,,0,,,,,AB,terrains a bâtir,,,229,-1.6971,48.51284
2021-617599,2021-07-02,000001,Vente,36400,,,LE COURTIL DE LA FONTAINE,B517,35120,35104,Epiniac,35,,,351040000A1177,,,,,,,,,,,,,0,,,,,AB,terrains a bâtir,,,291,-1.697071,48.512771
2021-617806,2021-07-13,000001,Vente,50000,,,LA CHEVRAIS,B271,35120,35104,Epiniac,35,,,351040000D0452,,,,,,,,,,,,,0,,,,,T,terres,,,2210,-1.71895,48.475637
2021-617806,2021-07-13,000001,Vente,50000,,,LA CHEVRAIS,B271,35120,35104,Epiniac,35,,,351040000D0456,,,,,,,,,,,,,0,,,,,S,sols,,,53,-1.718712,48.475551
2021-617806,2021-07-13,000001,Vente,50000,5154,,LA CHEVRAIS,B271,35120,35104,Epiniac,35,,,351040000D0457,,,,,,,,,,,,,0,1,Maison,55,1,S,sols,,,96,-1.718637,48.475597
2021-617885,2021-07-15,000001,Vente,300000,9000,,LE CHAUSSIX VERT,C457,35120,35104,Epiniac,35,,,351040000A1036,,,,,,,,,,,,,0,3,Dépendance,,0,S,sols,,,500,-1.709617,48.510409
2021-617885,2021-07-15,000001,Vente,300000,9000,,LE CHAUSSIX VERT,C457,35120,35104,Epiniac,35,,,351040000A1036,,,,,,,,,,,,,0,3,Dépendance,,0,AG,terrains d'agrément,,,755,-1.709617,48.510409
2021-617885,2021-07-15,000001,Vente,300000,9000,,LE CHAUSSIX VERT,C457,35120,35104,Epiniac,35,,,351040000A1036,,,,,,,,,,,,,0,1,Maison,127,6,AG,terrains d'agrément,,,755,-1.709617,48.510409
2021-617885,2021-07-15,000001,Vente,300000,9000,,LE CHAUSSIX VERT,C457,35120,35104,Epiniac,35,,,351040000A1036,,,,,,,,,,,,,0,1,Maison,127,6,S,sols,,,500,-1.709617,48.510409
2021-617973,2021-07-17,000001,Vente,140000,,,CADRAN,B093,35120,35104,Epiniac,35,,,351040000B1544,,,,,,,,,,,,,0,,,,,J,jardins,POTAG,Jardin potager,362,-1.678603,48.50619
2021-617973,2021-07-17,000001,Vente,140000,2000,,CADRAN,B093,35120,35104,Epiniac,35,,,351040000B1545,,,,,,,,,,,,,0,1,Maison,199,8,S,sols,,,660,-1.678597,48.506354
2021-617973,2021-07-17,000001,Vente,140000,,,CADRAN,B093,35120,35104,Epiniac,35,,,351040000B1546,,,,,,,,,,,,,0,,,,,T,terres,,,1133,-1.678431,48.506675
2021-617976,2021-07-17,000001,Vente,140000,,,LA VILLE JEAN,C449,35120,35104,Epiniac,35,,,351040000B0584,,,,,,,,,,,,,0,,,,,J,jardins,POTAG,Jardin potager,200,-1.688819,48.501424
2021-617976,2021-07-17,000001,Vente,140000,5085,,LA VILLE JEAN,C449,35120,35104,Epiniac,35,,,351040000B1352,,,,,,,,,,,,,0,3,Dépendance,,0,S,sols,,,1201,-1.688502,48.501485
2021-617976,2021-07-17,000001,Vente,140000,5085,,LA VILLE JEAN,C449,35120,35104,Epiniac,35,,,351040000B1352,,,,,,,,,,,,,0,1,Maison,80,2,S,sols,,,1201,-1.688502,48.501485
2021-618205,2021-08-10,000001,Vente,131040,4,,RUE DU CALVAIRE,0008,35120,35104,Epiniac,35,,,35104000AB0046,,,,,,,,,,,,,0,1,Maison,96,5,S,sols,,,92,-1.6979,48.510008
2021-618702,2021-08-27,000001,Vente,38000,5151,,LA CHEVRAIS,B271,35120,35104,Epiniac,35,,,351040000D0441,,,,,,,,,,,,,0,1,Maison,32,1,S,sols,,,1530,-1.718346,48.475355
2021-618948,2021-09-15,000001,Vente,220000,,,LE BOURG,B076,35120,35104,Epiniac,35,,,35104000AB0274,,,,,,,,,,,,,0,,,,,J,jardins,POTAG,Jardin potager,576,-1.699477,48.509816
2021-618948,2021-09-15,000001,Vente,220000,5540,,LE BOURG,B076,35120,35104,Epiniac,35,,,35104000AB0278,,,,,,,,,,,,,0,1,Maison,120,4,S,sols,,,837,-1.699501,48.510074
2021-618948,2021-09-15,000001,Vente,220000,2,,RUE DE LA MARE PETEL,0035,35120,35104,Epiniac,35,,,35104000AB0628,,,,,,,,,,,,,0,2,Appartement,90,4,S,sols,,,81,-1.699482,48.510138
2021-618948,2021-09-15,000001,Vente,220000,2,,RUE DE LA MARE PETEL,0035,35120,35104,Epiniac,35,,,35104000AB0628,,,,,,,,,,,,,0,4,Local industriel. commercial ou assimilé,147,0,S,sols,,,81,-1.699482,48.510138
2021-618948,2021-09-15,000001,Vente,220000,2,,RUE DE LA MARE PETEL,0035,35120,35104,Epiniac,35,,,35104000AB0628,,,,,,,,,,,,,0,2,Appartement,52,3,S,sols,,,81,-1.699482,48.510138
2021-618955,2021-09-13,000001,Vente,1962.5,,,LE GRAND CLOS,B638,35120,35104,Epiniac,35,,,351040000D0098,,,,,,,,,,,,,0,,,,,T,terres,,,2495,-1.713239,48.48194
2021-618955,2021-09-13,000001,Vente,1962.5,,,LE GRAND CLOS,B638,35120,35104,Epiniac,35,,,351040000D0099,,,,,,,,,,,,,0,,,,,T,terres,,,5355,-1.713503,48.482126
2021-619232,2021-10-06,000001,Vente,220000,5,,RUE DES EPINETTES,0024,35120,35104,Epiniac,35,,,35104000AB0404,,,,,,,,,,,,,0,1,Maison,82,4,AG,terrains d'agrément,,,2779,-1.691145,48.509532
2021-619232,2021-10-06,000001,Vente,220000,5,,RUE DES EPINETTES,0024,35120,35104,Epiniac,35,,,35104000AB0404,,,,,,,,,,,,,0,1,Maison,82,4,S,sols,,,700,-1.691145,48.509532
2021-619232,2021-10-06,000001,Vente,220000,5,,RUE DES EPINETTES,0024,35120,35104,Epiniac,35,,,35104000AB0404,,,,,,,,,,,,,0,3,Dépendance,,0,AG,terrains d'agrément,,,2779,-1.691145,48.509532
2021-619232,2021-10-06,000001,Vente,220000,5,,RUE DES EPINETTES,0024,35120,35104,Epiniac,35,,,35104000AB0404,,,,,,,,,,,,,0,3,Dépendance,,0,S,sols,,,700,-1.691145,48.509532
2021-619232,2021-10-06,000001,Vente,220000,,,LA CROIX HAREL,B543,35120,35104,Epiniac,35,,,35104000AB0406,,,,,,,,,,,,,0,,,,,T,terres,,,287,-1.69131,48.509362
2021-619267,2021-10-13,000001,Vente,325630,9001,,VILLEROUX,C472,35120,35104,Epiniac,35,,,351040000B1548,,,,,,,,,,,,,0,1,Maison,191,6,S,sols,,,500,-1.694229,48.511025
2021-619267,2021-10-13,000001,Vente,325630,9001,,VILLEROUX,C472,35120,35104,Epiniac,35,,,351040000B1548,,,,,,,,,,,,,0,1,Maison,191,6,AG,terrains d'agrément,,,494,-1.694229,48.511025
2021-619267,2021-10-13,000001,Vente,325630,,,LA GRANDE NIRON,B731,35120,35104,Epiniac,35,,,351040000B1673,,,,,,,,,,,,,0,,,,,S,sols,,,112,-1.694204,48.510867
2021-619450,2021-10-09,000001,Vente,90000,,,LA HAUTE BUTTE,B799,35120,35104,Epiniac,35,,,35104000AC0095,,,,,,,,,,,,,0,,,,,S,sols,,,155,-1.735733,48.501719
2021-619450,2021-10-09,000001,Vente,90000,,,LA HAUTE BUTTE,B799,35120,35104,Epiniac,35,,,35104000AC0096,,,,,,,,,,,,,0,,,,,J,jardins,POTAG,Jardin potager,610,-1.735797,48.50187
2021-619450,2021-10-09,000001,Vente,90000,3,,RUE DE LA MASSE,0036,35120,35104,Epiniac,35,,,35104000AC0097,,,,,,,,,,,,,0,1,Maison,142,5,S,sols,,,700,-1.735778,48.502208
2021-619462,2021-10-05,000001,Vente,29120,,,LE COURTIL DE LA FONTAINE,B517,35120,35104,Epiniac,35,,,351040000A1186,,,,,,,,,,,,,0,,,,,AB,terrains a bâtir,,,416,-1.697866,48.512294
2021-619463,2021-09-29,000001,Vente,35910,,,LE COURTIL DE LA FONTAINE,B517,35120,35104,Epiniac,35,,,351040000A1173,,,,,,,,,,,,,0,,,,,AB,terrains a bâtir,,,513,-1.697532,48.511919
2021-619775,2021-10-15,000001,Vente,33390,,,LE COURTIL DE LA FONTAINE,B517,35120,35104,Epiniac,35,,,351040000A1180,,,,,,,,,,,,,0,,,,,AB,terrains a bâtir,,,477,-1.697871,48.512657
2021-619838,2021-11-05,000001,Echange,2725,,,LE GRAND CLOS,B638,35120,35104,Epiniac,35,,,351040000B0904,,,,,,,,,,,,,0,,,,,T,terres,,,8260,-1.688604,48.498852
2021-619839,2021-11-05,000002,Echange,1975,,,LES GRANDS COURTILS,B766,35120,35104,Epiniac,35,,,351040000B0589,,,,,,,,,,,,,0,,,,,T,terres,,,5990,-1.690897,48.501437
2021-619840,2021-11-05,000001,Vente,272000,,,LA VILLE JEAN,C449,35120,35104,Epiniac,35,,,351040000B0564,,,,,,,,,,,,,0,,,,,P,prés,,,250,-1.68887,48.499723
2021-619840,2021-11-05,000001,Vente,272000,5090,,LA VILLE JEAN,C449,35120,35104,Epiniac,35,,,351040000B0566,,,,,,,,,,,,,0,3,Dépendance,,0,S,sols,,,650,-1.68891,48.500209
2021-619840,2021-11-05,000001,Vente,272000,5090,,LA VILLE JEAN,C449,35120,35104,Epiniac,35,,,351040000B0566,,,,,,,,,,,,,0,1,Maison,160,4,S,sols,,,650,-1.68891,48.500209
2021-619840,2021-11-05,000001,Vente,272000,,,LE CLOS DERRIERE,B354,35120,35104,Epiniac,35,,,351040000B0570,,,,,,,,,,,,,0,,,,,T,terres,,,8500,-1.689546,48.500138
2021-619840,2021-11-05,000001,Vente,272000,,,LES GRANDS COURTILS,B766,35120,35104,Epiniac,35,,,351040000B0589,,,,,,,,,,,,,0,,,,,T,terres,,,5990,-1.690897,48.501437
2021-619840,2021-11-05,000001,Vente,272000,,,LE CLOS DE LA RUFESLE,B343,35120,35104,Epiniac,35,,,351040000B0595,,,,,,,,,,,,,0,,,,,L,landes,,,855,-1.689128,48.499346
2021-619840,2021-11-05,000001,Vente,272000,,,LE BOIS DE LA FOLTIERE,B044,35120,35104,Epiniac,35,,,351040000B0901,,,,,,,,,,,,,0,,,,,BT,taillis simples,,,2370,-1.688085,48.498214
2021-619840,2021-11-05,000001,Vente,272000,,,LE GRAND CLOS DU HAUT,B649,35120,35104,Epiniac,35,,,351040000B0903,,,,,,,,,,,,,0,,,,,T,terres,,,6350,-1.689184,48.498089
2021-619840,2021-11-05,000001,Vente,272000,,,LE CLOS DE LA FONTAINE,B331,35120,35104,Epiniac,35,,,351040000B0905,,,,,,,,,,,,,0,,,,,P,prés,,,970,-1.688943,48.499183
2021-619840,2021-11-05,000001,Vente,272000,,,VALLEES DU BOUILLON ABRAHA,C423,35120,35104,Epiniac,35,,,351040000B0911,,,,,,,,,,,,,0,,,,,BF,futaies feuillues,,,2030,-1.6905,48.498607
2021-619840,2021-11-05,000001,Vente,272000,,,LA VILLE JEAN,C449,35120,35104,Epiniac,35,,,351040000B1564,,,,,,,,,,,,,0,,,,,T,terres,,,2409,-1.689077,48.500186
2021-619840,2021-11-05,000001,Vente,272000,,,LES LANDIERS,B900,35120,35104,Epiniac,35,,,351040000B1588,,,,,,,,,,,,,0,,,,,T,terres,,,991,-1.690428,48.498765
2021-619840,2021-11-05,000001,Vente,272000,,,LES LANDIERS,B900,35120,35104,Epiniac,35,,,351040000B1589,,,,,,,,,,,,,0,,,,,T,terres,,,294,-1.6891,48.499189
2021-619840,2021-11-05,000001,Vente,272000,,,LE CLOS DE LA FONTAINE,B331,35120,35104,Epiniac,35,,,351040000B1600,,,,,,,,,,,,,0,,,,,T,terres,,,955,-1.689524,48.498717
2021-619840,2021-11-05,000001,Vente,272000,,,LE CLOS DE LA FONTAINE,B331,35120,35104,Epiniac,35,,,351040000B1601,,,,,,,,,,,,,0,,,,,T,terres,,,5775,-1.689966,48.497852
2021-619842,2021-09-29,000002,Vente,110000,7,,LE DOUET DES ROCHES,B560,35120,35104,Epiniac,35,,,35104000AB0633,,,,,,,,,,,,,0,1,Maison,56,3,,,,,,-1.699979,48.511252
2021-619842,2021-09-29,000002,Vente,110000,7,,LE DOUET DES ROCHES,B560,35120,35104,Epiniac,35,,,35104000AB0633,,,,,,,,,,,,,0,1,Maison,56,3,,,,,,-1.699979,48.511252
2021-619842,2021-09-29,000002,Vente,110000,,,LE DOUET DES ROCHES,B560,35120,35104,Epiniac,35,,,35104000AB0636,,,,,,,,,,,,,0,,,,,S,sols,,,78,-1.699233,48.511318
2021-619965,2021-11-04,000001,Vente,1497,,,PATIS DU CHAUSSIS VEILLARD,B956,35120,35104,Epiniac,35,,,35104000AE0077,,,,,,,,,,,,,0,,,,,L,landes,,,499,,
2021-619967,2021-10-08,000001,Vente,130000,,,LE DOUET DES ROCHES,B560,35120,35104,Epiniac,35,,,35104000AB0635,,,,,,,,,,,,,0,,,,,S,sols,,,157,-1.699257,48.511398
2021-619984,2021-11-04,000001,Vente,13000,,,PRE DE LA NOS,C213,35120,35104,Epiniac,35,,,35104000AE0042,,,,,,,,,,,,,0,,,,,P,prés,,,2155,-1.714108,48.490049
2021-619984,2021-11-04,000001,Vente,13000,,,LE GRAND LONG LA VOIE,B673,35120,35104,Epiniac,35,,,35104000AE0044,,,,,,,,,,,,,0,,,,,T,terres,,,6598,-1.713668,48.489975
2021-619984,2021-11-04,000001,Vente,13000,,,LE PETIT LONG LA VOIE,C033,35120,35104,Epiniac,35,,,35104000AE0046,,,,,,,,,,,,,0,,,,,T,terres,,,10045,-1.713581,48.489014
2021-619984,2021-11-04,000001,Vente,13000,,,LANDE D EPINIAC,B855,35120,35104,Epiniac,35,,,35104000AE0098,,,,,,,,,,,,,0,,,,,P,prés,,,5570,-1.711929,48.490854
2021-619984,2021-11-04,000001,Vente,13000,,,LA CHESNAIE,B265,35120,35104,Epiniac,35,,,35104000AE0174,,,,,,,,,,,,,0,,,,,T,terres,,,4780,-1.711891,48.486963
2021-619984,2021-11-04,000001,Vente,13000,,,LA NOS,B939,35120,35104,Epiniac,35,,,35104000AE0254,,,,,,,,,,,,,0,,,,,L,landes,,,1118,-1.714643,48.489177
2021-619984,2021-11-04,000001,Vente,13000,,,LE CLOS DEVANT,B371,35120,35104,Epiniac,35,,,35104000AE0317,,,,,,,,,,,,,0,,,,,T,terres,,,79,-1.71371,48.487099
2021-619984,2021-11-04,000001,Vente,13000,,,LE CLOS DEVANT,B371,35120,35104,Epiniac,35,,,35104000AE0318,,,,,,,,,,,,,0,,,,,T,terres,,,63,-1.712871,48.486468
2021-619984,2021-11-04,000001,Vente,13000,,,LA GROSSE AULNE,B780,35120,35104,Epiniac,35,,,35104000AE0320,,,,,,,,,,,,,0,,,,,T,terres,,,6202,-1.713171,48.486897
2021-619990,2021-11-04,000001,Vente,1497,,,PATIS DU CHAUSSIS VEILLARD,B956,35120,35104,Epiniac,35,,,35104000AE0076,,,,,,,,,,,,,0,,,,,L,landes,,,499,,
2021-620199,2021-11-17,000001,Vente,105500,5,,RUE DE LA RANGEE .ST LEONARD,0045,35120,35104,Epiniac,35,,,35104000AC0058,,,,,,,,,,,,,0,3,Dépendance,,0,S,sols,,,212,-1.734917,48.501229
2021-620199,2021-11-17,000001,Vente,105500,5,,RUE DE LA RANGEE .ST LEONARD,0045,35120,35104,Epiniac,35,,,35104000AC0058,,,,,,,,,,,,,0,1,Maison,89,5,S,sols,,,212,-1.734917,48.501229
2021-620229,2021-12-03,000002,Vente,64000,4,,RUE DU COMMERCE .ST LEONARD,0010,35120,35104,Epiniac,35,,,35104000AC0434,,,,,,,,,,,,,0,3,Dépendance,,0,S,sols,,,170,-1.734085,48.500526
2021-620229,2021-12-03,000002,Vente,64000,4,,RUE DU COMMERCE .ST LEONARD,0010,35120,35104,Epiniac,35,,,35104000AC0434,,,,,,,,,,,,,0,1,Maison,104,4,S,sols,,,170,-1.734085,48.500526
2021-620229,2021-12-03,000002,Vente,64000,,,SAINT LEONARD,C371,35120,35104,Epiniac,35,,,35104000AC0436,,,,,,,,,,,,,0,,,,,AG,terrains d'agrément,,,114,-1.733959,48.50057
2021-620408,2021-12-15,000001,Vente,55590,,,LE GRAND FRICHE,B665,35120,35104,Epiniac,35,,,351040000B1494,,,,,,,,,,,,,0,,,,,T,terres,,,164,-1.693474,48.494467
2021-620408,2021-12-15,000001,Vente,55590,,,LA FOLTIERE,B596,35120,35104,Epiniac,35,,,351040000B1497,,,,,,,,,,,,,0,,,,,T,terres,,,31,-1.693731,48.494499
2021-620408,2021-12-15,000001,Vente,55590,,,LA FOLTIERE,B596,35120,35104,Epiniac,35,,,351040000B1574,,,,,,,,,,,,,0,,,,,S,sols,,,35,-1.693072,48.494555
2021-620408,2021-12-15,000001,Vente,55590,,,LA FOLTIERE,B596,35120,35104,Epiniac,35,,,351040000B1577,,,,,,,,,,,,,0,,,,,AB,terrains a bâtir,,,59,-1.692883,48.494411
2021-620408,2021-12-15,000001,Vente,55590,,,LE GRAND FRICHE,B665,35120,35104,Epiniac,35,,,351040000B1580,,,,,,,,,,,,,0,,,,,S,sols,,,114,-1.693077,48.494502
2021-620408,2021-12-15,000001,Vente,55590,,,LE GRAND FRICHE,B665,35120,35104,Epiniac,35,,,351040000B1581,,,,,,,,,,,,,0,,,,,AB,terrains a bâtir,,,291,-1.693113,48.494442
2021-620408,2021-12-15,000001,Vente,55590,,,LE GRAND FRICHE,B665,35120,35104,Epiniac,35,,,351040000B1583,,,,,,,,,,,,,0,,,,,T,terres,,,26,-1.693249,48.494475
2021-620408,2021-12-15,000001,Vente,55590,,,LA FOLTIERE,B596,35120,35104,Epiniac,35,,,351040000B1584,,,,,,,,,,,,,0,,,,,S,sols,,,51,-1.693048,48.494533
2021-620588,2021-12-20,000001,Vente,2000,,,LA CHEVRAIS,B271,35120,35104,Epiniac,35,,,351040000D0453,,,,,,,,,,,,,0,,,,,S,sols,,,70,-1.718835,48.475498
2021-620588,2021-12-20,000001,Vente,2000,,,LA CHEVRAIS,B271,35120,35104,Epiniac,35,,,351040000D0454,,,,,,,,,,,,,0,,,,,S,sols,,,12,-1.718794,48.4755
2021-620594,2021-12-21,000001,Vente,78000,2,B,RUE DE LA BARBIERE,0003,35120,35104,Epiniac,35,,,351040000A1106,,,,,,,,,,,,,0,1,Maison,118,5,AG,terrains d'agrément,,,1001,-1.696661,48.511579
2021-620594,2021-12-21,000001,Vente,78000,2,B,RUE DE LA BARBIERE,0003,35120,35104,Epiniac,35,,,351040000A1106,,,,,,,,,,,,,0,1,Maison,118,5,S,sols,,,500,-1.696661,48.511579
2021-620594,2021-12-21,000001,Vente,78000,,,LA GRANDE RABINE,B743,35120,35104,Epiniac,35,,,351040000A1107,,,,,,,,,,,,,0,,,,,S,sols,,,77,-1.696886,48.511626
2021-620818,2021-12-23,000001,Vente,465000,2,,HAUTE PORTE,B801,35120,35104,Epiniac,35,,,351040000E0929,,,,,,,,,,,,,0,1,Maison,160,5,AG,terrains d'agrément,,,221,-1.717699,48.495125
2021-620818,2021-12-23,000001,Vente,465000,2,,HAUTE PORTE,B801,35120,35104,Epiniac,35,,,351040000E0929,,,,,,,,,,,,,0,1,Maison,160,5,S,sols,,,900,-1.717699,48.495125
2021-620818,2021-12-23,000001,Vente,465000,,,LE CLOS EUGENE,B400,35120,35104,Epiniac,35,,,351040000E0936,,,,,,,,,,,,,0,,,,,AG,terrains d'agrément,,,439,-1.717522,48.495179
