id_mutation,date_mutation,numero_disposition,nature_mutation,valeur_fonciere,adresse_numero,adresse_suffixe,adresse_nom_voie,adresse_code_voie,code_postal,code_commune,nom_commune,code_departement,ancien_code_commune,ancien_nom_commune,id_parcelle,ancien_id_parcelle,numero_volume,lot1_numero,lot1_surface_carrez,lot2_numero,lot2_surface_carrez,lot3_numero,lot3_surface_carrez,lot4_numero,lot4_surface_carrez,lot5_numero,lot5_surface_carrez,nombre_lots,code_type_local,type_local,surface_reelle_bati,nombre_pieces_principales,code_nature_culture,nature_culture,code_nature_culture_speciale,nature_culture_speciale,surface_terrain,longitude,latitude
2021-611124,2021-01-05,000001,Vente,40790,5706,,LA GARE,B209,35660,35145,Langon,35,,,35145000ZP0101,,,,,,,,,,,,,0,1,Maison,88,5,S,sols,,,164,-1.852139,47.730383
2021-611139,2021-01-07,000001,Vente,8000,6089,,LA GLENAIS,B214,35660,35145,Langon,35,,,35145000ZK0103,,,,,,,,,,,,,0,3,Dépendance,,0,BT,taillis simples,,,1280,-1.828504,47.765511
2021-611139,2021-01-07,000001,Vente,8000,6089,,LA GLENAIS,B214,35660,35145,Langon,35,,,35145000ZK0103,,,,,,,,,,,,,0,3,Dépendance,,0,AG,terrains d'agrément,,,3940,-1.828504,47.765511
2021-611194,2021-01-22,000001,Vente,220000,2,,RUE DE LA POMMARDIERE,0080,35660,35145,Langon,35,,,35145000AB0017,,,,,,,,,,,,,0,1,Maison,165,6,S,sols,,,589,-1.850225,47.721262
2021-611252,2021-01-08,000001,Vente,25000,,,SUR LES NOES,B282,35660,35145,Langon,35,,,35145000YB0020,,,,,,,,,,,,,0,,,,,P,prés,MARAI,Pré marais,6795,-1.884025,47.728053
2021-611252,2021-01-08,000001,Vente,25000,,,SUR LES NOES,B282,35660,35145,Langon,35,,,35145000YB0020,,,,,,,,,,,,,0,,,,,P,prés,MARAI,Pré marais,2265,-1.884025,47.728053
2021-611252,2021-01-08,000001,Vente,25000,,,DOMAINE DES JANISAIS,B178,35660,35145,Langon,35,,,35145000YB0035,,,,,,,,,,,,,0,,,,,P,prés,MARAI,Pré marais,4880,-1.882,47.727939
2021-611252,2021-01-08,000001,Vente,25000,,,DOMAINE DES JANISAIS,B178,35660,35145,Langon,35,,,35145000YB0036,,,,,,,,,,,,,0,,,,,T,terres,,,4948,-1.881421,47.727744
2021-611252,2021-01-08,000001,Vente,25000,,,DOMAINE DES JANISAIS,B178,35660,35145,Langon,35,,,35145000YB0036,,,,,,,,,,,,,0,,,,,P,prés,MARAI,Pré marais,612,-1.881421,47.727744
2021-611252,2021-01-08,000001,Vente,25000,,,SUR LES NOES,B282,35660,35145,Langon,35,,,35145000YB0168,,,,,,,,,,,,,0,,,,,T,terres,,,4480,-1.881758,47.728588
2021-611252,2021-01-08,000001,Vente,25000,,,LA VIGNE DU BOIS,B369,35660,35145,Langon,35,,,35145000YC0012,,,,,,,,,,,,,0,,,,,T,terres,,,3940,-1.890457,47.732758
2021-611252,2021-01-08,000001,Vente,25000,,,LES CHINTRES DE JOUAN,B052,35660,35145,Langon,35,,,35145000YC0188,,,,,,,,,,,,,0,,,,,T,terres,,,2600,-1.879129,47.727332
2021-611252,2021-01-08,000001,Vente,25000,,,LES CHINTRES DE JOUAN,B052,35660,35145,Langon,35,,,35145000YC0188,,,,,,,,,,,,,0,,,,,L,landes,,,6180,-1.879129,47.727332
2021-611252,2021-01-08,000001,Vente,25000,,,LES CHINTRES DE JOUAN,B052,35660,35145,Langon,35,,,35145000YC0189,,,,,,,,,,,,,0,,,,,T,terres,,,1464,-1.879216,47.728065
2021-611252,2021-01-08,000001,Vente,25000,,,LES CHINTRES DE JOUAN,B052,35660,35145,Langon,35,,,35145000YC0189,,,,,,,,,,,,,0,,,,,L,landes,,,3940,-1.879216,47.728065
2021-611252,2021-01-08,000001,Vente,25000,,,LES CHINTRES DE JOUAN,B052,35660,35145,Langon,35,,,35145000YC0189,,,,,,,,,,,,,0,,,,,T,terres,,,2456,-1.879216,47.728065
2021-611252,2021-01-08,000001,Vente,25000,,,LES CHINTRES DE JOUAN,B052,35660,35145,Langon,35,,,35145000YC0190,,,,,,,,,,,,,0,,,,,T,terres,,,4275,-1.879562,47.728549
2021-611252,2021-01-08,000001,Vente,25000,,,LES CHINTRES DE JOUAN,B052,35660,35145,Langon,35,,,35145000YC0190,,,,,,,,,,,,,0,,,,,P,prés,MARAI,Pré marais,4315,-1.879562,47.728549
2021-611252,2021-01-08,000001,Vente,25000,,,LES CHINTRES DE JOUAN,B052,35660,35145,Langon,35,,,35145000YC0191,,,,,,,,,,,,,0,,,,,P,prés,MARAI,Pré marais,1920,-1.880514,47.728419
2021-611252,2021-01-08,000001,Vente,25000,,,LES CHINTRES DE JOUAN,B052,35660,35145,Langon,35,,,35145000YC0193,,,,,,,,,,,,,0,,,,,E,eaux,,,4300,-1.880765,47.728713
2021-611252,2021-01-08,000001,Vente,25000,,,LES CHINTRES DE JOUAN,B052,35660,35145,Langon,35,,,35145000YC0194,,,,,,,,,,,,,0,,,,,T,terres,,,2745,-1.879662,47.729932
2021-611252,2021-01-08,000001,Vente,25000,,,LES CHINTRES DE JOUAN,B052,35660,35145,Langon,35,,,35145000YC0194,,,,,,,,,,,,,0,,,,,P,prés,MARAI,Pré marais,4076,-1.879662,47.729932
2021-611252,2021-01-08,000001,Vente,25000,,,LES CHINTRES DE JOUAN,B052,35660,35145,Langon,35,,,35145000YC0194,,,,,,,,,,,,,0,,,,,P,prés,MARAI,Pré marais,12229,-1.879662,47.729932
2021-611252,2021-01-08,000001,Vente,25000,,,LES CHINTRES DE JOUAN,B052,35660,35145,Langon,35,,,35145000YC0194,,,,,,,,,,,,,0,,,,,L,landes,,,1120,-1.879662,47.729932
2021-611252,2021-01-08,000001,Vente,25000,,,LES CHINTRES DE JOUAN,B052,35660,35145,Langon,35,,,35145000YC0210,,,,,,,,,,,,,0,,,,,BR,futaies résineuses,,,3239,-1.881698,47.730938
2021-611252,2021-01-08,000001,Vente,25000,,,LES CHINTRES DE JOUAN,B052,35660,35145,Langon,35,,,35145000YC0210,,,,,,,,,,,,,0,,,,,P,prés,MARAI,Pré marais,3681,-1.881698,47.730938
2021-611252,2021-01-08,000001,Vente,25000,,,LES CHINTRES DE JOUAN,B052,35660,35145,Langon,35,,,35145000YC0210,,,,,,,,,,,,,0,,,,,P,prés,MARAI,Pré marais,1840,-1.881698,47.730938
2021-611252,2021-01-08,000001,Vente,25000,,,LES CHINTRES DE JOUAN,B052,35660,35145,Langon,35,,,35145000YC0213,,,,,,,,,,,,,0,,,,,P,prés,MARAI,Pré marais,1580,-1.881013,47.73008
2021-611252,2021-01-08,000001,Vente,25000,,,LES CHINTRES DE JOUAN,B052,35660,35145,Langon,35,,,35145000YC0213,,,,,,,,,,,,,0,,,,,S,sols,,,500,-1.881013,47.73008
2021-611252,2021-01-08,000001,Vente,25000,,,LES CHINTRES DE JOUAN,B052,35660,35145,Langon,35,,,35145000YC0213,,,,,,,,,,,,,0,,,,,P,prés,MARAI,Pré marais,3160,-1.881013,47.73008
2021-611252,2021-01-08,000001,Vente,25000,,,LES CHINTRES DE JOUAN,B052,35660,35145,Langon,35,,,35145000YC0214,,,,,,,,,,,,,0,,,,,P,prés,MARAI,Pré marais,1067,-1.88094,47.729731
2021-611252,2021-01-08,000001,Vente,25000,,,LES CHINTRES DE JOUAN,B052,35660,35145,Langon,35,,,35145000YC0214,,,,,,,,,,,,,0,,,,,P,prés,MARAI,Pré marais,2133,-1.88094,47.729731
2021-611252,2021-01-08,000001,Vente,25000,,,LES CHINTRES DE JOUAN,B052,35660,35145,Langon,35,,,35145000YC0215,,,,,,,,,,,,,0,,,,,E,eaux,,,960,-1.880807,47.729367
2021-611252,2021-01-08,000001,Vente,25000,,,LES CHINTRES DE JOUAN,B052,35660,35145,Langon,35,,,35145000YC0215,,,,,,,,,,,,,0,,,,,P,prés,MARAI,Pré marais,4300,-1.880807,47.729367
2021-611252,2021-01-08,000001,Vente,25000,,,SOUS LE CLOS NEUF,B343,35660,35145,Langon,35,,,35145000YC0266,,,,,,,,,,,,,0,,,,,L,landes,,,2137,-1.891682,47.731845
2021-611252,2021-01-08,000001,Vente,25000,,,SOUS LE CLOS NEUF,B343,35660,35145,Langon,35,,,35145000YC0266,,,,,,,,,,,,,0,,,,,BR,futaies résineuses,,,2453,-1.891682,47.731845
2021-611252,2021-01-08,000001,Vente,25000,,,SOUS LE CLOS NEUF,B343,35660,35145,Langon,35,,,35145000YC0267,,,,,,,,,,,,,0,,,,,BR,futaies résineuses,,,3378,-1.891791,47.732105
2021-611252,2021-01-08,000001,Vente,25000,,,SOUS LE CLOS NEUF,B343,35660,35145,Langon,35,,,35145000YC0267,,,,,,,,,,,,,0,,,,,L,landes,,,3862,-1.891791,47.732105
2021-611272,2021-01-28,000001,Vente,80000,12,,RUE DU COURTIRET,0030,35660,35145,Langon,35,,,35145000AB0363,,,,,,,,,,,,,0,1,Maison,75,3,S,sols,,,214,-1.850447,47.719622
2021-611272,2021-01-28,000001,Vente,80000,,,LE BOURG,B023,35660,35145,Langon,35,,,35145000AB0366,,,,,,,,,,,,,0,,,,,T,terres,,,212,-1.850546,47.719753
2021-611300,2021-01-26,000001,Vente,80000,5,,RUE GRANDE RUE,0065,35660,35145,Langon,35,,,35145000AB0058,,,,,,,,,,,,,0,1,Maison,112,4,S,sols,,,870,-1.849731,47.719575
2021-611318,2021-01-28,000001,Vente,13066.56,,,LANDE DE MUSSON,B251,35660,35145,Langon,35,,,35145000ZW0517,,,,,,,,,,,,,0,,,,,S,sols,,,624,-1.864621,47.717194
2021-611383,2021-02-04,000001,Vente,45000,2,,RUE DU COURTIRET,0030,35660,35145,Langon,35,,,35145000AB0347,,,,,,,,,,,,,0,1,Maison,56,3,S,sols,,,80,-1.849522,47.719462
2021-611447,2021-02-18,000001,Vente,263595,,,PRAIRIE DE BESLE,B297,35660,35145,Langon,35,,,35145000ZX0062,,,,,,,,,,,,,0,,,,,L,landes,,,11510,-1.869961,47.70248
2021-611447,2021-02-18,000001,Vente,263595,2,,LE PATIS VERT,B286,35660,35145,Langon,35,,,35145000ZX0063,,,,,,,,,,,,,0,1,Maison,240,9,S,sols,,,2230,-1.869214,47.701625
2021-611447,2021-02-18,000001,Vente,263595,,,LE PATIS VERT,B286,35660,35145,Langon,35,,,35145000ZX0064,,,,,,,,,,,,,0,,,,,E,eaux,,,2568,-1.870309,47.701531
2021-611447,2021-02-18,000001,Vente,263595,,,LE PATIS VERT,B286,35660,35145,Langon,35,,,35145000ZX0196,,,,,,,,,,,,,0,,,,,J,jardins,POTAG,Jardin potager,1437,-1.869356,47.701726
2021-611447,2021-02-18,000001,Vente,263595,,,LE PATIS VERT,B286,35660,35145,Langon,35,,,35145000ZX0197,,,,,,,,,,,,,0,,,,,P,prés,MARAI,Pré marais,2745,-1.869792,47.701588
2021-611489,2021-02-11,000001,Vente,900,,,LA VIGNE DU BOIS,B369,35660,35145,Langon,35,,,35145000YC0010,,,,,,,,,,,,,0,,,,,T,terres,,,6300,-1.891423,47.734508
2021-611619,2021-03-04,000001,Vente,160000,4,,RUE DU TUMULUS,0110,35660,35145,Langon,35,,,35145000ZW0503,,,,,,,,,,,,,0,4,Local industriel. commercial ou assimilé,600,0,S,sols,,,2019,-1.865991,47.717976
2021-611627,2021-03-11,000001,Vente,95000,14,,LE BRULAY,B027,35660,35145,Langon,35,,,35145000ZI0098,,,,,,,,,,,,,0,1,Maison,175,4,S,sols,,,161,-1.833362,47.756945
2021-611627,2021-03-11,000001,Vente,95000,5045,,LE BRULAY,B027,35660,35145,Langon,35,,,35145000ZI0174,,,,,,,,,,,,,0,1,Maison,44,1,S,sols,,,177,-1.833487,47.756992
2021-611627,2021-03-11,000001,Vente,95000,,,LE BRULAY,B027,35660,35145,Langon,35,,,35145000ZI0175,,,,,,,,,,,,,0,,,,,J,jardins,POTAG,Jardin potager,302,-1.833289,47.757172
2021-611628,2021-03-11,000002,Vente,40000,,,DOMAINE DU BRULAY,B185,35660,35145,Langon,35,,,35145000ZI0171,,,,,,,,,,,,,0,,,,,J,jardins,POTAG,Jardin potager,258,-1.833509,47.757191
2021-611628,2021-03-11,000002,Vente,40000,16,,LE BRULAY,B027,35660,35145,Langon,35,,,35145000ZI0172,,,,,,,,,,,,,0,1,Maison,65,3,S,sols,,,144,-1.833574,47.757007
2021-611643,2021-03-19,000001,Vente,15000,11,B,RUE SAINT PERE,0045,35660,35145,Langon,35,,,35145000AB0156,,,,,,,,,,,,,0,1,Maison,26,1,S,sols,,,288,-1.847926,47.71921
2021-611775,2021-03-12,000001,Vente,135000,,,DONGELOU,B194,35660,35145,Langon,35,,,35145000ZP0009,,,,,,,,,,,,,0,,,,,T,terres,,,1985,-1.845304,47.735561
2021-611775,2021-03-12,000001,Vente,135000,,,DONGELOU,B194,35660,35145,Langon,35,,,35145000ZP0009,,,,,,,,,,,,,0,,,,,S,sols,,,685,-1.845304,47.735561
2021-611775,2021-03-12,000001,Vente,135000,1,,DONGELOU,B194,35660,35145,Langon,35,,,35145000ZP0010,,,,,,,,,,,,,0,1,Maison,104,5,S,sols,,,275,-1.845077,47.735158
2021-611775,2021-03-12,000001,Vente,135000,1,,DONGELOU,B194,35660,35145,Langon,35,,,35145000ZP0011,,,,,,,,,,,,,0,,,,,S,sols,,,650,-1.845118,47.735011
2021-611775,2021-03-12,000001,Vente,135000,,,DONGELOU,B194,35660,35145,Langon,35,,,35145000ZP0012,,,,,,,,,,,,,0,,,,,T,terres,,,16170,-1.84581,47.734593
2021-611779,2021-03-22,000001,Vente,5000,10,,BERNUIT,B015,35660,35145,Langon,35,,,35145000YE0315,,,,,,,,,,,,,0,3,Dépendance,,0,S,sols,,,253,-1.910991,47.722372
2021-611862,2021-03-31,000001,Vente,39990,,,DOMAINE DE ROCHE POISSON,B158,35660,35145,Langon,35,,,35145000ZN0101,,,,,,,,,,,,,0,,,,,T,terres,,,2560,-1.854201,47.736467
2021-611889,2021-04-12,000001,Vente,5150,,,LE SUENAY,B347,35660,35145,Langon,35,,,35145000YH0118,,,,,,,,,,,,,0,,,,,BR,futaies résineuses,,,4390,-1.916021,47.732182
2021-611909,2021-04-02,000002,Vente,6700,,,LA LANDE,B235,35660,35145,Langon,35,,,35145000ZK0045,,,,,,,,,,,,,0,,,,,J,jardins,POTAG,Jardin potager,819,-1.830313,47.753482
2021-611909,2021-04-02,000002,Vente,6700,,,LA LANDE,B235,35660,35145,Langon,35,,,35145000ZK0047,,,,,,,,,,,,,0,,,,,L,landes,,,37,-1.830546,47.753534
2021-611909,2021-04-02,000002,Vente,6700,,,LA LANDE,B235,35660,35145,Langon,35,,,35145000ZK0048,,,,,,,,,,,,,0,,,,,J,jardins,POTAG,Jardin potager,99,-1.8305,47.753598
2021-611909,2021-04-02,000002,Vente,6700,,,LA LANDE,B235,35660,35145,Langon,35,,,35145000ZK0049,,,,,,,,,,,,,0,,,,,S,sols,,,52,-1.83042,47.753627
2021-611909,2021-04-02,000002,Vente,6700,,,LA LANDE,B235,35660,35145,Langon,35,,,35145000ZK0118,,,,,,,,,,,,,0,,,,,S,sols,,,41,-1.830437,47.753462
2021-611980,2021-04-14,000001,Vente,15000,,,LE BOURG,B023,35660,35145,Langon,35,,,35145000AB0270,,,,,,,,,,,,,0,,,,,P,prés,,,719,-1.848164,47.721805
2021-611980,2021-04-14,000001,Vente,15000,,,LE BOURG,B023,35660,35145,Langon,35,,,35145000AB0271,,,,,,,,,,,,,0,,,,,P,prés,,,397,-1.847953,47.72168
2021-611980,2021-04-14,000001,Vente,15000,,,LE BOURG,B023,35660,35145,Langon,35,,,35145000AB0273,,,,,,,,,,,,,0,,,,,P,prés,,,71,-1.848108,47.721584
2021-611980,2021-04-14,000001,Vente,15000,,,LE BOURG,B023,35660,35145,Langon,35,,,35145000AB0275,,,,,,,,,,,,,0,,,,,P,prés,,,62,-1.847975,47.721416
2021-612034,2021-04-23,000001,Vente,79000,,,LE PRE DU BIGNON,B305,35660,35145,Langon,35,,,35145000ZP0089,,,,,,,,,,,,,0,,,,,P,prés,MARAI,Pré marais,554,-1.850601,47.729597
2021-612034,2021-04-23,000001,Vente,79000,,,LE PRE DU BIGNON,B305,35660,35145,Langon,35,,,35145000ZP0089,,,,,,,,,,,,,0,,,,,T,terres,,,1006,-1.850601,47.729597
2021-612034,2021-04-23,000001,Vente,79000,5,,LE HEINLEE,B223,35660,35145,Langon,35,,,35145000ZP0093,,,,,,,,,,,,,0,1,Maison,49,2,S,sols,,,382,-1.850361,47.729194
2021-612034,2021-04-23,000001,Vente,79000,5682,,LE HEINLEE,B223,35660,35145,Langon,35,,,35145000ZP0094,,,,,,,,,,,,,0,1,Maison,91,4,S,sols,,,582,-1.850456,47.729164
2021-612088,2021-04-23,000001,Vente,37000,12,,LE COUDRAIS,B381,35660,35145,Langon,35,,,35145000YA0438,,,,,,,,,,,,,0,1,Maison,36,2,S,sols,,,298,-1.889189,47.714037
2021-612094,2021-04-16,000001,Vente,35000,12,,LA GARE,B209,35660,35145,Langon,35,,,35145000ZT0264,,,,,,,,,,,,,0,1,Maison,140,5,S,sols,,,1098,-1.851305,47.728574
2021-612098,2021-04-19,000001,Vente,105000,68,,RUE HAMEAU DE PLAISANCE,0079,35660,35145,Langon,35,,,35145000ZS0208,,,,,,,,,,,,,0,1,Maison,57,3,S,sols,,,309,-1.852245,47.72236
2021-612098,2021-04-19,000001,Vente,105000,,,LANDE DU MOULIN DE LANGON,B261,35660,35145,Langon,35,,,35145000ZS0268,,,,,,,,,,,,,0,,,,,S,sols,,,166,-1.852236,47.722189
2021-612100,2021-04-27,000001,Vente,17024.42,,,LANDE DE MUSSON,B251,35660,35145,Langon,35,,,35145000ZW0508,,,,,,,,,,,,,0,,,,,S,sols,,,813,-1.863772,47.717127
2021-612164,2021-04-30,000001,Vente,1000,,,DOMAINE DES ECOTAIS,B176,35660,35145,Langon,35,,,35145000YC0218,,,,,,,,,,,,,0,,,,,L,landes,,,2660,-1.883097,47.729198
2021-612211,2021-05-07,000001,Vente,144000,1,,RUE DE LA ROCHE GUILLAUME,0090,35660,35145,Langon,35,,,35145000ZV0207,,,,,,,,,,,,,0,4,Local industriel. commercial ou assimilé,2630,0,S,sols,,,5136,-1.852478,47.717258
2021-612211,2021-05-07,000001,Vente,144000,,,BREHEIL,B024,35660,35145,Langon,35,,,35145000ZV0218,,,,,,,,,,,,,0,,,,,T,terres,,,160,-1.851369,47.716786
2021-612211,2021-05-07,000001,Vente,144000,,,BREHEIL,B024,35660,35145,Langon,35,,,35145000ZV0219,,,,,,,,,,,,,0,,,,,AB,terrains a bâtir,,,2345,-1.85145,47.717134
2021-612216,2021-05-07,000001,Vente,15000,,,LA VALLEE DE BREHEIL,B354,35660,35145,Langon,35,,,35145000ZV0010,,,,,,,,,,,,,0,,,,,L,landes,,,6100,-1.85304,47.716405
2021-612216,2021-05-07,000001,Vente,15000,,,LA ROCHE GUILLAUME,B325,35660,35145,Langon,35,,,35145000ZV0202,,,,,,,,,,,,,0,,,,,S,sols,,,770,-1.853211,47.716983
2021-612216,2021-05-07,000001,Vente,15000,,,BREHEIL,B024,35660,35145,Langon,35,,,35145000ZV0206,,,,,,,,,,,,,0,,,,,J,jardins,POTAG,Jardin potager,5850,-1.852236,47.716808
2021-612255,2021-05-21,000001,Vente,91000,13,,RADINEUF,B372,35660,35145,Langon,35,,,35145000ZI0076,,,,,,,,,,,,,0,1,Maison,68,3,S,sols,,,90,-1.836737,47.759915
2021-612255,2021-05-21,000001,Vente,91000,13,,RADINEUF,B372,35660,35145,Langon,35,,,35145000ZI0078,,,,,,,,,,,,,0,,,,,S,sols,,,140,-1.836697,47.759829
2021-612255,2021-05-21,000001,Vente,91000,,,COURTIL DE RADINEUF,B078,35660,35145,Langon,35,,,35145000ZI0245,,,,,,,,,,,,,0,,,,,S,sols,,,459,-1.836399,47.759558
2021-612255,2021-05-21,000001,Vente,91000,,,COURTIL DE RADINEUF,B078,35660,35145,Langon,35,,,35145000ZI0246,,,,,,,,,,,,,0,,,,,S,sols,,,217,-1.836308,47.759478
2021-612263,2021-05-19,000001,Vente,168000,,,ROCHER DE CORBINIERES,B327,35660,35145,Langon,35,,,35145000ZI0016,,,,,,,,,,,,,0,,,,,L,landes,,,3549,-1.834921,47.76354
2021-612263,2021-05-19,000001,Vente,168000,7,,ROCHER DE CORBINIERES,B327,35660,35145,Langon,35,,,35145000ZI0019,,,,,,,,,,,,,0,3,Dépendance,,0,S,sols,,,1100,-1.834929,47.764077
2021-612263,2021-05-19,000001,Vente,168000,7,,ROCHER DE CORBINIERES,B327,35660,35145,Langon,35,,,35145000ZI0019,,,,,,,,,,,,,0,1,Maison,106,4,S,sols,,,1100,-1.834929,47.764077
2021-612263,2021-05-19,000001,Vente,168000,,,ROCHER DE CORBINIERES,B327,35660,35145,Langon,35,,,35145000ZI0151,,,,,,,,,,,,,0,,,,,AG,terrains d'agrément,,,1050,-1.835379,47.764039
2021-612263,2021-05-19,000001,Vente,168000,,,ROCHER DE CORBINIERES,B327,35660,35145,Langon,35,,,35145000ZI0157,,,,,,,,,,,,,0,,,,,L,landes,,,1779,-1.835351,47.763443
2021-612263,2021-05-19,000001,Vente,168000,,,ROCHER DE CORBINIERES,B327,35660,35145,Langon,35,,,35145000ZI0234,,,,,,,,,,,,,0,,,,,AG,terrains d'agrément,,,159,-1.835323,47.764206
2021-612263,2021-05-19,000001,Vente,168000,,,SOUS RADINEUF,B346,35660,35145,Langon,35,,,35145000ZI0247,,,,,,,,,,,,,0,,,,,L,landes,,,1130,-1.834426,47.76429
2021-612300,2021-06-09,000001,Vente,35790,29,,BALAC,B007,35660,35145,Langon,35,,,35145000ZC0103,,,,,,,,,,,,,0,1,Maison,66,3,S,sols,,,122,-1.885319,47.736445
2021-612300,2021-06-09,000001,Vente,35790,,,COURTILS DE BALAC,B080,35660,35145,Langon,35,,,35145000ZC0216,,,,,,,,,,,,,0,,,,,T,terres,,,690,,
2021-612448,2021-06-08,000001,Vente,54500,,,LES COURTILS DE BERNUIT,B081,35660,35145,Langon,35,,,35145000YE0189,,,,,,,,,,,,,0,,,,,J,jardins,POTAG,Jardin potager,500,-1.911997,47.722811
2021-612448,2021-06-08,000001,Vente,54500,7,,BERNUIT,B015,35660,35145,Langon,35,,,35145000YE0190,,,,,,,,,,,,,0,,,,,S,sols,,,77,-1.91205,47.722624
2021-612448,2021-06-08,000001,Vente,54500,7,,BERNUIT,B015,35660,35145,Langon,35,,,35145000YE0191,,,,,,,,,,,,,0,1,Maison,84,3,S,sols,,,156,-1.912125,47.722672
2021-612448,2021-06-08,000001,Vente,54500,,,LES COURTILS DE BERNUIT,B081,35660,35145,Langon,35,,,35145000YE0192,,,,,,,,,,,,,0,,,,,L,landes,,,150,-1.912093,47.722783
2021-612448,2021-06-08,000001,Vente,54500,,,LES COURTILS DE BERNUIT,B081,35660,35145,Langon,35,,,35145000YE0193,,,,,,,,,,,,,0,,,,,J,jardins,POTAG,Jardin potager,100,-1.912151,47.722889
2021-612448,2021-06-08,000001,Vente,54500,13,,BERNUIT,B015,35660,35145,Langon,35,,,35145000YE0194,,,,,,,,,,,,,0,,,,,S,sols,,,46,-1.912238,47.7227
2021-612571,2021-06-11,000001,Vente,40000,,,TREAU,B351,35660,35145,Langon,35,,,35145000YA0383,,,,,,,,,,,,,0,,,,,S,sols,,,80,-1.899195,47.714875
2021-612571,2021-06-11,000001,Vente,40000,5377,,TREAU,B351,35660,35145,Langon,35,,,35145000YA0386,,,,,,,,,,,,,0,3,Dépendance,,0,S,sols,,,759,-1.899345,47.715097
2021-612571,2021-06-11,000001,Vente,40000,5377,,TREAU,B351,35660,35145,Langon,35,,,35145000YA0386,,,,,,,,,,,,,0,1,Maison,38,1,S,sols,,,759,-1.899345,47.715097
2021-612571,2021-06-11,000001,Vente,40000,5377,,TREAU,B351,35660,35145,Langon,35,,,35145000YA0386,,,,,,,,,,,,,0,3,Dépendance,,0,S,sols,,,759,-1.899345,47.715097
2021-612571,2021-06-11,000001,Vente,40000,,,DOMAINE DE SOUS TREAU,B166,35660,35145,Langon,35,,,35145000YA0416,,,,,,,,,,,,,0,,,,,L,landes,,,40,-1.89967,47.714773
2021-612571,2021-06-11,000001,Vente,40000,,,DOMAINE DE SOUS TREAU,B166,35660,35145,Langon,35,,,35145000YA0452,,,,,,,,,,,,,0,,,,,T,terres,,,1000,-1.899155,47.715353
2021-612648,2021-06-16,000001,Vente,89000,102,,LA LOUZAIS,B268,35660,35145,Langon,35,,,35145000ZW0098,,,,,,,,,,,,,0,1,Maison,53,2,S,sols,,,218,-1.866298,47.709824
2021-612648,2021-06-16,000001,Vente,89000,102,,LA LOUZAIS,B268,35660,35145,Langon,35,,,35145000ZW0350,,,,,,,,,,,,,0,,,,,L,landes,,,84,-1.866225,47.709864
2021-612658,2021-07-05,000001,Vente,55000,,,LES PRES DE LA GREE,B314,35660,35145,Langon,35,,,35145000ZS0150,,,,,,,,,,,,,0,,,,,BR,futaies résineuses,,,50,-1.86687,47.723162
2021-612658,2021-07-05,000001,Vente,55000,42,,MUSSON,B280,35660,35145,Langon,35,,,35145000ZW0016,,,,,,,,,,,,,0,1,Maison,98,5,S,sols,,,233,-1.859748,47.714113
2021-612658,2021-07-05,000001,Vente,55000,42,,MUSSON,B280,35660,35145,Langon,35,,,35145000ZW0017,,,,,,,,,,,,,0,,,,,S,sols,,,251,-1.859642,47.714125
2021-612658,2021-07-05,000001,Vente,55000,34,,MUSSON,B280,35660,35145,Langon,35,,,35145000ZW0024,,,,,,,,,,,,,0,3,Dépendance,,0,S,sols,,,117,-1.859282,47.713784
2021-612658,2021-07-05,000001,Vente,55000,34,,MUSSON,B280,35660,35145,Langon,35,,,35145000ZW0024,,,,,,,,,,,,,0,3,Dépendance,,0,S,sols,,,117,-1.859282,47.713784
2021-612658,2021-07-05,000001,Vente,55000,,,MUSSON,B280,35660,35145,Langon,35,,,35145000ZW0282,,,,,,,,,,,,,0,,,,,S,sols,,,599,-1.860137,47.713996
2021-612658,2021-07-05,000001,Vente,55000,,,LE REAGE DU FOUR,B320,35660,35145,Langon,35,,,35145000ZW0283,,,,,,,,,,,,,0,,,,,T,terres,,,2080,-1.860208,47.714368
2021-612750,2021-07-12,000001,Vente,141952,,,DOMAINE DE LA MORINAIS,B148,35660,35145,Langon,35,,,35145000ZY0160,,,,,,,,,,,,,0,,,,,J,jardins,POTAG,Jardin potager,780,-1.879732,47.714175
2021-612750,2021-07-12,000001,Vente,141952,14,,LA MORINAIS,B276,35660,35145,Langon,35,,,35145000ZY0177,,,,,,,,,,,,,0,3,Dépendance,,0,S,sols,,,180,-1.879392,47.714404
2021-612750,2021-07-12,000001,Vente,141952,14,,LA MORINAIS,B276,35660,35145,Langon,35,,,35145000ZY0177,,,,,,,,,,,,,0,1,Maison,120,5,S,sols,,,180,-1.879392,47.714404
2021-612750,2021-07-12,000001,Vente,141952,14,,LA MORINAIS,B276,35660,35145,Langon,35,,,35145000ZY0178,,,,,,,,,,,,,0,,,,,S,sols,,,185,-1.879424,47.714656
2021-612750,2021-07-12,000001,Vente,141952,14,,LA MORINAIS,B276,35660,35145,Langon,35,,,35145000ZY0181,,,,,,,,,,,,,0,,,,,S,sols,,,80,-1.879491,47.714687
2021-612750,2021-07-12,000001,Vente,141952,,,LA MORINAIS,B276,35660,35145,Langon,35,,,35145000ZY0182,,,,,,,,,,,,,0,,,,,J,jardins,POTAG,Jardin potager,200,-1.879503,47.714474
2021-612855,2021-07-16,000001,Vente,190000,11,,LA GARE,B209,35660,35145,Langon,35,,,35145000ZR0229,,,,,,,,,,,,,0,3,Dépendance,,0,S,sols,,,723,-1.852066,47.729477
2021-612855,2021-07-16,000001,Vente,190000,11,,LA GARE,B209,35660,35145,Langon,35,,,35145000ZR0229,,,,,,,,,,,,,0,4,Local industriel. commercial ou assimilé,72,0,S,sols,,,723,-1.852066,47.729477
2021-612855,2021-07-16,000001,Vente,190000,11,,LA GARE,B209,35660,35145,Langon,35,,,35145000ZR0229,,,,,,,,,,,,,0,1,Maison,256,10,S,sols,,,723,-1.852066,47.729477
2021-612882,2021-07-28,000001,Vente,500,,,DOMAINE DES HIARDS,B177,35660,35145,Langon,35,,,35145000YD0295,,,,,,,,,,,,,0,,,,,P,prés,MARAI,Pré marais,5100,-1.892914,47.723508
2021-612891,2021-07-30,000001,Vente,230000,,,LES COURTILS DE LA CHAPRON,B085,35660,35145,Langon,35,,,35145000YD0114,,,,,,,,,,,,,0,,,,,S,sols,,,30,-1.898429,47.72202
2021-612891,2021-07-30,000001,Vente,230000,6100,,LA CHAPRONAIS,B037,35660,35145,Langon,35,,,35145000YD0115,,,,,,,,,,,,,0,3,Dépendance,,0,S,sols,,,88,-1.898479,47.722024
2021-612891,2021-07-30,000001,Vente,230000,6100,,LA CHAPRONAIS,B037,35660,35145,Langon,35,,,35145000YD0115,,,,,,,,,,,,,0,3,Dépendance,,0,S,sols,,,88,-1.898479,47.722024
2021-612891,2021-07-30,000001,Vente,230000,6100,,LA CHAPRONAIS,B037,35660,35145,Langon,35,,,35145000YD0115,,,,,,,,,,,,,0,3,Dépendance,,0,S,sols,,,88,-1.898479,47.722024
2021-612891,2021-07-30,000001,Vente,230000,,,LES COURTILS DE LA CHAPRON,B085,35660,35145,Langon,35,,,35145000YD0116,,,,,,,,,,,,,0,,,,,L,landes,,,80,-1.898582,47.72203
2021-612891,2021-07-30,000001,Vente,230000,15,,LA CHAPRONAIS,B037,35660,35145,Langon,35,,,35145000YD0117,,,,,,,,,,,,,0,1,Maison,134,8,S,sols,,,94,-1.898643,47.7222
2021-612891,2021-07-30,000001,Vente,230000,15,,LA CHAPRONAIS,B037,35660,35145,Langon,35,,,35145000YD0117,,,,,,,,,,,,,0,3,Dépendance,,0,S,sols,,,94,-1.898643,47.7222
2021-612891,2021-07-30,000001,Vente,230000,15,,LA CHAPRONAIS,B037,35660,35145,Langon,35,,,35145000YD0118,,,,,,,,,,,,,0,,,,,S,sols,,,620,-1.898664,47.722243