id_mutation,date_mutation,numero_disposition,nature_mutation,valeur_fonciere,adresse_numero,adresse_suffixe,adresse_nom_voie,adresse_code_voie,code_postal,code_commune,nom_commune,code_departement,ancien_code_commune,ancien_nom_commune,id_parcelle,ancien_id_parcelle,numero_volume,lot1_numero,lot1_surface_carrez,lot2_numero,lot2_surface_carrez,lot3_numero,lot3_surface_carrez,lot4_numero,lot4_surface_carrez,lot5_numero,lot5_surface_carrez,nombre_lots,code_type_local,type_local,surface_reelle_bati,nombre_pieces_principales,code_nature_culture,nature_culture,code_nature_culture_speciale,nature_culture_speciale,surface_terrain,longitude,latitude
2021-601808,2021-01-05,000001,Vente,377000,10,,RUE DE LA BERGERIE,1455,35340,35152,Liffré,35,,,35152000AZ0386,,,,,,,,,,,,,0,1,Maison,144,7,S,sols,,,430,-1.491967,48.218679
2021-601809,2021-01-06,000001,Vente en l'état futur d'achèvement,121500,,,LOT LES ALLEES DE BELLANTON,A019,35340,35152,Liffré,35,,,35152000BL0564,,,30,,,,,,,,,,1,,,,,,,,,,-1.520471,48.209745
2021-601809,2021-01-06,000001,Vente en l'état futur d'achèvement,121500,,,LOT LES ALLEES DE BELLANTON,A019,35340,35152,Liffré,35,,,35152000BL0564,,,10,,,,,,,,,,1,,,,,,,,,,-1.520471,48.209745
2021-601809,2021-01-06,000001,Vente en l'état futur d'achèvement,121500,,,LOT LES ALLEES DE BELLANTON,A019,35340,35152,Liffré,35,,,35152000BL0564,,,19,,,,,,,,,,1,,,,,,,,,,-1.520471,48.209745
2021-601810,2021-01-05,000001,Vente,57960,21,,RUE DE DUBLIN,0255,35340,35152,Liffré,35,,,35152000BE0875,,,,,,,,,,,,,0,,,,,AB,terrains a bâtir,,,319,-1.498741,48.209509
2021-601810,2021-01-05,000001,Vente,57960,21,,RUE DE DUBLIN,0255,35340,35152,Liffré,35,,,35152000BE0908,,,,,,,,,,,,,0,,,,,AB,terrains a bâtir,,,3,-1.498603,48.209511
2021-601813,2021-01-12,000001,Vente,295000,18,,RUE DE L'OREE DU BOIS,0234,35340,35152,Liffré,35,,,35152000BN0443,,,,,,,,,,,,,0,,,,,AB,terrains a bâtir,,,334,-1.522747,48.203058
2021-601818,2021-01-08,000002,Vente,110000,7,,RUE DE LA QUINTE,0125,35340,35152,Liffré,35,,,35152000BN0469,,,,,,,,,,,,,0,,,,,S,sols,,,447,-1.522891,48.203699
2021-601851,2021-01-06,000001,Vente en l'état futur d'achèvement,110500,,,LOT LES ALLEES DE BELLANTON,A019,35340,35152,Liffré,35,,,35152000BL0564,,,16,,,,,,,,,,1,,,,,,,,,,-1.520471,48.209745
2021-601851,2021-01-06,000001,Vente en l'état futur d'achèvement,110500,,,LOT LES ALLEES DE BELLANTON,A019,35340,35152,Liffré,35,,,35152000BL0564,,,34,,,,,,,,,,1,,,,,,,,,,-1.520471,48.209745
2021-601851,2021-01-06,000001,Vente en l'état futur d'achèvement,110500,,,LOT LES ALLEES DE BELLANTON,A019,35340,35152,Liffré,35,,,35152000BL0564,,,17,,,,,,,,,,1,,,,,,,,,,-1.520471,48.209745
2021-601879,2021-01-08,000001,Vente en l'état futur d'achèvement,268900,,,LOT LES ALLEES DE BELLANTON,A019,35340,35152,Liffré,35,,,35152000BL0544,,,,,,,,,,,,,0,,,,,AB,terrains a bâtir,,,304,-1.520853,48.209955
2021-601922,2021-01-26,000001,Vente en l'état futur d'achèvement,158400,1,,RUE PIERRE ROUZEL,0156,35340,35152,Liffré,35,,,35152000AV0064,,,26,,,,,,,,,,1,,,,,,,,,,-1.514291,48.218321
2021-601932,2021-01-14,000001,Vente,135000,16,,RUE JACQUES CARTIER,0075,35340,35152,Liffré,35,,,35152000BL0124,,,30,,,,,,,,,,1,3,Dépendance,,0,,,,,,-1.511735,48.213036
2021-601932,2021-01-14,000001,Vente,135000,16,,RUE JACQUES CARTIER,0075,35340,35152,Liffré,35,,,35152000BL0124,,,103,46.7,,,,,,,,,1,2,Appartement,46,2,,,,,,-1.511735,48.213036
2021-601934,2021-01-15,000001,Vente,171891.42,2,,RUE KONRAD ADENAUER,1607,35340,35152,Liffré,35,,,35152000BK0276,,,36,,,,,,,,,,1,3,Dépendance,,0,,,,,,-1.506915,48.205579
2021-601934,2021-01-15,000001,Vente,171891.42,2,,RUE KONRAD ADENAUER,1607,35340,35152,Liffré,35,,,35152000BK0276,,,37,,,,,,,,,,1,3,Dépendance,,0,,,,,,-1.506915,48.205579
2021-601934,2021-01-15,000001,Vente,171891.42,2,,RUE KONRAD ADENAUER,1607,35340,35152,Liffré,35,,,35152000BK0276,,,28,,4,,,,,,,,2,2,Appartement,86,4,,,,,,-1.506915,48.205579
2021-601937,2021-01-29,000002,Vente,2130,23,,RUE DE MI-FORET,0117,35340,35152,Liffré,35,,,35152000BP0105,,,,,,,,,,,,,0,,,,,P,prés,,,213,-1.520457,48.187583
2021-601938,2021-01-14,000001,Vente,104760,5,,RUE DE LUXEMBOURG,0254,35340,35152,Liffré,35,,,35152000BE0687,,,,,,,,,,,,,0,,,,,P,prés,,,11,-1.498836,48.208459
2021-601938,2021-01-14,000001,Vente,104760,5,,RUE DE LUXEMBOURG,0254,35340,35152,Liffré,35,,,35152000BE0810,,,,,,,,,,,,,0,,,,,AB,terrains a bâtir,,,7,-1.498537,48.20844
2021-601938,2021-01-14,000001,Vente,104760,5,,RUE DE LUXEMBOURG,0254,35340,35152,Liffré,35,,,35152000BE0901,,,,,,,,,,,,,0,,,,,AB,terrains a bâtir,,,564,-1.498677,48.208462
2021-601939,2021-01-14,000001,Vente,55080,15,,RUE DE DUBLIN,0255,35340,35152,Liffré,35,,,35152000BE0911,,,,,,,,,,,,,0,,,,,AB,terrains a bâtir,,,306,-1.498457,48.209234
2021-601955,2021-01-18,000001,Vente,67680,7,,RUE DE DUBLIN,0255,35340,35152,Liffré,35,,,35152000BE0817,,,,,,,,,,,,,0,,,,,AB,terrains a bâtir,,,376,-1.497904,48.209019
2021-601958,2021-01-12,000001,Vente,244200,,,LE CLOSET,B578,35340,35152,Liffré,35,,,351520000B1373,,,,,,,,,,,,,0,,,,,P,prés,,,4534,-1.494953,48.210678
2021-601958,2021-01-12,000001,Vente,244200,5608,,LE PANLOUP,C016,35340,35152,Liffré,35,,,35152000BE0175,,,,,,,,,,,,,0,1,Maison,95,3,S,sols,,,252,-1.495812,48.210506
2021-601958,2021-01-12,000001,Vente,244200,,,LE PANLOUP,C016,35340,35152,Liffré,35,,,35152000BE0933,,,,,,,,,,,,,0,,,,,J,jardins,POTAG,Jardin potager,530,-1.495694,48.210272
2021-601987,2021-01-27,000001,Vente,52500,7,,RUE DE ZAGREB,0251,35340,35152,Liffré,35,,,35152000BE0694,,,,,,,,,,,,,0,,,,,AB,terrains a bâtir,,,272,-1.49792,48.207474
2021-601987,2021-01-27,000001,Vente,52500,7,,RUE DE ZAGREB,0251,35340,35152,Liffré,35,,,35152000BE0711,,,,,,,,,,,,,0,,,,,AB,terrains a bâtir,,,28,-1.497744,48.207534
2021-601995,2021-01-20,000001,Vente en l'état futur d'achèvement,163000,,,LOT LES ALLEES DE BELLANTON,A019,35340,35152,Liffré,35,,,35152000BL0564,,,7,,,,,,,,,,1,,,,,,,,,,-1.520471,48.209745
2021-601995,2021-01-20,000001,Vente en l'état futur d'achèvement,163000,,,LOT LES ALLEES DE BELLANTON,A019,35340,35152,Liffré,35,,,35152000BL0564,,,24,,,,,,,,,,1,,,,,,,,,,-1.520471,48.209745
2021-601995,2021-01-20,000001,Vente en l'état futur d'achèvement,163000,,,LOT LES ALLEES DE BELLANTON,A019,35340,35152,Liffré,35,,,35152000BL0564,,,27,,,,,,,,,,1,,,,,,,,,,-1.520471,48.209745
2021-601995,2021-01-20,000001,Vente en l'état futur d'achèvement,163000,,,LOT LES ALLEES DE BELLANTON,A019,35340,35152,Liffré,35,,,35152000BL0564,,,8,,,,,,,,,,1,,,,,,,,,,-1.520471,48.209745
2021-602001,2021-01-27,000001,Vente en l'état futur d'achèvement,121683,1,,RUE PIERRE ROUZEL,0156,35340,35152,Liffré,35,,,35152000AV0064,,,27,,,,,,,,,,1,,,,,,,,,,-1.514291,48.218321
2021-602001,2021-01-27,000001,Vente en l'état futur d'achèvement,121683,1,,RUE PIERRE ROUZEL,0156,35340,35152,Liffré,35,,,35152000AV0064,,,22,,,,,,,,,,1,,,,,,,,,,-1.514291,48.218321
2021-602056,2021-01-15,000001,Vente,350000,14,,RUE PIERRE ET MARIE CURIE,0100,35340,35152,Liffré,35,,,35152000BE0009,,,,,,,,,,,,,0,1,Maison,140,5,S,sols,,,770,-1.502441,48.212664
2021-602057,2021-01-28,000001,Vente,367000,17,,RUE MARGUERITE DURAS,1510,35340,35152,Liffré,35,,,35152000BK0153,,,,,,,,,,,,,0,1,Maison,169,7,S,sols,,,619,-1.510396,48.203941
2021-602063,2021-01-29,000001,Vente,360000,5,,RUE LOUIS FORTON,0224,35340,35152,Liffré,35,,,35152000AZ0389,,,,,,,,,,,,,0,1,Maison,144,6,S,sols,,,117,-1.491511,48.218105
2021-602063,2021-01-29,000001,Vente,360000,5,,RUE LOUIS FORTON,0224,35340,35152,Liffré,35,,,35152000AZ0398,,,,,,,,,,,,,0,,,,,S,sols,,,287,-1.491531,48.218057
2021-602085,2021-02-02,000001,Vente,110000,9,,RUE LA FONTAINE,0065,35340,35152,Liffré,35,,,35152000BB0187,,,,,,,,,,,,,0,4,Local industriel. commercial ou assimilé,270,0,S,sols,,,529,-1.507306,48.216808
2021-602100,2021-01-22,000001,Vente,59400,11,,RUE DE DUBLIN,0255,35340,35152,Liffré,35,,,35152000BE0815,,,,,,,,,,,,,0,,,,,AB,terrains a bâtir,,,95,-1.498191,48.209044
2021-602100,2021-01-22,000001,Vente,59400,11,,RUE DE DUBLIN,0255,35340,35152,Liffré,35,,,35152000BE0913,,,,,,,,,,,,,0,,,,,AB,terrains a bâtir,,,235,-1.498231,48.209086
2021-602127,2021-02-06,000001,Vente,379000,2,,RUE MORRIS,0220,35340,35152,Liffré,35,,,35152000AZ0407,,,,,,,,,,,,,0,1,Maison,135,6,S,sols,,,446,,
2021-602165,2021-01-29,000001,Vente,950000,6834,,RUE EDME MARIOTTE,0127,35340,35152,Liffré,35,,,35152000AX0070,,,,,,,,,,,,,0,4,Local industriel. commercial ou assimilé,2291,0,S,sols,,,6967,-1.500656,48.226289
2021-602184,2021-01-29,000001,Vente,2148000,9000,,CHEM DE LA GRANDE LANDE,B453,35340,35152,Liffré,35,,,35152000AY0290,,,,,,,,,,,,,0,4,Local industriel. commercial ou assimilé,1985,0,AB,terrains a bâtir,,,6437,-1.493254,48.224198
2021-602187,2021-01-29,000001,Vente,453000,37,,RUE DE FOUGERES,0069,35340,35152,Liffré,35,,,35152000BD0092,,,,,,,,,,,,,0,1,Maison,150,5,S,sols,,,351,-1.502771,48.215242
2021-602187,2021-01-29,000001,Vente,453000,37,,RUE DE FOUGERES,0069,35340,35152,Liffré,35,,,35152000BD0093,,,,,,,,,,,,,0,,,,,AG,terrains d'agrément,,,417,-1.502587,48.215131
2021-602188,2021-01-26,000001,Vente,242000,3,,ALL ALFRED SISLEY,0016,35340,35152,Liffré,35,,,35152000BM0234,,,,,,,,,,,,,0,1,Maison,96,5,S,sols,,,559,-1.518205,48.207046
2021-602192,2021-01-26,000001,Vente,54950,5,,RUE DE PRAGUE,0247,35340,35152,Liffré,35,,,35152000BE0750,,,,,,,,,,,,,0,,,,,AB,terrains a bâtir,,,314,-1.497495,48.206759
2021-602234,2021-02-17,000001,Vente,255000,6693,,RUE AMPERE,0017,35340,35152,Liffré,35,,,35152000BA0002,,,,,,,,,,,,,0,4,Local industriel. commercial ou assimilé,350,0,S,sols,,,1837,-1.50623,48.217591
2021-602244,2021-01-20,000001,Vente,102080,6,,IMP DES CARLINES,0279,35340,35152,Liffré,35,,,35152000BL0581,,,,,,,,,,,,,0,,,,,AG,terrains d'agrément,,,464,-1.513787,48.211844
2021-602245,2021-01-20,000001,Vente,106050,10,,IMP DES CARLINES,0279,35340,35152,Liffré,35,,,35152000BL0579,,,,,,,,,,,,,0,,,,,AG,terrains d'agrément,,,505,-1.513661,48.211581
2021-602308,2021-02-05,000001,Vente,61200,2,,RUE DE LUXEMBOURG,0254,35340,35152,Liffré,35,,,35152000BE0814,,,,,,,,,,,,,0,,,,,AB,terrains a bâtir,,,340,-1.498175,48.208613
2021-602318,2021-02-08,000001,Vente,1,,,LANDE DE BEAUGE,B883,35340,35152,Liffré,35,,,35152000AE0318,,,,,,,,,,,,,0,,,,,L,landes,,,2554,-1.486997,48.22428
2021-602318,2021-02-08,000001,Vente,1,,,BEAUGE,B124,35340,35152,Liffré,35,,,35152000AY0032,,,,,,,,,,,,,0,,,,,S,sols,,,369,-1.489278,48.222958
2021-602319,2021-02-09,000001,Vente,290270,5441,,LA HAUTE PLARDAIS,B820,35340,35152,Liffré,35,,,351520000D0576,,,,,,,,,,,,,0,1,Maison,110,3,S,sols,,,349,-1.414954,48.205542
2021-602319,2021-02-09,000001,Vente,290270,5441,,LA HAUTE PLARDAIS,B820,35340,35152,Liffré,35,,,351520000D0576,,,,,,,,,,,,,0,1,Maison,110,3,P,prés,,,841,-1.414954,48.205542
2021-602319,2021-02-09,000001,Vente,290270,,,LA HAUTE PLARDAIS,B820,35340,35152,Liffré,35,,,351520000D0955,,,,,,,,,,,,,0,,,,,P,prés,,,2640,-1.414654,48.206051
2021-602319,2021-02-09,000001,Vente,290270,,,LA HAUTE PLARDAIS,B820,35340,35152,Liffré,35,,,351520000D0960,,,,,,,,,,,,,0,,,,,L,landes,,,89,-1.414699,48.205419
2021-602320,2021-02-04,000001,Vente,80000,20,,RUE DE DUBLIN,0255,35340,35152,Liffré,35,,,35152000BE0878,,,,,,,,,,,,,0,,,,,AB,terrains a bâtir,,,415,-1.498659,48.209842
2021-602373,2021-02-22,000001,Vente,338500,,,LA RICHELAIS,C316,35340,35152,Liffré,35,,,351520000D0174,,,,,,,,,,,,,0,,,,,VE,vergers,CIDRE,Cidre,940,-1.4578,48.213302
2021-602373,2021-02-22,000001,Vente,338500,5463,,LA RICHELAIS,C316,35340,35152,Liffré,35,,,351520000D0175,,,,,,,,,,,,,0,1,Maison,83,3,S,sols,,,300,-1.457616,48.213644
2021-602373,2021-02-22,000001,Vente,338500,,,LA RICHELAIS,C316,35340,35152,Liffré,35,,,351520000D0176,,,,,,,,,,,,,0,,,,,S,sols,,,520,-1.457496,48.213596
2021-602405,2021-02-12,000001,Vente,454570.5,22,,RUE DE LA BRETONNIERE,0035,35340,35152,Liffré,35,,,35152000BL0017,,,,,,,,,,,,,0,1,Maison,80,5,S,sols,,,946,-1.517934,48.211712
2021-602405,2021-02-12,000001,Vente,454570.5,20,,RUE DE LA BRETONNIERE,0035,35340,35152,Liffré,35,,,35152000BL0018,,,,,,,,,,,,,0,1,Maison,104,5,S,sols,,,920,-1.517736,48.211604
2021-602415,2021-02-11,000001,Vente,56525,12,,RUE DU BROU,0242,35340,35152,Liffré,35,,,35152000AY0176,,,,,,,,,,,,,0,,,,,S,sols,,,18,-1.490912,48.219433
2021-602415,2021-02-11,000001,Vente,56525,12,,RUE DU BROU,0242,35340,35152,Liffré,35,,,35152000AY0244,,,,,,,,,,,,,0,,,,,AB,terrains a bâtir,,,305,-1.490994,48.219463
2021-602417,2021-02-11,000001,Vente,59760,4,,RUE DE DUBLIN,0255,35340,35152,Liffré,35,,,35152000BE0838,,,,,,,,,,,,,0,,,,,AB,terrains a bâtir,,,332,-1.497414,48.209135
2021-602418,2021-02-11,000001,Vente,57420,17,,RUE DE DUBLIN,0255,35340,35152,Liffré,35,,,35152000BE0877,,,,,,,,,,,,,0,,,,,AB,terrains a bâtir,,,23,-1.498734,48.209304
2021-602418,2021-02-11,000001,Vente,57420,17,,RUE DE DUBLIN,0255,35340,35152,Liffré,35,,,35152000BE0910,,,,,,,,,,,,,0,,,,,AB,terrains a bâtir,,,296,-1.498617,48.209296
2021-602423,2021-02-09,000001,Echange,160,,,LANDE DE BEAUGE,B883,35340,35152,Liffré,35,,,35152000AB0311,,,,,,,,,,,,,0,,,,,S,sols,,,415,-1.523708,48.23791
2021-602424,2021-02-09,000002,Echange,200,,,LA LANDE RAGOT,B917,35340,35152,Liffré,35,,,35152000AB0234,,,,,,,,,,,,,0,,,,,T,terres,,,86,-1.524911,48.238939
2021-602424,2021-02-09,000002,Echange,200,,,LANDE DE BEAUGE,B883,35340,35152,Liffré,35,,,35152000AB0312,,,,,,,,,,,,,0,,,,,P,prés,,,196,-1.52372,48.238618
2021-602424,2021-02-09,000002,Echange,200,,,L ENCLOS DE GILETTE,B657,35340,35152,Liffré,35,,,35152000AB0316,,,,,,,,,,,,,0,,,,,T,terres,,,18,-1.524986,48.23888
2021-602424,2021-02-09,000002,Echange,200,,,LA LANDE RAGOT,B917,35340,35152,Liffré,35,,,35152000AB0319,,,,,,,,,,,,,0,,,,,T,terres,,,45,-1.524881,48.238969
2021-602424,2021-02-09,000002,Echange,200,,,LA LANDE RAGOT,B917,35340,35152,Liffré,35,,,35152000AB0320,,,,,,,,,,,,,0,,,,,T,terres,,,157,-1.524482,48.238948
2021-602520,2021-02-25,000001,Vente,160000,36,,RUE DE RENNES,0120,35340,35152,Liffré,35,,,35152000BB0057,,,3,,8,,,,,,,,2,2,Appartement,55,3,,,,,,-1.508599,48.213982
2021-602520,2021-02-25,000001,Vente,160000,36,,RUE DE RENNES,0120,35340,35152,Liffré,35,,,35152000BB0057,,,6,,,,,,,,,,1,3,Dépendance,,0,,,,,,-1.508599,48.213982
2021-602539,2021-02-17,000001,Vente,130000,18,,RUE DE RENNES,0120,35340,35152,Liffré,35,,,35152000BB0077,,,3,,,,,,,,,,1,4,Local industriel. commercial ou assimilé,63,0,,,,,,-1.507353,48.214281
2021-602544,2021-02-18,000001,Vente,81000,17,,RUE DE LUXEMBOURG,0254,35340,35152,Liffré,35,,,35152000BE0857,,,,,,,,,,,,,0,,,,,AB,terrains a bâtir,,,450,-1.499446,48.209042
2021-602547,2021-01-29,000001,Vente,135000,1,B,RUE JEAN BART,0027,35340,35152,Liffré,35,,,35152000BL0124,,,7,,,,,,,,,,1,3,Dépendance,,0,,,,,,-1.511735,48.213036
2021-602547,2021-01-29,000001,Vente,135000,1,B,RUE JEAN BART,0027,35340,35152,Liffré,35,,,35152000BL0124,,,58,47.35,,,,,,,,,1,2,Appartement,47,2,,,,,,-1.511735,48.213036
2021-602548,2021-02-17,000001,Vente,51625,4,,RUE DE PRAGUE,0247,35340,35152,Liffré,35,,,35152000BE0754,,,,,,,,,,,,,0,,,,,AB,terrains a bâtir,,,295,-1.497933,48.206677
2021-602556,2021-02-12,000001,Vente,302050,17,,RUE DU GALLO,0238,35340,35152,Liffré,35,,,35152000AY0142,,,,,,,,,,,,,0,1,Maison,113,5,S,sols,,,305,-1.49018,48.220609
2021-602653,2021-02-26,000001,Vente,105380,4,,IMP DES CARLINES,0279,35340,35152,Liffré,35,,,35152000BL0582,,,,,,,,,,,,,0,,,,,AG,terrains d'agrément,,,479,-1.513659,48.211943
2021-602675,2021-02-19,000001,Vente,65340,14,,RUE DE DUBLIN,0255,35340,35152,Liffré,35,,,35152000BE0916,,,,,,,,,,,,,0,,,,,AB,terrains a bâtir,,,363,-1.498284,48.209466
2021-602680,2021-02-18,000001,Vente en l'état futur d'achèvement,204753,3,,PL WENDOVER,0211,35340,35152,Liffré,35,,,35152000BD0170,,,73,,,,,,,,,,1,,,,,,,,,,-1.503592,48.21397
2021-602680,2021-02-18,000001,Vente en l'état futur d'achèvement,204753,3,,PL WENDOVER,0211,35340,35152,Liffré,35,,,35152000BD0170,,,33,,,,,,,,,,1,,,,,,,,,,-1.503592,48.21397
2021-602780,2021-02-23,000001,Vente,604800,,,AFFEAGEMENT DE L ARIANCON,B015,35340,35152,Liffré,35,,,35152000BM0503,,,,,,,,,,,,,0,,,,,AB,terrains a bâtir,,,275,-1.520756,48.207966
2021-602780,2021-02-23,000001,Vente,604800,,,AFFEAGEMENT DE L ARIANCON,B015,35340,35152,Liffré,35,,,35152000BM0504,,,,,,,,,,,,,0,,,,,AB,terrains a bâtir,,,164,-1.520924,48.20787
2021-602780,2021-02-23,000001,Vente,604800,,,AFFEAGEMENT DE L ARIANCON,B015,35340,35152,Liffré,35,,,35152000BM0505,,,,,,,,,,,,,0,,,,,AB,terrains a bâtir,,,106,-1.521001,48.207772
2021-602780,2021-02-23,000001,Vente,604800,,,AFFEAGEMENT DE L ARIANCON,B015,35340,35152,Liffré,35,,,35152000BM0506,,,,,,,,,,,,,0,,,,,AB,terrains a bâtir,,,32,-1.521087,48.207695
2021-602780,2021-02-23,000001,Vente,604800,,,AFFEAGEMENT DE L ARIANCON,B015,35340,35152,Liffré,35,,,35152000BM0507,,,,,,,,,,,,,0,,,,,AB,terrains a bâtir,,,458,-1.520963,48.207556
2021-602780,2021-02-23,000001,Vente,604800,,,AFFEAGEMENT DE L ARIANCON,B015,35340,35152,Liffré,35,,,35152000BM0508,,,,,,,,,,,,,0,,,,,AB,terrains a bâtir,,,507,-1.520693,48.207633
2021-602780,2021-02-23,000001,Vente,604800,,,AFFEAGEMENT DE L ARIANCON,B015,35340,35152,Liffré,35,,,35152000BM0509,,,,,,,,,,,,,0,,,,,AB,terrains a bâtir,,,432,-1.520638,48.207717
2021-602780,2021-02-23,000001,Vente,604800,,,AFFEAGEMENT DE L ARIANCON,B015,35340,35152,Liffré,35,,,35152000BM0510,,,,,,,,,,,,,0,,,,,AB,terrains a bâtir,,,358,-1.520571,48.20785
2021-602780,2021-02-23,000001,Vente,604800,,,AFFEAGEMENT DE L ARIANCON,B015,35340,35152,Liffré,35,,,35152000BM0511,,,,,,,,,,,,,0,,,,,S,sols,,,329,-1.520818,48.20782
2021-602780,2021-02-23,000001,Vente,604800,,,LA RABINE,C309,35340,35152,Liffré,35,,,35152000BM0512,,,,,,,,,,,,,0,,,,,AB,terrains a bâtir,,,413,-1.521526,48.207877
2021-602780,2021-02-23,000001,Vente,604800,,,LA RABINE,C309,35340,35152,Liffré,35,,,35152000BM0513,,,,,,,,,,,,,0,,,,,AB,terrains a bâtir,,,447,-1.521429,48.207991
2021-602780,2021-02-23,000001,Vente,604800,,,LA RABINE,C309,35340,35152,Liffré,35,,,35152000BM0514,,,,,,,,,,,,,0,,,,,AB,terrains a bâtir,,,449,-1.52126,48.208106
2021-602780,2021-02-23,000001,Vente,604800,,,LA RABINE,C309,35340,35152,Liffré,35,,,35152000BM0515,,,,,,,,,,,,,0,,,,,AB,terrains a bâtir,,,456,-1.521121,48.208201
2021-602780,2021-02-23,000001,Vente,604800,,,LA RABINE,C309,35340,35152,Liffré,35,,,35152000BM0516,,,,,,,,,,,,,0,,,,,AB,terrains a bâtir,,,155,-1.520983,48.208081
2021-602780,2021-02-23,000001,Vente,604800,,,LA RABINE,C309,35340,35152,Liffré,35,,,35152000BM0517,,,,,,,,,,,,,0,,,,,AB,terrains a bâtir,,,196,-1.52108,48.207967
2021-602780,2021-02-23,000001,Vente,604800,,,LA RABINE,C309,35340,35152,Liffré,35,,,35152000BM0518,,,,,,,,,,,,,0,,,,,AB,terrains a bâtir,,,270,-1.521165,48.207861
2021-602780,2021-02-23,000001,Vente,604800,,,LA RABINE,C309,35340,35152,Liffré,35,,,35152000BM0519,,,,,,,,,,,,,0,,,,,AB,terrains a bâtir,,,353,-1.521249,48.207719
2021-602780,2021-02-23,000001,Vente,604800,,,LA RABINE,C309,35340,35152,Liffré,35,,,35152000BM0520,,,,,,,,,,,,,0,,,,,S,sols,,,12,-1.521163,48.207642
2021-602788,2021-02-24,000001,Vente,66240,9,,RUE DE LUXEMBOURG,0254,35340,35152,Liffré,35,,,35152000BE0861,,,,,,,,,,,,,0,,,,,AB,terrains a bâtir,,,1,-1.499061,48.208642
2021-602788,2021-02-24,000001,Vente,66240,9,,RUE DE LUXEMBOURG,0254,35340,35152,Liffré,35,,,35152000BE0899,,,,,,,,,,,,,0,,,,,AB,terrains a bâtir,,,367,-1.498923,48.208652
2021-602790,2021-02-26,000001,Vente,72180,13,,RUE DE LUXEMBOURG,0254,35340,35152,Liffré,35,,,35152000BE0859,,,,,,,,,,,,,0,,,,,AB,terrains a bâtir,,,380,-1.49907,48.208833
2021-602790,2021-02-26,000001,Vente,72180,13,,RUE DE LUXEMBOURG,0254,35340,35152,Liffré,35,,,35152000BE0897,,,,,,,,,,,,,0,,,,,AB,terrains a bâtir,,,21,-1.49892,48.208873
2021-602792,2021-02-25,000001,Vente en l'état futur d'achèvement,197966,3,,PL WENDOVER,0211,35340,35152,Liffré,35,,,35152000BD0170,,,9,,,,,,,,,,1,,,,,,,,,,-1.503592,48.21397
2021-602792,2021-02-25,000001,Vente en l'état futur d'achèvement,197966,3,,PL WENDOVER,0211,35340,35152,Liffré,35,,,35152000BD0170,,,56,,,,,,,,,,1,,,,,,,,,,-1.503592,48.21397
2021-602798,2021-02-25,000001,Vente,3600,6487,,LE BOUC COURONNE,B161,35340,35152,Liffré,35,,,35152000AX0001,,,,,,,,,,,,,0,3,Dépendance,,0,AG,terrains d'agrément,,,1500,-1.510361,48.235092
2021-602798,2021-02-25,000001,Vente,3600,6487,,LE BOUC COURONNE,B161,35340,35152,Liffré,35,,,35152000AX0001,,,,,,,,,,,,,0,3,Dépendance,,0,S,sols,,,1000,-1.510361,48.235092
2021-602821,2021-03-04,000001,Vente,74340,18,,RUE DE DUBLIN,0255,35340,35152,Liffré,35,,,35152000BE0879,,,,,,,,,,,,,0,,,,,AB,terrains a bâtir,,,253,-1.49855,48.209717
2021-602821,2021-03-04,000001,Vente,74340,18,,RUE DE DUBLIN,0255,35340,35152,Liffré,35,,,35152000BE0914,,,,,,,,,,,,,0,,,,,AB,terrains a bâtir,,,160,-1.498457,48.209699
2021-602827,2021-03-04,000001,Vente en l'état futur d'achèvement,192300,3,,PL WENDOVER,0211,35340,35152,Liffré,35,,,35152000BD0170,,,15,,,,,,,,,,1,,,,,,,,,,-1.503592,48.21397
2021-602827,2021-03-04,000001,Vente en l'état futur d'achèvement,192300,3,,PL WENDOVER,0211,35340,35152,Liffré,35,,,35152000BD0170,,,63,,,,,,,,,,1,,,,,,,,,,-1.503592,48.21397
2021-602830,2021-03-10,000001,Vente en l'état futur d'achèvement,167830,3,,PL WENDOVER,0211,35340,35152,Liffré,35,,,35152000BD0170,,,85,,,,,,,,,,1,,,,,,,,,,-1.503592,48.21397
2021-602830,2021-03-10,000001,Vente en l'état futur d'achèvement,167830,3,,PL WENDOVER,0211,35340,35152,Liffré,35,,,35152000BD0170,,,83,,,,,,,,,,1,,,,,,,,,,-1.503592,48.21397
2021-602833,2021-03-10,000001,Vente en l'état futur d'achèvement,184981,3,,PL WENDOVER,0211,35340,35152,Liffré,35,,,35152000BD0170,,,66,,,,,,,,,,1,,,,,,,,,,-1.503592,48.21397
2021-602833,2021-03-10,000001,Vente en l'état futur d'achèvement,184981,3,,PL WENDOVER,0211,35340,35152,Liffré,35,,,35152000BD0170,,,21,,,,,,,,,,1,,,,,,,,,,-1.503592,48.21397
2021-602847,2021-03-15,000001,Vente,112640,8,,IMP DES CARLINES,0279,35340,35152,Liffré,35,,,35152000BL0580,,,,,,,,,,,,,0,,,,,AG,terrains d'agrément,,,512,-1.513889,48.211707
2021-602916,2021-03-11,000001,Vente,55260,3,,RUE DE DUBLIN,0255,35340,35152,Liffré,35,,,35152000BE0835,,,,,,,,,,,,,0,,,,,AB,terrains a bâtir,,,307,-1.497518,48.208916
2021-602925,2021-03-12,000001,Vente,125000,5412,,LA BAILLEE BRAGARD,B047,35340,35152,Liffré,35,,,35152000AD0079,,,,,,,,,,,,,0,1,Maison,59,2,S,sols,,,712,-1.485591,48.239235
2021-602925,2021-03-12,000001,Vente,125000,,,LA BAILLEE BRAGARD,B047,35340,35152,Liffré,35,,,35152000AD0080,,,,,,,,,,,,,0,,,,,S,sols,,,85,-1.485669,48.239348
2021-602925,2021-03-12,000001,Vente,125000,,,LA BAILLEE BRAGARD,B047,35340,35152,Liffré,35,,,35152000AD0080,,,,,,,,,,,,,0,,,,,P,prés,,,1019,-1.485669,48.239348
2021-602976,2021-03-19,000001,Vente,293000,5814,,LES HAMARDIERES,B813,35340,35152,Liffré,35,,,35152000BN0355,,,,,,,,,,,,,0,1,Maison,78,3,S,sols,,,342,-1.517238,48.196114
2021-602976,2021-03-19,000001,Vente,293000,,,CHAMP DE LA CROIX,B261,35340,35152,Liffré,35,,,35152000BN0470,,,,,,,,,,,,,0,,,,,T,terres,,,1674,-1.517244,48.196155
2021-603033,2021-03-25,000001,Vente,56780,27,,RUE DE DUBLIN,0255,35340,35152,Liffré,35,,,35152000BE0872,,,,,,,,,,,,,0,,,,,AB,terrains a bâtir,,,334,-1.499014,48.209802
2021-603035,2021-03-24,000001,Vente,78300,15,,RUE DE LUXEMBOURG,0254,35340,35152,Liffré,35,,,35152000BE0858,,,,,,,,,,,,,0,,,,,AB,terrains a bâtir,,,435,-1.499378,48.208921
2021-603066,2021-03-17,000001,Vente,202000,5690,,LA PRETAIS,C293,35340,35152,Liffré,35,,,351520000E0492,,,,,,,,,,,,,0,1,Maison,112,4,S,sols,,,281,-1.499731,48.202222
2021-603079,2021-03-26,000001,Vente,225000,2,,ALL GEORGES SEURAT,0119,35340,35152,Liffré,35,,,35152000BM0251,,,,,,,,,,,,,0,1,Maison,93,4,S,sols,,,635,-1.516179,48.207705
2021-603098,2021-04-13,000001,Vente,304000,19,B,RUE DE MI-FORET,0117,35340,35152,Liffré,35,,,35152000BP0012,,,,,,,,,,,,,0,1,Maison,107,5,S,sols,,,600,-1.52063,48.187539
2021-603098,2021-04-13,000001,Vente,304000,23,,RUE DE MI-FORET,0117,35340,35152,Liffré,35,,,35152000BP0105,,,,,,,,,,,,,0,,,,,P,prés,,,213,-1.520457,48.187583
2021-603107,2021-03-16,000001,Vente,303950,28,,AV DE LA FORET,0067,35340,35152,Liffré,35,,,35152000BB0289,,,,,,,,,,,,,0,1,Maison,132,6,S,sols,,,931,-1.511795,48.216105