id_mutation,date_mutation,numero_disposition,nature_mutation,valeur_fonciere,adresse_numero,adresse_suffixe,adresse_nom_voie,adresse_code_voie,code_postal,code_commune,nom_commune,code_departement,ancien_code_commune,ancien_nom_commune,id_parcelle,ancien_id_parcelle,numero_volume,lot1_numero,lot1_surface_carrez,lot2_numero,lot2_surface_carrez,lot3_numero,lot3_surface_carrez,lot4_numero,lot4_surface_carrez,lot5_numero,lot5_surface_carrez,nombre_lots,code_type_local,type_local,surface_reelle_bati,nombre_pieces_principales,code_nature_culture,nature_culture,code_nature_culture_speciale,nature_culture_speciale,surface_terrain,longitude,latitude
2021-623514,2021-01-04,000001,Vente,255000,,,L ESSART DE LA GARINE,B104,36800,36051,Chitray,36,,,360510000C0009,,,,,,,,,,,,,0,,,,,BS,taillis sous futaie,,,43520,1.363546,46.655386
2021-623514,2021-01-04,000001,Vente,255000,,,LES FONTAINGERES,B120,36800,36051,Chitray,36,,,360510000C0024,,,,,,,,,,,,,0,,,,,BS,taillis sous futaie,,,21490,1.361903,46.656784
2021-623514,2021-01-04,000001,Vente,255000,,,LA LOGE A BERLET,B151,36800,36051,Chitray,36,,,360510000C0025,,,,,,,,,,,,,0,,,,,BS,taillis sous futaie,,,6447,1.362561,46.654729
2021-623514,2021-01-04,000001,Vente,255000,,,LA BITTERIE,B009,36800,36051,Chitray,36,,,360510000C0033,,,,,,,,,,,,,0,,,,,BS,taillis sous futaie,,,78897,1.357555,46.655349
2021-623514,2021-01-04,000001,Vente,255000,,,LA BITTERIE,B009,36800,36051,Chitray,36,,,360510000C0034,,,,,,,,,,,,,0,,,,,BS,taillis sous futaie,,,6805,1.356523,46.656772
2021-623514,2021-01-04,000001,Vente,255000,,,LES COSSES,B086,36800,36051,Chitray,36,,,360510000C0083,,,,,,,,,,,,,0,,,,,BS,taillis sous futaie,,,14897,1.359246,46.644767
2021-623514,2021-01-04,000001,Vente,255000,,,LE BOIS DES COULEES,B015,36800,36051,Chitray,36,,,360510000C0086,,,,,,,,,,,,,0,,,,,BS,taillis sous futaie,,,144608,1.357577,46.64688
2021-623514,2021-01-04,000001,Vente,255000,,,LE BOIS DES COULEES,B015,36800,36051,Chitray,36,,,360510000C0086,,,,,,,,,,,,,0,,,,,BS,taillis sous futaie,,,144609,1.357577,46.64688
2021-623514,2021-01-04,000001,Vente,255000,,,LE BOIS DES COULEES,B015,36800,36051,Chitray,36,,,360510000C0088,,,,,,,,,,,,,0,,,,,T,terres,,,1249,1.361208,46.650024
2021-623514,2021-01-04,000001,Vente,255000,,,LA GRANDE METAIRIE,B139,36800,36051,Chitray,36,,,360510000C0101,,,,,,,,,,,,,0,,,,,BT,taillis simples,,,226,1.350914,46.644773
2021-623514,2021-01-04,000001,Vente,255000,,,LA GRANDE METAIRIE,B139,36800,36051,Chitray,36,,,360510000C0102,,,,,,,,,,,,,0,,,,,BS,taillis sous futaie,,,13607,1.350295,46.645163
2021-623514,2021-01-04,000001,Vente,255000,,,LE CHAMP MORIN,B066,36800,36051,Chitray,36,,,360510000C0103,,,,,,,,,,,,,0,,,,,T,terres,,,11004,1.348324,46.645052
2021-623514,2021-01-04,000001,Vente,255000,,,LE CHAMP MORIN,B066,36800,36051,Chitray,36,,,360510000C0104,,,,,,,,,,,,,0,,,,,BS,taillis sous futaie,,,1960,1.348753,46.645833
2021-623980,2021-02-08,000001,Vente,500,,,LES BILLETS,B008,36800,36051,Chitray,36,,,360510000C0032,,,,,,,,,,,,,0,,,,,T,terres,,,1430,1.355883,46.653824
2021-625363,2021-05-05,000001,Vente,33000,5057,,LES BERNARDS,B007,36800,36051,Chitray,36,,,360510000C0109,,,,,,,,,,,,,0,1,Maison,80,2,S,sols,,,5207,1.348051,46.64673
2021-625363,2021-05-05,000001,Vente,33000,,,LES BERNARDS,B007,36800,36051,Chitray,36,,,360510000C0111,,,,,,,,,,,,,0,,,,,J,jardins,,,1625,1.347974,46.647158
2021-626084,2021-05-26,000001,Vente,14000,,,LA CROIX BEAUPERE,B093,36800,36051,Chitray,36,,,360510000B0153,,,,,,,,,,,,,0,,,,,T,terres,,,11840,1.350489,46.661659
2021-626084,2021-05-26,000001,Vente,14000,,,LE CHAMP DE L ABEILLE,B044,36800,36051,Chitray,36,,,360510000B0201,,,,,,,,,,,,,0,,,,,P,prés,,,11758,1.335397,46.65295
2021-626084,2021-05-26,000001,Vente,14000,,,LE CHAMP DE L ABEILLE,B044,36800,36051,Chitray,36,,,360510000B0201,,,,,,,,,,,,,0,,,,,E,eaux,ETANG,Etangs,4400,1.335397,46.65295
2021-626505,2021-07-02,000001,Vente,65500,19,,RTE NATIONALE N 151,0040,36800,36051,Chitray,36,,,36051000AB0109,,,,,,,,,,,,,0,1,Maison,80,4,S,sols,,,919,1.357702,46.635804
2021-626505,2021-07-02,000001,Vente,65500,19,,RTE NATIONALE N 151,0040,36800,36051,Chitray,36,,,36051000AB0109,,,,,,,,,,,,,0,3,Dépendance,,0,S,sols,,,919,1.357702,46.635804
2021-626505,2021-07-02,000001,Vente,65500,19,,RTE NATIONALE N 151,0040,36800,36051,Chitray,36,,,36051000AB0109,,,,,,,,,,,,,0,3,Dépendance,,0,S,sols,,,919,1.357702,46.635804
2021-626505,2021-07-02,000001,Vente,65500,,,LE BOURG,B024,36800,36051,Chitray,36,,,36051000AB0110,,,,,,,,,,,,,0,,,,,J,jardins,,,1149,1.357613,46.63569
2021-627466,2021-08-19,000001,Vente,25403,,,LE CHAMP QUIALE,B067,36800,36051,Chitray,36,,,360510000B0254,,,,,,,,,,,,,0,,,,,T,terres,,,5589,1.34062,46.654018
2021-627466,2021-08-19,000001,Vente,25403,,,LE TERRIER GOBERT,B221,36800,36051,Chitray,36,,,360510000B0291,,,,,,,,,,,,,0,,,,,T,terres,,,219,1.326472,46.66644
2021-627466,2021-08-19,000001,Vente,25403,,,LE TERRIER GOBERT,B221,36800,36051,Chitray,36,,,360510000B0292,,,,,,,,,,,,,0,,,,,T,terres,,,20,1.326394,46.666585
2021-627474,2021-08-21,000001,Vente,3500,,,LA CROIX BEAUPERE,B093,36800,36051,Chitray,36,,,360510000B0155,,,,,,,,,,,,,0,,,,,T,terres,,,10900,1.351173,46.660904
2021-627833,2021-08-19,000001,Vente,15500,,,LA BRODIERE,B034,36800,36051,Chitray,36,,,360510000G0111,,,,,,,,,,,,,0,,,,,J,jardins,,,628,1.343743,46.643319
2021-627833,2021-08-19,000001,Vente,15500,,,LA BRODIERE,B034,36800,36051,Chitray,36,,,360510000G0112,,,,,,,,,,,,,0,,,,,S,sols,,,66,1.343983,46.643354
2021-627833,2021-08-19,000001,Vente,15500,,,LA BRODIERE,B034,36800,36051,Chitray,36,,,360510000G0375,,,,,,,,,,,,,0,,,,,S,sols,,,312,1.344058,46.643444
2021-627833,2021-08-19,000001,Vente,15500,7,,RUE DES LILAS,0025,36800,36051,Chitray,36,,,360510000G0386,,,,,,,,,,,,,0,1,Maison,36,2,S,sols,,,106,1.344341,46.643402
2021-629422,2021-11-25,000001,Vente,300,,,LA TRANCHANTE,B227,36800,36051,Chitray,36,,,360510000F0327,,,,,,,,,,,,,0,,,,,BS,taillis sous futaie,,,170,1.353688,46.638443
2021-629422,2021-11-25,000001,Vente,300,,,LA TRANCHANTE,B227,36800,36051,Chitray,36,,,360510000F0328,,,,,,,,,,,,,0,,,,,T,terres,,,240,1.353587,46.638518
2021-629425,2021-11-25,000001,Vente,1200,,,LES BARRES,B005,36800,36051,Chitray,36,,,360510000F0141,,,,,,,,,,,,,0,,,,,T,terres,,,620,1.357683,46.640742
2021-629425,2021-11-25,000001,Vente,1200,,,LES BARRES,B005,36800,36051,Chitray,36,,,360510000F0145,,,,,,,,,,,,,0,,,,,T,terres,,,722,1.356449,46.640384
2021-629425,2021-11-25,000001,Vente,1200,,,LES BARRES,B005,36800,36051,Chitray,36,,,360510000F0146,,,,,,,,,,,,,0,,,,,T,terres,,,1108,1.356321,46.640336
2021-629425,2021-11-25,000001,Vente,1200,,,LES BARRES,B005,36800,36051,Chitray,36,,,360510000F0174,,,,,,,,,,,,,0,,,,,T,terres,,,491,1.359427,46.639328
2021-629425,2021-11-25,000001,Vente,1200,,,LA TRANCHANTE,B227,36800,36051,Chitray,36,,,360510000F0329,,,,,,,,,,,,,0,,,,,BS,taillis sous futaie,,,614,1.353525,46.638259
2021-629526,2021-03-23,000001,Adjudication,15000,1,,RUE DE LA REUILLE,0055,36800,36051,Chitray,36,,,360510000E0174,,,,,,,,,,,,,0,1,Maison,66,4,S,sols,,,286,1.364989,46.640222
2021-629526,2021-03-23,000001,Adjudication,15000,,,LE TERTRE,B224,36800,36051,Chitray,36,,,360510000E0194,,,,,,,,,,,,,0,,,,,J,jardins,,,47,1.364876,46.640268
2021-629526,2021-03-23,000001,Adjudication,15000,,,LE MAT DU TERTRE,B158,36800,36051,Chitray,36,,,360510000F0076,,,,,,,,,,,,,0,,,,,J,jardins,,,320,1.363919,46.640492
2021-629970,2021-12-09,000001,Vente,1000,,,LES GRANDS PRES,B144,36800,36051,Chitray,36,,,360510000G0250,,,,,,,,,,,,,0,,,,,P,prés,,,3133,1.334922,46.641627
2021-630224,2021-12-30,000001,Vente,43500,,,LA FOSSE A GIGOT,B124,36800,36051,Chitray,36,,,360510000B0159,,,,,,,,,,,,,0,,,,,L,landes,,,890,1.352801,46.658326
2021-630224,2021-12-30,000001,Vente,43500,,,LES FONTAINGERES,B120,36800,36051,Chitray,36,,,360510000C0023,,,,,,,,,,,,,0,,,,,T,terres,,,58410,1.360259,46.65729
2021-630224,2021-12-30,000001,Vente,43500,,,LA LOGE A BERLET,B151,36800,36051,Chitray,36,,,360510000C0026,,,,,,,,,,,,,0,,,,,T,terres,,,10443,1.361764,46.655067
2021-630224,2021-12-30,000001,Vente,43500,,,LA LOGE A BERLET,B151,36800,36051,Chitray,36,,,360510000C0027,,,,,,,,,,,,,0,,,,,BS,taillis sous futaie,,,680,1.361555,46.655403
2021-630224,2021-12-30,000001,Vente,43500,,,LE CHAMP DE L ORMEAU,B049,36800,36051,Chitray,36,,,360510000C0035,,,,,,,,,,,,,0,,,,,T,terres,,,23678,1.35538,46.657405
