id_mutation,date_mutation,numero_disposition,nature_mutation,valeur_fonciere,adresse_numero,adresse_suffixe,adresse_nom_voie,adresse_code_voie,code_postal,code_commune,nom_commune,code_departement,ancien_code_commune,ancien_nom_commune,id_parcelle,ancien_id_parcelle,numero_volume,lot1_numero,lot1_surface_carrez,lot2_numero,lot2_surface_carrez,lot3_numero,lot3_surface_carrez,lot4_numero,lot4_surface_carrez,lot5_numero,lot5_surface_carrez,nombre_lots,code_type_local,type_local,surface_reelle_bati,nombre_pieces_principales,code_nature_culture,nature_culture,code_nature_culture_speciale,nature_culture_speciale,surface_terrain,longitude,latitude
2021-623591,2021-01-21,000001,Vente,75000,11,,RTE D ARGY,0015,36320,36241,Villedieu-sur-Indre,36,,,36241000AM0087,,,,,,,,,,,,,0,3,Dépendance,,0,S,sols,,,482,1.535306,46.849502
2021-623591,2021-01-21,000001,Vente,75000,11,,RTE D ARGY,0015,36320,36241,Villedieu-sur-Indre,36,,,36241000AM0087,,,,,,,,,,,,,0,1,Maison,69,5,S,sols,,,482,1.535306,46.849502
2021-623690,2021-01-20,000001,Vente,127000,5,,RUE DES JARDINS,0005,36320,36241,Villedieu-sur-Indre,36,,,36241000AM0296,,,,,,,,,,,,,0,1,Maison,120,5,S,sols,,,327,1.536306,46.847156
2021-623690,2021-01-20,000001,Vente,127000,5,,RUE DES JARDINS,0005,36320,36241,Villedieu-sur-Indre,36,,,36241000AM0296,,,,,,,,,,,,,0,3,Dépendance,,0,S,sols,,,327,1.536306,46.847156
2021-623690,2021-01-20,000001,Vente,127000,5,,RUE DES JARDINS,0005,36320,36241,Villedieu-sur-Indre,36,,,36241000AM0296,,,,,,,,,,,,,0,3,Dépendance,,0,S,sols,,,327,1.536306,46.847156
2021-623746,2021-01-30,000001,Vente,24500,,,RUE DES FONTAINES,0195,36320,36241,Villedieu-sur-Indre,36,,,36241000AM0361,,,17,26,,,,,,,,,1,2,Appartement,26,1,,,,,,1.534476,46.846584
2021-623915,2021-01-30,000001,Vente,40000,,,LES SABLES,B194,36320,36241,Villedieu-sur-Indre,36,,,36241000AP0027,,,,,,,,,,,,,0,,,,,J,jardins,,,711,1.526828,46.840897
2021-623915,2021-01-30,000001,Vente,40000,,,LES SABLES,B194,36320,36241,Villedieu-sur-Indre,36,,,36241000AP0030,,,,,,,,,,,,,0,,,,,J,jardins,,,204,1.526616,46.841359
2021-623915,2021-01-30,000001,Vente,40000,4,,RUE DU MARAIS,0100,36320,36241,Villedieu-sur-Indre,36,,,36241000AP0041,,,,,,,,,,,,,0,1,Maison,88,5,S,sols,,,212,1.528222,46.84024
2021-624132,2021-02-26,000001,Vente,700,,,BOIS CHAUVET,B009,36320,36241,Villedieu-sur-Indre,36,,,36241000ZW0040,,,,,,,,,,,,,0,,,,,T,terres,,,710,1.526338,46.834844
2021-624277,2021-03-01,000001,Vente,125000,12,,RUE SAINT - LAZARE,0135,36320,36241,Villedieu-sur-Indre,36,,,36241000AM0441,,,,,,,,,,,,,0,1,Maison,67,3,S,sols,,,707,1.529956,46.848545
2021-624303,2021-03-04,000001,Vente,140000,17,,RTE D ARGY,0015,36320,36241,Villedieu-sur-Indre,36,,,36241000AM0083,,,,,,,,,,,,,0,1,Maison,90,3,S,sols,,,239,1.535133,46.849821
2021-624303,2021-03-04,000001,Vente,140000,,,RTE D ARGY,0015,36320,36241,Villedieu-sur-Indre,36,,,36241000AM0084,,,,,,,,,,,,,0,,,,,S,sols,,,245,1.535258,46.849814
2021-624303,2021-03-04,000001,Vente,140000,17,,RTE D ARGY,0015,36320,36241,Villedieu-sur-Indre,36,,,36241000AM0494,,,,,,,,,,,,,0,,,,,J,jardins,,,157,1.535321,46.849741
2021-624570,2021-03-04,000001,Vente,88000,120,,RUE DU GENERAL DE GAULLE,0069,36320,36241,Villedieu-sur-Indre,36,,,36241000AN0132,,,,,,,,,,,,,0,1,Maison,55,3,S,sols,,,333,1.544129,46.846075
2021-624570,2021-03-04,000001,Vente,88000,120,,RUE DU GENERAL DE GAULLE,0069,36320,36241,Villedieu-sur-Indre,36,,,36241000AN0132,,,,,,,,,,,,,0,3,Dépendance,,0,S,sols,,,333,1.544129,46.846075
2021-624570,2021-03-04,000001,Vente,88000,120,,RUE DU GENERAL DE GAULLE,0069,36320,36241,Villedieu-sur-Indre,36,,,36241000AN0132,,,,,,,,,,,,,0,3,Dépendance,,0,S,sols,,,333,1.544129,46.846075
2021-624579,2021-03-25,000002,Vente,501.12,,,GAUTRAY,B089,36320,36241,Villedieu-sur-Indre,36,,,36241000ZK0126,,,,,,,,,,,,,0,,,,,L,landes,,,464,1.499745,46.86226
2021-624580,2021-03-25,000002,Vente,57.24,,,CHATEAU DE CHAMBON,B045,36320,36241,Villedieu-sur-Indre,36,,,36241000ZM0264,,,,,,,,,,,,,0,,,,,T,terres,,,53,1.503097,46.861955
2021-624581,2021-03-25,000002,Vente,50.76,,,GAUTRAY,B089,36320,36241,Villedieu-sur-Indre,36,,,36241000ZM0262,,,,,,,,,,,,,0,,,,,L,landes,,,47,1.500164,46.862232
2021-624720,2021-04-01,000001,Vente,26500,3,,AV JEAN MONNET,0086,36320,36241,Villedieu-sur-Indre,36,,,36241000AP0170,,,,,,,,,,,,,0,1,Maison,45,1,S,sols,,,63,1.528739,46.840089
2021-624773,2021-04-08,000001,Vente,205000,,,BOULONNAIS,B018,36320,36241,Villedieu-sur-Indre,36,,,362410000A0037,,,,,,,,,,,,,0,,,,,J,jardins,,,960,1.55108,46.86379
2021-624773,2021-04-08,000001,Vente,205000,5570,,BOULONNAIS,B018,36320,36241,Villedieu-sur-Indre,36,,,362410000A0910,,,,,,,,,,,,,0,1,Maison,156,6,S,sols,,,4657,1.550718,46.864063
2021-624773,2021-04-08,000001,Vente,205000,,,BOULONNAIS,B018,36320,36241,Villedieu-sur-Indre,36,,,362410000A0912,,,,,,,,,,,,,0,,,,,P,prés,,,2433,1.550153,46.864372
2021-624777,2021-03-23,000001,Vente,145000,,,SAINT LAZARE,B198,36320,36241,Villedieu-sur-Indre,36,,,36241000ZP0192,,,,,,,,,,,,,0,,,,,S,sols,,,181,1.527199,46.849512
2021-624777,2021-03-23,000001,Vente,145000,3,,IMP SAINT LAZARE,0157,36320,36241,Villedieu-sur-Indre,36,,,36241000ZP0260,,,,,,,,,,,,,0,1,Maison,145,5,S,sols,,,179,1.527131,46.849468
2021-624777,2021-03-23,000001,Vente,145000,,,SAINT LAZARE,B198,36320,36241,Villedieu-sur-Indre,36,,,36241000ZP0262,,,,,,,,,,,,,0,,,,,T,terres,,,583,1.527086,46.849651
2021-624978,2021-04-15,000001,Vente,196000,1,,ALL DES ACACIAS,0011,36320,36241,Villedieu-sur-Indre,36,,,36241000ZS0203,,,,,,,,,,,,,0,1,Maison,101,4,S,sols,,,985,1.54455,46.841351
2021-624978,2021-04-15,000001,Vente,196000,1,,ALL DES ACACIAS,0011,36320,36241,Villedieu-sur-Indre,36,,,36241000ZS0203,,,,,,,,,,,,,0,3,Dépendance,,0,S,sols,,,985,1.54455,46.841351
2021-625076,2021-04-22,000001,Vente,2600,,,LES SABLES,B194,36320,36241,Villedieu-sur-Indre,36,,,36241000ZV0092,,,,,,,,,,,,,0,,,,,CA,carrières,,,2930,1.523839,46.838286
2021-625209,2021-04-23,000001,Vente,35000,25,,AV DU MARECHAL LECLERC,0102,36320,36241,Villedieu-sur-Indre,36,,,36241000AM0025,,,,,,,,,,,,,0,3,Dépendance,,0,S,sols,,,83,1.533721,46.848938
2021-625209,2021-04-23,000001,Vente,35000,25,,AV DU MARECHAL LECLERC,0102,36320,36241,Villedieu-sur-Indre,36,,,36241000AM0025,,,,,,,,,,,,,0,1,Maison,120,3,S,sols,,,83,1.533721,46.848938
2021-625209,2021-04-23,000001,Vente,35000,,,LE BOURG-OUEST,B024,36320,36241,Villedieu-sur-Indre,36,,,36241000AM0520,,,,,,,,,,,,,0,,,,,S,sols,,,15,1.533748,46.849011
2021-625209,2021-04-23,000001,Vente,35000,25,,AV DU MARECHAL LECLERC,0102,36320,36241,Villedieu-sur-Indre,36,,,36241000AM0724,,,,,,,,,,,,,0,3,Dépendance,,0,S,sols,,,753,1.533462,46.849305
2021-625209,2021-04-23,000001,Vente,35000,25,,AV DU MARECHAL LECLERC,0102,36320,36241,Villedieu-sur-Indre,36,,,36241000AM0724,,,,,,,,,,,,,0,3,Dépendance,,0,S,sols,,,753,1.533462,46.849305
2021-625209,2021-04-23,000001,Vente,35000,27,,AV DU MARECHAL LECLERC,0102,36320,36241,Villedieu-sur-Indre,36,,,36241000AM0725,,,,,,,,,,,,,0,,,,,S,sols,,,13,1.533563,46.849206
2021-625209,2021-04-23,000001,Vente,35000,,,LE BOURG-OUEST,B024,36320,36241,Villedieu-sur-Indre,36,,,36241000AM0729,,,,,,,,,,,,,0,,,,,S,sols,,,79,1.533742,46.848992
2021-625209,2021-04-23,000001,Vente,35000,25,,AV DU MARECHAL LECLERC,0102,36320,36241,Villedieu-sur-Indre,36,,,36241000AM0730,,,,,,,,,,,,,0,3,Dépendance,,0,S,sols,,,16,1.533677,46.849014
2021-625263,2021-04-23,000001,Vente,1100,,,PRAIRIE,B159,36320,36241,Villedieu-sur-Indre,36,,,36241000ZS0075,,,,,,,,,,,,,0,,,,,T,terres,,,670,1.54455,46.837496
2021-625381,2021-05-07,000001,Vente,5000,,,LES REGAINS,B190,36320,36241,Villedieu-sur-Indre,36,,,36241000ZS0130,,,,,,,,,,,,,0,,,,,BP,peupleraies,,,11210,1.537417,46.838317
2021-625381,2021-05-07,000001,Vente,5000,,,LES REGAINS,B190,36320,36241,Villedieu-sur-Indre,36,,,36241000ZS0131,,,,,,,,,,,,,0,,,,,BP,peupleraies,,,6350,1.538054,46.838295
2021-625645,2021-05-19,000002,Vente,5000,,,LE BOURG - EST,B022,36320,36241,Villedieu-sur-Indre,36,,,36241000AN1007,,,,,,,,,,,,,0,,,,,J,jardins,,,291,1.542521,46.843184
2021-625710,2021-05-25,000001,Vente,50000,,,LE BOURG-OUEST,B024,36320,36241,Villedieu-sur-Indre,36,,,36241000AM0143,,,,,,,,,,,,,0,,,,,S,sols,,,150,1.536166,46.849519
2021-625710,2021-05-25,000001,Vente,50000,,,LE BOURG-OUEST,B024,36320,36241,Villedieu-sur-Indre,36,,,36241000AM0143,,,,,,,,,,,,,0,,,,,J,jardins,,,565,1.536166,46.849519
2021-625710,2021-05-25,000001,Vente,50000,24,,RTE DE CHEZELLES,0045,36320,36241,Villedieu-sur-Indre,36,,,36241000AM0144,,,,,,,,,,,,,0,1,Maison,89,4,S,sols,,,397,1.53635,46.849365
2021-626063,2021-06-18,000001,Vente,223000,3,,IMP DE L'AUBEPINE,0017,36320,36241,Villedieu-sur-Indre,36,,,36241000AN0900,,,,,,,,,,,,,0,1,Maison,82,3,T,terres,,,573,1.546467,46.84324
2021-626063,2021-06-18,000001,Vente,223000,3,,IMP DE L'AUBEPINE,0017,36320,36241,Villedieu-sur-Indre,36,,,36241000AN0900,,,,,,,,,,,,,0,1,Maison,82,3,S,sols,,,1000,1.546467,46.84324
2021-626206,2021-06-11,000001,Vente,82000,5,,RUE DU CHAMP DE FOIRE,0030,36320,36241,Villedieu-sur-Indre,36,,,36241000AM0437,,,,,,,,,,,,,0,1,Maison,76,5,S,sols,,,459,1.529426,46.848322
2021-626217,2021-06-23,000001,Vente,203750,5738,,RUE DE L ABREUVOIR,0010,36320,36241,Villedieu-sur-Indre,36,,,36241000AP0248,,,,,,,,,,,,,0,1,Maison,36,2,S,sols,,,130,1.531242,46.841506
2021-626217,2021-06-23,000001,Vente,203750,17,,PL DE VERDUN,0150,36320,36241,Villedieu-sur-Indre,36,,,36241000AP0249,,,,,,,,,,,,,0,3,Dépendance,,0,S,sols,,,164,1.531327,46.841607
2021-626217,2021-06-23,000001,Vente,203750,17,,PL DE VERDUN,0150,36320,36241,Villedieu-sur-Indre,36,,,36241000AP0249,,,,,,,,,,,,,0,1,Maison,100,4,S,sols,,,164,1.531327,46.841607
2021-626217,2021-06-23,000001,Vente,203750,5736,,RUE DE L ABREUVOIR,0010,36320,36241,Villedieu-sur-Indre,36,,,36241000AP0250,,,,,,,,,,,,,0,3,Dépendance,,0,S,sols,,,76,1.531307,46.841669
2021-626217,2021-06-23,000001,Vente,203750,5735,,RUE DE L ABREUVOIR,0010,36320,36241,Villedieu-sur-Indre,36,,,36241000AP0251,,,,,,,,,,,,,0,3,Dépendance,,0,S,sols,,,409,1.53135,46.841761
2021-626217,2021-06-23,000001,Vente,203750,,,MEHUN,B127,36320,36241,Villedieu-sur-Indre,36,,,36241000AP0252,,,,,,,,,,,,,0,,,,,J,jardins,,,375,1.531496,46.842012
2021-626347,2021-06-25,000001,Vente,362459,,,PETIT BOULONNAIS,B143,36320,36241,Villedieu-sur-Indre,36,,,362410000A0319,,,,,,,,,,,,,0,,,,,T,terres,,,4689,1.538274,46.862762
2021-626347,2021-06-25,000001,Vente,362459,,,BOIS BEZARD,B008,36320,36241,Villedieu-sur-Indre,36,,,362410000A0350,,,,,,,,,,,,,0,,,,,T,terres,,,16618,1.542586,46.863236
2021-626347,2021-06-25,000001,Vente,362459,,,PETIT BOULONNAIS,B143,36320,36241,Villedieu-sur-Indre,36,,,362410000A0352,,,,,,,,,,,,,0,,,,,S,sols,,,448,1.541659,46.860838
2021-626347,2021-06-25,000001,Vente,362459,,,PETIT BOULONNAIS,B143,36320,36241,Villedieu-sur-Indre,36,,,362410000A0352,,,,,,,,,,,,,0,,,,,T,terres,,,256433,1.541659,46.860838
2021-626347,2021-06-25,000001,Vente,362459,,,BOIS BEZARD,B008,36320,36241,Villedieu-sur-Indre,36,,,362410000A0473,,,,,,,,,,,,,0,,,,,T,terres,,,17811,1.541929,46.864018
2021-626347,2021-06-25,000001,Vente,362459,,,PETIT BOULONNAIS,B143,36320,36241,Villedieu-sur-Indre,36,,,362410000A0474,,,,,,,,,,,,,0,,,,,T,terres,,,12385,1.539567,46.864242
2021-626347,2021-06-25,000001,Vente,362459,,,LES MEEZ,B126,36320,36241,Villedieu-sur-Indre,36,,,362410000A0852,,,,,,,,,,,,,0,,,,,T,terres,,,61719,1.548231,46.857281
2021-626444,2021-07-05,000001,Vente,55000,3,,RUE DES FABRIQUES,0060,36320,36241,Villedieu-sur-Indre,36,,,36241000AN0267,,,,,,,,,,,,,0,1,Maison,60,4,S,sols,,,182,1.541469,46.845257
2021-626444,2021-07-05,000001,Vente,55000,3,,RUE DES FABRIQUES,0060,36320,36241,Villedieu-sur-Indre,36,,,36241000AN0267,,,,,,,,,,,,,0,3,Dépendance,,0,S,sols,,,182,1.541469,46.845257
2021-626459,2021-06-18,000001,Vente,50000,5,,PL DE VERDUN,0150,36320,36241,Villedieu-sur-Indre,36,,,36241000AP0256,,,,,,,,,,,,,0,1,Maison,68,3,S,sols,,,62,1.531748,46.841459
2021-626459,2021-06-18,000001,Vente,50000,5,,PL DE VERDUN,0150,36320,36241,Villedieu-sur-Indre,36,,,36241000AP0256,,,,,,,,,,,,,0,3,Dépendance,,0,S,sols,,,62,1.531748,46.841459
2021-626459,2021-06-18,000001,Vente,50000,,,MEHUN,B127,36320,36241,Villedieu-sur-Indre,36,,,36241000AP0257,,,,,,,,,,,,,0,,,,,S,sols,,,191,1.531789,46.841348
2021-626459,2021-06-18,000001,Vente,50000,,,MEHUN,B127,36320,36241,Villedieu-sur-Indre,36,,,36241000AP0260,,,,,,,,,,,,,0,,,,,J,jardins,,,219,1.531955,46.841644
2021-626459,2021-06-18,000001,Vente,50000,,,MEHUN,B127,36320,36241,Villedieu-sur-Indre,36,,,36241000AP0286,,,,,,,,,,,,,0,,,,,S,sols,,,15,1.531832,46.841304
2021-626473,2021-06-24,000001,Vente,110000,19,,RTE DE CHEZELLES,0045,36320,36241,Villedieu-sur-Indre,36,,,36241000AM0209,,,,,,,,,,,,,0,3,Dépendance,,0,S,sols,,,150,1.536786,46.849203
2021-626473,2021-06-24,000001,Vente,110000,19,,RTE DE CHEZELLES,0045,36320,36241,Villedieu-sur-Indre,36,,,36241000AM0209,,,,,,,,,,,,,0,1,Maison,58,4,S,sols,,,150,1.536786,46.849203
2021-626495,2021-07-07,000001,Vente,30000,60,,RUE DU GENERAL DE GAULLE,0069,36320,36241,Villedieu-sur-Indre,36,,,36241000AM0228,,,,,,,,,,,,,0,1,Maison,40,2,S,sols,,,89,1.539675,46.846985
2021-626495,2021-07-07,000001,Vente,30000,60,,RUE DU GENERAL DE GAULLE,0069,36320,36241,Villedieu-sur-Indre,36,,,36241000AM0228,,,,,,,,,,,,,0,4,Local industriel. commercial ou assimilé,30,0,S,sols,,,89,1.539675,46.846985
2021-626547,2021-06-19,000001,Vente,80000,,,LE TREFLE,B208,36320,36241,Villedieu-sur-Indre,36,,,36241000ZM0063,,,,,,,,,,,,,0,,,,,T,terres,,,14050,1.506636,46.860549
2021-626547,2021-06-19,000001,Vente,80000,,,CAMP DE CESAR,B033,36320,36241,Villedieu-sur-Indre,36,,,36241000ZM0064,,,,,,,,,,,,,0,,,,,T,terres,,,7170,1.506204,46.861301
2021-626547,2021-06-19,000001,Vente,80000,5526,,CHAMBON,B037,36320,36241,Villedieu-sur-Indre,36,,,36241000ZM0149,,,,,,,,,,,,,0,1,Maison,42,3,S,sols,,,2228,1.507704,46.861077
2021-626547,2021-06-19,000001,Vente,80000,5526,,CHAMBON,B037,36320,36241,Villedieu-sur-Indre,36,,,36241000ZM0149,,,,,,,,,,,,,0,3,Dépendance,,0,S,sols,,,2228,1.507704,46.861077
2021-626587,2021-06-24,000002,Vente,1,,,LONGEVILLE,B115,36320,36241,Villedieu-sur-Indre,36,,,362410000D0165,,,,,,,,,,,,,0,,,,,S,sols,,,36,1.487164,46.813481
2021-626776,2021-07-17,000001,Vente,72000,1,A,RUE DES AMANDIERS,0013,36320,36241,Villedieu-sur-Indre,36,,,36241000AN0985,,,,,,,,,,,,,0,1,Maison,82,4,S,sols,,,259,1.544389,46.845769
2021-626890,2021-06-25,000001,Vente,58613,,,LES MEEZ,B126,36320,36241,Villedieu-sur-Indre,36,,,362410000A0465,,,,,,,,,,,,,0,,,,,T,terres,,,32086,1.553267,46.858972
2021-626890,2021-06-25,000001,Vente,58613,,,LES MEEZ,B126,36320,36241,Villedieu-sur-Indre,36,,,362410000A0467,,,,,,,,,,,,,0,,,,,T,terres,,,15628,1.55232,46.857893
2021-626890,2021-06-25,000001,Vente,58613,,,LES MEEZ,B126,36320,36241,Villedieu-sur-Indre,36,,,362410000A0469,,,,,,,,,,,,,0,,,,,T,terres,,,9460,1.552064,46.856987
2021-626890,2021-06-25,000001,Vente,58613,,,LES MEEZ,B126,36320,36241,Villedieu-sur-Indre,36,,,362410000A0471,,,,,,,,,,,,,0,,,,,T,terres,,,7779,1.551537,46.856759
2021-626899,2021-07-13,000001,Vente,133750,5846,,RUE SAINT - LAZARE,0135,36320,36241,Villedieu-sur-Indre,36,,,36241000AM0603,,,,,,,,,,,,,0,3,Dépendance,,0,S,sols,,,228,1.532445,46.848656
2021-626899,2021-07-13,000001,Vente,133750,5,,RUE SAINT - LAZARE,0135,36320,36241,Villedieu-sur-Indre,36,,,36241000AM0605,,,,,,,,,,,,,0,1,Maison,100,6,S,sols,,,179,1.532715,46.848638
2021-626899,2021-07-13,000001,Vente,133750,5,,RUE SAINT - LAZARE,0135,36320,36241,Villedieu-sur-Indre,36,,,36241000AM0605,,,,,,,,,,,,,0,3,Dépendance,,0,S,sols,,,179,1.532715,46.848638
2021-627109,2021-07-31,000001,Vente,800,,,LES FOLIES,B068,36320,36241,Villedieu-sur-Indre,36,,,36241000AO0206,,,,,,,,,,,,,0,,,,,J,jardins,,,776,1.537174,46.842469
2021-627713,2021-09-04,000001,Vente,90000,22,,RTE D ARGY,0015,36320,36241,Villedieu-sur-Indre,36,,,36241000AM0056,,,,,,,,,,,,,0,1,Maison,102,4,S,sols,,,340,1.534669,46.849518
2021-627713,2021-09-04,000001,Vente,90000,,,LE BOURG-OUEST,B024,36320,36241,Villedieu-sur-Indre,36,,,36241000AM0523,,,,,,,,,,,,,0,,,,,J,jardins,,,19,1.534899,46.849552
2021-627713,2021-09-04,000001,Vente,90000,,,LES GRANDES CHENEVIERES,B099,36320,36241,Villedieu-sur-Indre,36,,,36241000AO0016,,,,,,,,,,,,,0,,,,,J,jardins,,,80,1.534154,46.845827
2021-627713,2021-09-04,000001,Vente,90000,,,LES GRANDES CHENEVIERES,B099,36320,36241,Villedieu-sur-Indre,36,,,36241000AO0286,,,,,,,,,,,,,0,,,,,J,jardins,,,100,1.534233,46.845792
2021-627756,2021-08-27,000001,Vente,90000,16,,AV FRANCOIS MITTERAND,0063,36320,36241,Villedieu-sur-Indre,36,,,36241000AN0180,,,,,,,,,,,,,0,3,Dépendance,,0,S,sols,,,736,1.546217,46.845506
2021-627756,2021-08-27,000001,Vente,90000,16,,AV FRANCOIS MITTERAND,0063,36320,36241,Villedieu-sur-Indre,36,,,36241000AN0180,,,,,,,,,,,,,0,3,Dépendance,,0,S,sols,,,736,1.546217,46.845506
2021-627756,2021-08-27,000001,Vente,90000,16,,AV FRANCOIS MITTERAND,0063,36320,36241,Villedieu-sur-Indre,36,,,36241000AN0180,,,,,,,,,,,,,0,1,Maison,67,4,S,sols,,,736,1.546217,46.845506
2021-627891,2021-09-10,000001,Vente,82000,9,,RUE DES AMANDIERS,0013,36320,36241,Villedieu-sur-Indre,36,,,36241000AN0925,,,,,,,,,,,,,0,1,Maison,78,4,S,sols,,,368,1.545635,46.845374
2021-627891,2021-09-10,000001,Vente,82000,9,,RUE DES AMANDIERS,0013,36320,36241,Villedieu-sur-Indre,36,,,36241000AN0925,,,,,,,,,,,,,0,3,Dépendance,,0,S,sols,,,368,1.545635,46.845374
2021-628201,2021-09-10,000001,Vente,140000,2,,RUE DU CLOS,0046,36320,36241,Villedieu-sur-Indre,36,,,36241000AN0814,,,,,,,,,,,,,0,1,Maison,89,4,S,sols,,,680,1.549599,46.8448
2021-628236,2021-09-30,000001,Vente,104500,18,,RUE DES ECHELLES,0050,36320,36241,Villedieu-sur-Indre,36,,,36241000AN0318,,,,,,,,,,,,,0,3,Dépendance,,0,S,sols,,,412,1.540769,46.845862
2021-628236,2021-09-30,000001,Vente,104500,18,,RUE DES ECHELLES,0050,36320,36241,Villedieu-sur-Indre,36,,,36241000AN0318,,,,,,,,,,,,,0,3,Dépendance,,0,S,sols,,,412,1.540769,46.845862
2021-628236,2021-09-30,000001,Vente,104500,18,,RUE DES ECHELLES,0050,36320,36241,Villedieu-sur-Indre,36,,,36241000AN0318,,,,,,,,,,,,,0,1,Maison,44,2,S,sols,,,412,1.540769,46.845862
2021-628303,2021-10-06,000001,Vente,120000,29,,RUE DES ECHELLES,0050,36320,36241,Villedieu-sur-Indre,36,,,36241000AN0304,,,,,,,,,,,,,0,2,Appartement,62,3,S,sols,,,126,1.541331,46.845852
2021-628303,2021-10-06,000001,Vente,120000,29,,RUE DES ECHELLES,0050,36320,36241,Villedieu-sur-Indre,36,,,36241000AN0304,,,,,,,,,,,,,0,2,Appartement,70,3,S,sols,,,126,1.541331,46.845852
2021-628303,2021-10-06,000001,Vente,120000,29,,RUE DES ECHELLES,0050,36320,36241,Villedieu-sur-Indre,36,,,36241000AN0304,,,,,,,,,,,,,0,3,Dépendance,,0,S,sols,,,126,1.541331,46.845852
2021-628303,2021-10-06,000001,Vente,120000,29,,RUE DES ECHELLES,0050,36320,36241,Villedieu-sur-Indre,36,,,36241000AN0304,,,,,,,,,,,,,0,3,Dépendance,,0,S,sols,,,126,1.541331,46.845852
2021-628303,2021-10-06,000001,Vente,120000,29,,RUE DES ECHELLES,0050,36320,36241,Villedieu-sur-Indre,36,,,36241000AN0304,,,,,,,,,,,,,0,3,Dépendance,,0,S,sols,,,126,1.541331,46.845852
2021-628303,2021-10-06,000001,Vente,120000,29,,RUE DES ECHELLES,0050,36320,36241,Villedieu-sur-Indre,36,,,36241000AN0304,,,,,,,,,,,,,0,2,Appartement,62,3,S,sols,,,126,1.541331,46.845852
2021-628334,2021-09-24,000001,Vente,2700,,,PRAIRIE,B159,36320,36241,Villedieu-sur-Indre,36,,,36241000ZS0061,,,,,,,,,,,,,0,,,,,J,jardins,,,1460,1.543242,46.837809
2021-628409,2021-10-09,000001,Vente,350,,,LES FOLIES,B068,36320,36241,Villedieu-sur-Indre,36,,,36241000AO0185,,,,,,,,,,,,,0,,,,,J,jardins,,,378,1.538386,46.842685
2021-628410,2021-10-04,000001,Vente,85000,17,,RUE DU COTEAU,0051,36320,36241,Villedieu-sur-Indre,36,,,36241000ZP0376,,,,,,,,,,,,,0,,,,,AB,terrains a bâtir,,,873,1.537306,46.85196
2021-628410,2021-10-04,000001,Vente,85000,15,,RUE DU COTEAU,0051,36320,36241,Villedieu-sur-Indre,36,,,36241000ZP0377,,,,,,,,,,,,,0,,,,,AB,terrains a bâtir,,,909,1.537534,46.852007
2021-628596,2021-10-13,000001,Vente,31000,35,,AV DU MARECHAL LECLERC,0102,36320,36241,Villedieu-sur-Indre,36,,,36241000AM0017,,,,,,,,,,,,,0,1,Maison,65,3,S,sols,,,494,1.532729,46.849419
2021-628596,2021-10-13,000001,Vente,31000,35,,AV DU MARECHAL LECLERC,0102,36320,36241,Villedieu-sur-Indre,36,,,36241000AM0017,,,,,,,,,,,,,0,3,Dépendance,,0,S,sols,,,494,1.532729,46.849419
2021-628596,2021-10-13,000001,Vente,31000,35,,AV DU MARECHAL LECLERC,0102,36320,36241,Villedieu-sur-Indre,36,,,36241000AM0017,,,,,,,,,,,,,0,3,Dépendance,,0,S,sols,,,494,1.532729,46.849419
2021-628596,2021-10-13,000001,Vente,31000,35,,AV DU MARECHAL LECLERC,0102,36320,36241,Villedieu-sur-Indre,36,,,36241000AM0017,,,,,,,,,,,,,0,3,Dépendance,,0,S,sols,,,494,1.532729,46.849419
2021-628596,2021-10-13,000001,Vente,31000,35,,AV DU MARECHAL LECLERC,0102,36320,36241,Villedieu-sur-Indre,36,,,36241000AM0607,,,,,,,,,,,,,0,3,Dépendance,,0,S,sols,,,60,1.532713,46.849773
2021-628608,2021-10-15,000001,Vente,1200,,,PRAIRIE DE SAINT BONNET,B161,36320,36241,Villedieu-sur-Indre,36,,,36241000ZL0088,,,,,,,,,,,,,0,,,,,P,prés,,,1710,1.471833,46.855314
2021-628654,2021-10-07,000001,Vente,2076,,,LE BREUILLAT CADET,B026,36320,36241,Villedieu-sur-Indre,36,,,36241000YA0059,,,,,,,,,,,,,0,,,,,T,terres,,,6510,1.516865,46.831668
2021-628865,2021-10-29,000001,Vente,200000,5825,,BOIS DE VILLEDIEU,B012,36320,36241,Villedieu-sur-Indre,36,,,362410000A0825,,,,,,,,,,,,,0,4,Local industriel. commercial ou assimilé,288,0,S,sols,,,503,1.559423,46.843512
2021-628865,2021-10-29,000001,Vente,200000,5826,,BOIS DE VILLEDIEU,B012,36320,36241,Villedieu-sur-Indre,36,,,362410000A0826,,,,,,,,,,,,,0,4,Local industriel. commercial ou assimilé,392,0,S,sols,,,1915,1.559305,46.843446
2021-629045,2021-10-19,000001,Vente,99000,6,,RUE DU LAVOIR,0095,36320,36241,Villedieu-sur-Indre,36,,,36241000AP0403,,,,,,,,,,,,,0,3,Dépendance,,0,S,sols,,,359,1.528616,46.840682
2021-629045,2021-10-19,000001,Vente,99000,6,,RUE DU LAVOIR,0095,36320,36241,Villedieu-sur-Indre,36,,,36241000AP0403,,,,,,,,,,,,,0,1,Maison,81,3,S,sols,,,359,1.528616,46.840682
2021-629045,2021-10-19,000001,Vente,99000,6,,RUE DU LAVOIR,0095,36320,36241,Villedieu-sur-Indre,36,,,36241000AP0403,,,,,,,,,,,,,0,3,Dépendance,,0,S,sols,,,359,1.528616,46.840682
2021-629072,2021-10-30,000001,Vente,70000,2,,AV FRANCOIS MITTERAND,0063,36320,36241,Villedieu-sur-Indre,36,,,36241000AN0188,,,,,,,,,,,,,0,3,Dépendance,,0,S,sols,,,475,1.544615,46.845903
2021-629072,2021-10-30,000001,Vente,70000,2,,AV FRANCOIS MITTERAND,0063,36320,36241,Villedieu-sur-Indre,36,,,36241000AN0188,,,,,,,,,,,,,0,3,Dépendance,,0,S,sols,,,475,1.544615,46.845903
2021-629072,2021-10-30,000001,Vente,70000,2,,AV FRANCOIS MITTERAND,0063,36320,36241,Villedieu-sur-Indre,36,,,36241000AN0188,,,,,,,,,,,,,0,3,Dépendance,,0,S,sols,,,475,1.544615,46.845903
2021-629072,2021-10-30,000001,Vente,70000,2,,AV FRANCOIS MITTERAND,0063,36320,36241,Villedieu-sur-Indre,36,,,36241000AN0188,,,,,,,,,,,,,0,1,Maison,46,2,S,sols,,,475,1.544615,46.845903
2021-629095,2021-11-10,000001,Echange,32000,,,LES GAUDARS,B088,36320,36241,Villedieu-sur-Indre,36,,,36241000YC0006,,,,,,,,,,,,,0,,,,,T,terres,,,15960,1.483747,46.824555
2021-629095,2021-11-10,000001,Echange,32000,,,LES GAUDARS,B088,36320,36241,Villedieu-sur-Indre,36,,,36241000YC0006,,,,,,,,,,,,,0,,,,,T,terres,,,31920,1.483747,46.824555
2021-629095,2021-11-10,000002,Echange,32000,,,LES BRUMALONS,B030,36320,36241,Villedieu-sur-Indre,36,,,36241000YC0021,,,,,,,,,,,,,0,,,,,T,terres,,,45680,1.478092,46.818763
2021-629233,2021-11-15,000001,Vente,8562.6,,,PRAIRIE,B159,36320,36241,Villedieu-sur-Indre,36,,,36241000ZS0078,,,,,,,,,,,,,0,,,,,T,terres,,,13110,1.545327,46.837256
2021-629235,2021-11-15,000001,Vente,1339.8,,,PRAIRIE,B159,36320,36241,Villedieu-sur-Indre,36,,,36241000ZS0073,,,,,,,,,,,,,0,,,,,T,terres,,,2030,1.545749,46.838123
2021-629271,2021-11-18,000001,Vente,13500,5368,,RUE DU GENERAL RUBY,0070,36320,36241,Villedieu-sur-Indre,36,,,36241000AN0042,,,,,,,,,,,,,0,4,Local industriel. commercial ou assimilé,36,0,S,sols,,,47,1.539923,46.846855
2021-629271,2021-11-18,000001,Vente,13500,,,LE BOURG - EST,B022,36320,36241,Villedieu-sur-Indre,36,,,36241000AN0765,,,,,,,,,,,,,0,,,,,S,sols,,,105,1.539837,46.846874