id_mutation,date_mutation,numero_disposition,nature_mutation,valeur_fonciere,adresse_numero,adresse_suffixe,adresse_nom_voie,adresse_code_voie,code_postal,code_commune,nom_commune,code_departement,ancien_code_commune,ancien_nom_commune,id_parcelle,ancien_id_parcelle,numero_volume,lot1_numero,lot1_surface_carrez,lot2_numero,lot2_surface_carrez,lot3_numero,lot3_surface_carrez,lot4_numero,lot4_surface_carrez,lot5_numero,lot5_surface_carrez,nombre_lots,code_type_local,type_local,surface_reelle_bati,nombre_pieces_principales,code_nature_culture,nature_culture,code_nature_culture_speciale,nature_culture_speciale,surface_terrain,longitude,latitude
2021-638601,2021-01-04,000001,Vente,302000,3249,,RTE DE TOURS,1985,37360,37021,Beaumont-Louestault,37,,,37021000ZK0107,,,,,,,,,,,,,0,1,Maison,120,4,T,terres,,,16993,0.692194,47.542863
2021-638601,2021-01-04,000001,Vente,302000,3249,,RTE DE TOURS,1985,37360,37021,Beaumont-Louestault,37,,,37021000ZK0107,,,,,,,,,,,,,0,1,Maison,120,4,BT,taillis simples,,,242,0.692194,47.542863
2021-638601,2021-01-04,000001,Vente,302000,3249,,RTE DE TOURS,1985,37360,37021,Beaumont-Louestault,37,,,37021000ZK0107,,,,,,,,,,,,,0,1,Maison,120,4,S,sols,,,1071,0.692194,47.542863
2021-638601,2021-01-04,000001,Vente,302000,3249,,RTE DE TOURS,1985,37360,37021,Beaumont-Louestault,37,,,37021000ZK0107,,,,,,,,,,,,,0,1,Maison,120,4,P,prés,,,9563,0.692194,47.542863
2021-638947,2021-01-28,000001,Vente,67896,,,LE BOURG,B030,37360,37021,Beaumont-Louestault,37,,,370210000B0313,,,,,,,,,,,,,0,,,,,J,jardins,POTAG,Jardin potager,405,0.672851,47.569652
2021-638947,2021-01-28,000001,Vente,67896,,,LE BOURG,B030,37360,37021,Beaumont-Louestault,37,,,370210000B0314,,,,,,,,,,,,,0,,,,,J,jardins,POTAG,Jardin potager,1140,0.672587,47.56965
2021-638947,2021-01-28,000001,Vente,67896,,,LE BOURG,B030,37360,37021,Beaumont-Louestault,37,,,370210000B0315,,,,,,,,,,,,,0,,,,,J,jardins,POTAG,Jardin potager,229,0.672634,47.56949
2021-638947,2021-01-28,000001,Vente,67896,18,B,RUE GEORGES BIERET,0300,37360,37021,Beaumont-Louestault,37,,,370210000B0316,,,,,,,,,,,,,0,3,Dépendance,,0,S,sols,,,35,0.672515,47.569506
2021-638947,2021-01-28,000001,Vente,67896,18,,RUE GEORGES BIERET,0300,37360,37021,Beaumont-Louestault,37,,,370210000B0317,,,,,,,,,,,,,0,1,Maison,132,4,S,sols,,,78,0.672425,47.569521
2021-638947,2021-01-28,000001,Vente,67896,18,,RUE GEORGES BIERET,0300,37360,37021,Beaumont-Louestault,37,,,370210000B0317,,,,,,,,,,,,,0,3,Dépendance,,0,S,sols,,,78,0.672425,47.569521
2021-638947,2021-01-28,000001,Vente,67896,,,LE BOURG,B030,37360,37021,Beaumont-Louestault,37,,,370210000B0621,,,,,,,,,,,,,0,,,,,S,sols,,,54,0.672349,47.569496
2021-638947,2021-01-28,000001,Vente,67896,,,LE BOURG,B030,37360,37021,Beaumont-Louestault,37,,,370210000B0653,,,,,,,,,,,,,0,,,,,J,jardins,POTAG,Jardin potager,225,0.672337,47.569616
2021-638979,2021-02-12,000001,Vente,38000,231,,RUE DES CARRIERES,0115,37360,37021,Beaumont-Louestault,37,,,370210000B0461,,,,,,,,,,,,,0,3,Dépendance,,0,T,terres,,,127,0.673369,47.573175
2021-638979,2021-02-12,000001,Vente,38000,10,,RUE DES CARRIERES,0115,37360,37021,Beaumont-Louestault,37,,,370210000B0462,,,,,,,,,,,,,0,1,Maison,27,1,S,sols,,,56,0.673441,47.57312
2021-638979,2021-02-12,000001,Vente,38000,,,LES VAUX GATES,B199,37360,37021,Beaumont-Louestault,37,,,370210000B0464,,,,,,,,,,,,,0,,,,,T,terres,,,210,0.673514,47.573225
2021-638979,2021-02-12,000001,Vente,38000,,,LES VAUX GATES,B199,37360,37021,Beaumont-Louestault,37,,,370210000B0541,,,,,,,,,,,,,0,,,,,J,jardins,POTAG,Jardin potager,120,0.673609,47.572961
2021-638987,2021-02-18,000001,Vente,16000,,,LE CHENE,B052,37360,37021,Beaumont-Louestault,37,,,37021000ZD0084,,,,,,,,,,,,,0,,,,,J,jardins,POTAG,Jardin potager,319,0.669435,47.565533
2021-639093,2021-02-26,000001,Vente,58000,,,LA RONSIERE,B165,37360,37021,Beaumont-Louestault,37,,,370210000B1081,,,,,,,,,,,,,0,,,,,AB,terrains a bâtir,,,447,0.6646,47.569607
2021-639093,2021-02-26,000001,Vente,58000,,,LA RONSIERE,B165,37360,37021,Beaumont-Louestault,37,,,370210000B1098,,,,,,,,,,,,,0,,,,,AG,terrains d'agrément,,,289,0.664426,47.569641
2021-639118,2021-02-16,000001,Vente,180000,,,LA PAILLASSE,B114,37360,37021,Beaumont-Louestault,37,,,37021000ZP0090,,,,,,,,,,,,,0,,,,,S,sols,,,77,0.66755,47.564378
2021-639118,2021-02-16,000001,Vente,180000,4,,CHE DE LA GRANGE,0332,37360,37021,Beaumont-Louestault,37,,,37021000ZP0104,,,,,,,,,,,,,0,1,Maison,74,3,AG,terrains d'agrément,,,692,0.667196,47.564316
2021-639118,2021-02-16,000001,Vente,180000,4,,CHE DE LA GRANGE,0332,37360,37021,Beaumont-Louestault,37,,,37021000ZP0104,,,,,,,,,,,,,0,1,Maison,74,3,S,sols,,,500,0.667196,47.564316
2021-639118,2021-02-16,000001,Vente,180000,,,LA PAILLASSE,B114,37360,37021,Beaumont-Louestault,37,,,37021000ZP0106,,,,,,,,,,,,,0,,,,,S,sols,,,214,0.666963,47.564438
2021-639118,2021-02-16,000001,Vente,180000,,,LA PAILLASSE,B114,37360,37021,Beaumont-Louestault,37,,,37021000ZP0107,,,,,,,,,,,,,0,,,,,S,sols,,,22,0.667478,47.564268
2021-639270,2021-03-12,000001,Vente,195000,15,,LES HAUTS DE LA CHOISILLE,0350,37360,37021,Beaumont-Louestault,37,,,37021000ZD0207,,,,,,,,,,,,,0,1,Maison,102,5,S,sols,,,808,0.670422,47.558326
2021-639355,2021-03-31,000001,Vente,164000,,,LE BOURG,B030,37360,37021,Beaumont-Louestault,37,,,370210000B0756,,,,,,,,,,,,,0,,,,,T,terres,,,889,0.672003,47.569122
2021-639355,2021-03-31,000001,Vente,164000,,,LE BOURG,B030,37360,37021,Beaumont-Louestault,37,,,370210000B0758,,,,,,,,,,,,,0,,,,,J,jardins,POTAG,Jardin potager,446,0.672107,47.569254
2021-639355,2021-03-31,000001,Vente,164000,21,B,RUE GEORGES BIERET,0300,37360,37021,Beaumont-Louestault,37,,,370210000B0760,,,,,,,,,,,,,0,1,Maison,87,4,S,sols,,,285,0.672356,47.569303
2021-639355,2021-03-31,000001,Vente,164000,21,B,RUE GEORGES BIERET,0300,37360,37021,Beaumont-Louestault,37,,,370210000B0760,,,,,,,,,,,,,0,4,Local industriel. commercial ou assimilé,40,0,S,sols,,,285,0.672356,47.569303
2021-639415,2021-03-25,000001,Vente,145000,,,LES PETITES TAILLES,B126,37360,37021,Beaumont-Louestault,37,,,37021000ZH0091,,,,,,,,,,,,,0,,,,,BT,taillis simples,,,4779,0.685686,47.549526
2021-639415,2021-03-25,000001,Vente,145000,,,LES PETITES TAILLES,B126,37360,37021,Beaumont-Louestault,37,,,37021000ZH0092,,,,,,,,,,,,,0,,,,,BT,taillis simples,,,3626,0.686362,47.549364
2021-639415,2021-03-25,000001,Vente,145000,,,LES PETITES TAILLES,B126,37360,37021,Beaumont-Louestault,37,,,37021000ZH0094,,,,,,,,,,,,,0,,,,,BT,taillis simples,,,2477,0.686919,47.549949
2021-639415,2021-03-25,000001,Vente,145000,138,,CHE DE LA BUVINIERE,0114,37360,37021,Beaumont-Louestault,37,,,37021000ZH0095,,,,,,,,,,,,,0,1,Maison,153,5,T,terres,,,13720,0.684481,47.550121
2021-639415,2021-03-25,000001,Vente,145000,138,,CHE DE LA BUVINIERE,0114,37360,37021,Beaumont-Louestault,37,,,37021000ZH0095,,,,,,,,,,,,,0,1,Maison,153,5,P,prés,,,12134,0.684481,47.550121
2021-639415,2021-03-25,000001,Vente,145000,138,,CHE DE LA BUVINIERE,0114,37360,37021,Beaumont-Louestault,37,,,37021000ZH0095,,,,,,,,,,,,,0,1,Maison,153,5,AG,terrains d'agrément,,,1512,0.684481,47.550121
2021-639415,2021-03-25,000001,Vente,145000,138,,CHE DE LA BUVINIERE,0114,37360,37021,Beaumont-Louestault,37,,,37021000ZH0095,,,,,,,,,,,,,0,1,Maison,153,5,T,terres,,,22577,0.684481,47.550121
2021-639415,2021-03-25,000001,Vente,145000,138,,CHE DE LA BUVINIERE,0114,37360,37021,Beaumont-Louestault,37,,,37021000ZH0095,,,,,,,,,,,,,0,1,Maison,153,5,BT,taillis simples,,,3188,0.684481,47.550121
2021-639415,2021-03-25,000001,Vente,145000,138,,CHE DE LA BUVINIERE,0114,37360,37021,Beaumont-Louestault,37,,,37021000ZH0095,,,,,,,,,,,,,0,1,Maison,153,5,S,sols,,,944,0.684481,47.550121
2021-639426,2021-03-22,000001,Vente,80000,,,LES PERRES,B262,37370,37021,Beaumont-Louestault,37,,,370211350A0971,,,,,,,,,,,,,0,,,,,S,sols,,,820,0.658131,47.616165
2021-639426,2021-03-22,000001,Vente,80000,78,,RTE DE LA FORET,0269,37370,37021,Beaumont-Louestault,37,,,370211350A0996,,,,,,,,,,,,,0,4,Local industriel. commercial ou assimilé,454,0,S,sols,,,2964,0.658302,47.616513
2021-639436,2021-03-24,000001,Vente,48200,,,PIECE DE LA PAILLASSE,B130,37360,37021,Beaumont-Louestault,37,,,370210000B1118,,,,,,,,,,,,,0,,,,,AB,terrains a bâtir,,,585,0.6669,47.566205
2021-639487,2021-03-30,000002,Vente,380000,560,,RTE DE LA HAUTE BARDE,0349,37360,37021,Beaumont-Louestault,37,,,37021000ZR0010,,,,,,,,,,,,,0,4,Local industriel. commercial ou assimilé,2165,0,,,,,,,
2021-639487,2021-03-30,000002,Vente,380000,560,,RTE DE LA HAUTE BARDE,0349,37360,37021,Beaumont-Louestault,37,,,37021000ZR0010,,,,,,,,,,,,,0,1,Maison,132,6,,,,,,,
2021-639487,2021-03-30,000002,Vente,380000,560,,RTE DE LA HAUTE BARDE,0349,37360,37021,Beaumont-Louestault,37,,,37021000ZR0010,,,,,,,,,,,,,0,1,Maison,132,5,,,,,,,
2021-639557,2021-04-08,000001,Vente,210000,22,,RUE DE LA BLOTTIERE,0110,37360,37021,Beaumont-Louestault,37,,,37021000ZO0016,,,,,,,,,,,,,0,1,Maison,90,5,S,sols,,,1165,0.64157,47.552758
2021-639594,2021-04-15,000001,Vente,45000,,,LES GRANDS PERRES,B241,37370,37021,Beaumont-Louestault,37,,,370211350C0022,,,,,,,,,,,,,0,,,,,BT,taillis simples,,,18133,0.655434,47.598712
2021-639594,2021-04-15,000001,Vente,45000,,,LE NERPRUN,B257,37370,37021,Beaumont-Louestault,37,,,370211350C0023,,,,,,,,,,,,,0,,,,,BS,taillis sous futaie,,,61025,0.657243,47.596716
2021-639594,2021-04-15,000001,Vente,45000,,,LES GRANDS PERRES,B241,37370,37021,Beaumont-Louestault,37,,,370211350C0108,,,,,,,,,,,,,0,,,,,BS,taillis sous futaie,,,3019,0.658411,47.597894
2021-639594,2021-04-15,000001,Vente,45000,,,L ETANG,B233,37370,37021,Beaumont-Louestault,37,,,370211350C0109,,,,,,,,,,,,,0,,,,,BS,taillis sous futaie,,,5873,0.656411,47.597579
2021-639615,2021-04-02,000001,Vente,49000,,,LA RONSIERE,B165,37360,37021,Beaumont-Louestault,37,,,370210000B1080,,,,,,,,,,,,,0,,,,,AB,terrains a bâtir,,,402,0.664682,47.569805
2021-639615,2021-04-02,000001,Vente,49000,,,LA RONSIERE,B165,37360,37021,Beaumont-Louestault,37,,,370210000B1097,,,,,,,,,,,,,0,,,,,AG,terrains d'agrément,,,269,0.664489,47.569834
2021-639719,2021-04-30,000002,Vente,82000,,,LA PAILLASSE,B114,37360,37021,Beaumont-Louestault,37,,,37021000ZP0121,,,,,,,,,,,,,0,,,,,T,terres,,,745,0.666727,47.564919
2021-639719,2021-04-30,000002,Vente,82000,,,LA PAILLASSE,B114,37360,37021,Beaumont-Louestault,37,,,37021000ZP0122,,,,,,,,,,,,,0,,,,,T,terres,,,296,0.666597,47.564881
2021-639719,2021-04-30,000002,Vente,82000,,,LA PAILLASSE,B114,37360,37021,Beaumont-Louestault,37,,,37021000ZP0123,,,,,,,,,,,,,0,,,,,T,terres,,,3203,0.66616,47.564988
2021-639719,2021-04-30,000002,Vente,82000,,,LA PAILLASSE,B114,37360,37021,Beaumont-Louestault,37,,,37021000ZP0124,,,,,,,,,,,,,0,,,,,T,terres,,,4,0.666825,47.565148
2021-639749,2021-04-20,000001,Vente,4000,,,LES VAUX GATES,B199,37360,37021,Beaumont-Louestault,37,,,370210000B0499,,,,,,,,,,,,,0,,,,,T,terres,,,27,0.675089,47.574538
2021-639749,2021-04-20,000001,Vente,4000,249,,RUE DES CARRIERES,0115,37360,37021,Beaumont-Louestault,37,,,370210000B0500,,,,,,,,,,,,,0,3,Dépendance,,0,S,sols,,,19,0.675152,47.574495
2021-639749,2021-04-20,000001,Vente,4000,,,LES VAUX GATES,B199,37360,37021,Beaumont-Louestault,37,,,370210000B0728,,,,,,,,,,,,,0,,,,,T,terres,,,27,0.675078,47.574499
2021-639749,2021-04-20,000001,Vente,4000,,,LES VAUX GATES,B199,37360,37021,Beaumont-Louestault,37,,,370210000B0730,,,,,,,,,,,,,0,,,,,S,sols,,,4,0.675109,47.574462
2021-639927,2021-05-18,000001,Vente,236655,26,,LES HAUTS DE LA CHOISILLE,0350,37360,37021,Beaumont-Louestault,37,,,37021000ZD0212,,,,,,,,,,,,,0,1,Maison,104,6,S,sols,,,804,0.671379,47.558042
2021-639932,2021-05-05,000001,Vente,191100,9,B,RUE DES PRES,0710,37360,37021,Beaumont-Louestault,37,,,370210000B0218,,,,,,,,,,,,,0,3,Dépendance,,0,S,sols,,,107,0.669854,47.568448
2021-639932,2021-05-05,000001,Vente,191100,,,LE BOURG,B030,37360,37021,Beaumont-Louestault,37,,,370210000B0219,,,,,,,,,,,,,0,,,,,J,jardins,POTAG,Jardin potager,573,0.669748,47.568507
2021-640006,2021-05-19,000002,Vente,660,,,LE BOURG,B030,37360,37021,Beaumont-Louestault,37,,,370210000B1130,,,,,,,,,,,,,0,,,,,S,sols,,,11,0.670148,47.56935
2021-640008,2021-05-19,000001,Vente,15960,,,LE BOURG,B030,37360,37021,Beaumont-Louestault,37,,,370210000B0249,,,,,,,,,,,,,0,,,,,J,jardins,POTAG,Jardin potager,300,0.670457,47.569232
2021-640008,2021-05-19,000001,Vente,15960,,,LE BOURG,B030,37360,37021,Beaumont-Louestault,37,,,370210000B0250,,,,,,,,,,,,,0,,,,,S,sols,,,5,0.670553,47.56922
2021-640039,2021-05-20,000001,Vente,147000,,,BOIS DE LA PATONNERIE,B018,37360,37021,Beaumont-Louestault,37,,,37021000ZI0041,,,,,,,,,,,,,0,,,,,T,terres,,,6660,0.669253,47.549778
2021-640039,2021-05-20,000001,Vente,147000,,,BOIS DE LA PATONNERIE,B018,37360,37021,Beaumont-Louestault,37,,,37021000ZK0059,,,,,,,,,,,,,0,,,,,BT,taillis simples,,,10987,0.669998,47.549788
2021-640039,2021-05-20,000001,Vente,147000,,,BOIS DE LA PATONNERIE,B018,37360,37021,Beaumont-Louestault,37,,,37021000ZK0060,,,,,,,,,,,,,0,,,,,BT,taillis simples,,,54371,0.671222,47.549258
2021-640039,2021-05-20,000001,Vente,147000,,,BOIS DE LA PATONNERIE,B018,37360,37021,Beaumont-Louestault,37,,,37021000ZK0062,,,,,,,,,,,,,0,,,,,BT,taillis simples,,,1852,0.672168,47.548541
2021-640039,2021-05-20,000001,Vente,147000,,,LA BUVINIERE,B036,37360,37021,Beaumont-Louestault,37,,,37021000ZK0066,,,,,,,,,,,,,0,,,,,T,terres,,,20557,0.67704,47.548589
2021-640039,2021-05-20,000001,Vente,147000,,,LA BUVINIERE,B036,37360,37021,Beaumont-Louestault,37,,,37021000ZK0066,,,,,,,,,,,,,0,,,,,BT,taillis simples,,,8994,0.67704,47.548589
2021-640039,2021-05-20,000001,Vente,147000,,,LA BUVINIERE,B036,37360,37021,Beaumont-Louestault,37,,,37021000ZK0066,,,,,,,,,,,,,0,,,,,BT,taillis simples,,,10509,0.67704,47.548589
2021-640039,2021-05-20,000001,Vente,147000,,,LA BUVINIERE,B036,37360,37021,Beaumont-Louestault,37,,,37021000ZK0067,,,,,,,,,,,,,0,,,,,BT,taillis simples,,,18493,0.679115,47.547769
2021-640039,2021-05-20,000001,Vente,147000,,,LA BUVINIERE,B036,37360,37021,Beaumont-Louestault,37,,,37021000ZK0068,,,,,,,,,,,,,0,,,,,BT,taillis simples,,,36344,0.679661,47.546328
2021-640039,2021-05-20,000001,Vente,147000,,,LA FOLIE,B071,37360,37021,Beaumont-Louestault,37,,,37021000ZK0086,,,,,,,,,,,,,0,,,,,BT,taillis simples,,,1333,0.673544,47.547811
2021-640039,2021-05-20,000001,Vente,147000,913,,CHE DE LA BUVINIERE,0114,37360,37021,Beaumont-Louestault,37,,,37021000ZK0109,,,,,,,,,,,,,0,1,Maison,44,1,T,terres,,,10903,0.681038,47.548357
2021-640039,2021-05-20,000001,Vente,147000,913,,CHE DE LA BUVINIERE,0114,37360,37021,Beaumont-Louestault,37,,,37021000ZK0109,,,,,,,,,,,,,0,3,Dépendance,,0,S,sols,,,5737,0.681038,47.548357
2021-640039,2021-05-20,000001,Vente,147000,913,,CHE DE LA BUVINIERE,0114,37360,37021,Beaumont-Louestault,37,,,37021000ZK0109,,,,,,,,,,,,,0,1,Maison,44,1,S,sols,,,5737,0.681038,47.548357
2021-640039,2021-05-20,000001,Vente,147000,913,,CHE DE LA BUVINIERE,0114,37360,37021,Beaumont-Louestault,37,,,37021000ZK0109,,,,,,,,,,,,,0,3,Dépendance,,0,BT,taillis simples,,,6645,0.681038,47.548357
2021-640039,2021-05-20,000001,Vente,147000,913,,CHE DE LA BUVINIERE,0114,37360,37021,Beaumont-Louestault,37,,,37021000ZK0109,,,,,,,,,,,,,0,1,Maison,44,1,BT,taillis simples,,,6645,0.681038,47.548357
2021-640039,2021-05-20,000001,Vente,147000,913,,CHE DE LA BUVINIERE,0114,37360,37021,Beaumont-Louestault,37,,,37021000ZK0109,,,,,,,,,,,,,0,3,Dépendance,,0,T,terres,,,15351,0.681038,47.548357
2021-640039,2021-05-20,000001,Vente,147000,913,,CHE DE LA BUVINIERE,0114,37360,37021,Beaumont-Louestault,37,,,37021000ZK0109,,,,,,,,,,,,,0,1,Maison,44,1,T,terres,,,15351,0.681038,47.548357
2021-640039,2021-05-20,000001,Vente,147000,913,,CHE DE LA BUVINIERE,0114,37360,37021,Beaumont-Louestault,37,,,37021000ZK0109,,,,,,,,,,,,,0,3,Dépendance,,0,T,terres,,,10903,0.681038,47.548357
2021-640234,2021-05-28,000001,Vente,3000,,,LE VIVIER,B202,37360,37021,Beaumont-Louestault,37,,,370210000A0090,,,,,,,,,,,,,0,,,,,BS,taillis sous futaie,,,81280,0.687659,47.576197
2021-640234,2021-05-28,000001,Vente,3000,,,LE VIVIER,B202,37360,37021,Beaumont-Louestault,37,,,370210000A0091,,,,,,,,,,,,,0,,,,,BS,taillis sous futaie,,,7640,0.684146,47.573668
2021-640264,2021-06-01,000001,Vente,1000,,,PRES LE MOULIN A VENT,B299,37370,37021,Beaumont-Louestault,37,,,370211350A0889,,,,,,,,,,,,,0,,,,,S,sols,,,1133,0.656194,47.621426
2021-640264,2021-06-01,000001,Vente,1000,,,PRES LE MOULIN A VENT,B299,37370,37021,Beaumont-Louestault,37,,,370211350A1131,,,,,,,,,,,,,0,,,,,S,sols,,,7,0.656687,47.62158
2021-640264,2021-06-01,000001,Vente,1000,,,PRES LE MOULIN A VENT,B299,37370,37021,Beaumont-Louestault,37,,,370211350A1135,,,,,,,,,,,,,0,,,,,T,terres,,,1417,0.657107,47.621349
2021-640266,2021-06-09,000001,Vente,1000,,,LA SEVRAUDIERE,B173,37360,37021,Beaumont-Louestault,37,,,37021000ZD0199,,,,,,,,,,,,,0,,,,,S,sols,,,4219,0.669485,47.55946
2021-640266,2021-06-09,000001,Vente,1000,,,RUE DE LA SEVRAUDIERE,0808,37360,37021,Beaumont-Louestault,37,,,37021000ZD0202,,,,,,,,,,,,,0,4,Local industriel. commercial ou assimilé,,0,S,sols,,,295,0.670962,47.559283
2021-640266,2021-06-09,000001,Vente,1000,,,LA SEVRAUDIERE,B173,37360,37021,Beaumont-Louestault,37,,,37021000ZD0222,,,,,,,,,,,,,0,,,,,S,sols,,,3060,0.671114,47.558436
2021-640266,2021-06-09,000001,Vente,1000,,,LA SEVRAUDIERE,B173,37360,37021,Beaumont-Louestault,37,,,37021000ZD0228,,,,,,,,,,,,,0,,,,,S,sols,,,10,0.67078,47.558843
2021-640266,2021-06-09,000001,Vente,1000,,,LA SEVRAUDIERE,B173,37360,37021,Beaumont-Louestault,37,,,37021000ZD0229,,,,,,,,,,,,,0,,,,,AB,terrains a bâtir,,,22,0.670717,47.558792
2021-640270,2021-06-01,000001,Vente,2000,,,PRES LE MOULIN A VENT,B299,37370,37021,Beaumont-Louestault,37,,,370211350A1130,,,,,,,,,,,,,0,,,,,T,terres,,,562,0.655718,47.622087
2021-640270,2021-06-01,000001,Vente,2000,,,PRES LE MOULIN A VENT,B299,37370,37021,Beaumont-Louestault,37,,,370211350A1133,,,,,,,,,,,,,0,,,,,T,terres,,,1175,0.6557,47.62189
2021-640270,2021-06-01,000001,Vente,2000,,,PRES LE MOULIN A VENT,B299,37370,37021,Beaumont-Louestault,37,,,370211350A1136,,,,,,,,,,,,,0,,,,,T,terres,,,1276,0.655521,47.621695
2021-640403,2021-06-15,000001,Vente,252600,29,,RTE DES COMMAILLERES,0146,37360,37021,Beaumont-Louestault,37,,,37021000ZK0118,,,,,,,,,,,,,0,1,Maison,99,4,S,sols,,,928,0.67235,47.543499
2021-640409,2021-06-16,000001,Vente,30000,,,LA LOUISATTIERE,B102,37360,37021,Beaumont-Louestault,37,,,37021000ZD0178,,,,,,,,,,,,,0,,,,,AB,terrains a bâtir,,,803,0.671773,47.559288
2021-640543,2021-06-22,000001,Vente,91250,7,,RUE DU ONZE NOVEMBRE,0665,37360,37021,Beaumont-Louestault,37,,,370210000B0394,,,,,,,,,,,,,0,3,Dépendance,,0,S,sols,,,145,0.671336,47.570409
2021-640543,2021-06-22,000001,Vente,91250,7,,RUE DU ONZE NOVEMBRE,0665,37360,37021,Beaumont-Louestault,37,,,370210000B0394,,,,,,,,,,,,,0,1,Maison,108,5,S,sols,,,145,0.671336,47.570409
2021-640608,2021-06-29,000001,Vente,7890,,,LES VAUX,B198,37360,37021,Beaumont-Louestault,37,,,37021000ZP0007,,,,,,,,,,,,,0,,,,,T,terres,,,26300,0.658084,47.563056
2021-640670,2021-07-01,000001,Vente,97000,,,LA HAUTE BORNE,B093,37360,37021,Beaumont-Louestault,37,,,37021000ZN0056,,,,,,,,,,,,,0,,,,,T,terres,,,33341,0.657001,47.548049
2021-640670,2021-07-01,000001,Vente,97000,,,LA HAUTE BORNE,B093,37360,37021,Beaumont-Louestault,37,,,37021000ZN0056,,,,,,,,,,,,,0,,,,,T,terres,,,34684,0.657001,47.548049
2021-640683,2021-07-08,000001,Vente,50000,2,,RUE DU LAVOIR,0822,37370,37021,Beaumont-Louestault,37,,,370211350A0354,,,,,,,,,,,,,0,3,Dépendance,,0,S,sols,,,64,0.648799,47.617126
2021-640683,2021-07-08,000001,Vente,50000,2,,RUE DU LAVOIR,0822,37370,37021,Beaumont-Louestault,37,,,370211350A0354,,,,,,,,,,,,,0,1,Maison,54,3,S,sols,,,64,0.648799,47.617126
2021-640683,2021-07-08,000001,Vente,50000,2,,RUE DU LAVOIR,0822,37370,37021,Beaumont-Louestault,37,,,370211350A0354,,,,,,,,,,,,,0,3,Dépendance,,0,S,sols,,,64,0.648799,47.617126
2021-640683,2021-07-08,000001,Vente,50000,,,LE BOURG,B216,37370,37021,Beaumont-Louestault,37,,,370211350A0535,,,,,,,,,,,,,0,,,,,S,sols,,,43,0.648802,47.617024
2021-640683,2021-07-08,000001,Vente,50000,,,LE BOURG,B216,37370,37021,Beaumont-Louestault,37,,,370211350A0975,,,,,,,,,,,,,0,,,,,S,sols,,,8,0.648845,47.617148
2021-640683,2021-07-08,000001,Vente,50000,,,LE BOURG,B216,37370,37021,Beaumont-Louestault,37,,,370211350A0976,,,,,,,,,,,,,0,,,,,S,sols,,,7,0.648756,47.61716
2021-640803,2021-07-02,000001,Vente,22000,,,LES POUPINIERES,B152,37360,37021,Beaumont-Louestault,37,,,370210000F0814,,,,,,,,,,,,,0,,,,,P,prés,,,6438,0.630987,47.571629
2021-640803,2021-07-02,000001,Vente,22000,,,LES POUPINIERES,B152,37360,37021,Beaumont-Louestault,37,,,370210000F0816,,,,,,,,,,,,,0,,,,,T,terres,,,1774,0.63074,47.570185
2021-640822,2021-07-05,000001,Vente,256000,9,,LES HAUTS DE LA CHOISILLE,0350,37360,37021,Beaumont-Louestault,37,,,37021000ZD0193,,,,,,,,,,,,,0,1,Maison,113,4,S,sols,,,892,0.670458,47.558729
2021-640850,2021-07-08,000001,Vente,25000,9,,IMP DE LA SAULTERIE,0809,37360,37021,Beaumont-Louestault,37,,,370210000B0268,,,,,,,,,,,,,0,1,Maison,35,1,S,sols,,,290,0.67129,47.568951
2021-640850,2021-07-08,000001,Vente,25000,7,,IMP DE LA SAULTERIE,0809,37360,37021,Beaumont-Louestault,37,,,370210000B0269,,,,,,,,,,,,,0,1,Maison,36,1,S,sols,,,200,0.671315,47.569003
2021-640850,2021-07-08,000001,Vente,25000,115,,IMP DE LA SAULTERIE,0809,37360,37021,Beaumont-Louestault,37,,,370210000B0292,,,,,,,,,,,,,0,3,Dépendance,,0,S,sols,,,30,0.671676,47.568967
2021-640850,2021-07-08,000001,Vente,25000,116,,IMP DE LA SAULTERIE,0809,37360,37021,Beaumont-Louestault,37,,,370210000B0293,,,,,,,,,,,,,0,3,Dépendance,,0,S,sols,,,30,0.671654,47.568929
2021-640850,2021-07-08,000001,Vente,25000,,,LE BOURG,B030,37360,37021,Beaumont-Louestault,37,,,370210000B0936,,,,,,,,,,,,,0,,,,,J,jardins,POTAG,Jardin potager,1021,0.671771,47.56888
2021-640866,2021-07-28,000001,Vente,245400,6,,LOT CLOS DES BRUYERES,A010,37360,37021,Beaumont-Louestault,37,,,370210000B0998,,,,,,,,,,,,,0,1,Maison,118,5,S,sols,,,914,0.674976,47.575004
2021-640866,2021-07-28,000001,Vente,245400,,,LES CARRIERES,B038,37360,37021,Beaumont-Louestault,37,,,370210000B1014,,,,,,,,,,,,,0,,,,,AG,terrains d'agrément,,,519,0.675309,47.574757
2021-640868,2021-07-19,000001,Vente,182100,25,,RUE DE LA CHAPELLE ST COME,0816,37370,37021,Beaumont-Louestault,37,,,370211350A1107,,,,,,,,,,,,,0,1,Maison,83,4,S,sols,,,946,0.655101,47.617509
2021-640868,2021-07-19,000001,Vente,182100,,,LA CHAPELLE SAINT COME,B221,37370,37021,Beaumont-Louestault,37,,,370211350A1110,,,,,,,,,,,,,0,,,,,S,sols,,,55,0.655168,47.617402
2021-640883,2021-07-21,000001,Vente,1000,,,PRES LE MOULIN A VENT,B299,37370,37021,Beaumont-Louestault,37,,,370211350A0109,,,,,,,,,,,,,0,,,,,T,terres,,,3173,0.656173,47.622118
2021-640891,2021-07-16,000001,Vente,223000,12,,RUE DE LA BLOTTIERE,0110,37360,37021,Beaumont-Louestault,37,,,37021000ZO0011,,,,,,,,,,,,,0,1,Maison,86,4,AG,terrains d'agrément,,,223,0.639729,47.552727
2021-640891,2021-07-16,000001,Vente,223000,12,,RUE DE LA BLOTTIERE,0110,37360,37021,Beaumont-Louestault,37,,,37021000ZO0011,,,,,,,,,,,,,0,1,Maison,86,4,S,sols,,,1000,0.639729,47.552727
2021-641015,2021-07-19,000001,Vente,138600,2,,IMP DE LA DINDASSIERE,0832,37370,37021,Beaumont-Louestault,37,,,370211350A0178,,,,,,,,,,,,,0,1,Maison,19,1,S,sols,,,215,0.649517,47.618049
2021-641015,2021-07-19,000001,Vente,138600,2,,IMP DE LA DINDASSIERE,0832,37370,37021,Beaumont-Louestault,37,,,370211350A0178,,,,,,,,,,,,,0,1,Maison,109,4,S,sols,,,215,0.649517,47.618049
2021-641186,2021-08-03,000001,Vente,164000,6,,RUE DE LA POTERIE,0700,37360,37021,Beaumont-Louestault,37,,,370210000B0372,,,,,,,,,,,,,0,1,Maison,92,4,S,sols,,,805,0.672187,47.570655
2021-641204,2021-08-02,000001,Vente,151000,264,,RTE DE LA GUILLONNIERE,0325,37360,37021,Beaumont-Louestault,37,,,37021000ZP0027,,,,,,,,,,,,,0,1,Maison,60,2,S,sols,,,1026,0.665228,47.559221
2021-641204,2021-08-02,000001,Vente,151000,264,,RTE DE LA GUILLONNIERE,0325,37360,37021,Beaumont-Louestault,37,,,37021000ZP0027,,,,,,,,,,,,,0,3,Dépendance,,0,S,sols,,,1026,0.665228,47.559221