id_mutation,date_mutation,numero_disposition,nature_mutation,valeur_fonciere,adresse_numero,adresse_suffixe,adresse_nom_voie,adresse_code_voie,code_postal,code_commune,nom_commune,code_departement,ancien_code_commune,ancien_nom_commune,id_parcelle,ancien_id_parcelle,numero_volume,lot1_numero,lot1_surface_carrez,lot2_numero,lot2_surface_carrez,lot3_numero,lot3_surface_carrez,lot4_numero,lot4_surface_carrez,lot5_numero,lot5_surface_carrez,nombre_lots,code_type_local,type_local,surface_reelle_bati,nombre_pieces_principales,code_nature_culture,nature_culture,code_nature_culture_speciale,nature_culture_speciale,surface_terrain,longitude,latitude
2021-646571,2021-03-18,000001,Vente,29784,,,LA BAILLAUDIERE,B002,37600,37053,Chanceaux-près-Loches,37,,,370530000C0361,,,,,,,,,,,,,0,,,,,T,terres,,,2217,0.959397,47.136234
2021-646571,2021-03-18,000001,Vente,29784,,,LA BAILLAUDIERE,B002,37600,37053,Chanceaux-près-Loches,37,,,370530000C0364,,,,,,,,,,,,,0,,,,,T,terres,,,147,0.95906,47.136286
2021-646571,2021-03-18,000001,Vente,29784,,,LA BAILLAUDIERE,B002,37600,37053,Chanceaux-près-Loches,37,,,370530000C0366,,,,,,,,,,,,,0,,,,,T,terres,,,118,0.959001,47.136267
2021-647510,2021-09-16,000001,Vente,58080,13,,RUE DU MOULIN,0100,37600,37053,Chanceaux-près-Loches,37,,,370530000B0183,,,,,,,,,,,,,0,1,Maison,100,5,S,sols,,,500,0.982214,47.14746
2021-647510,2021-09-16,000001,Vente,58080,13,,RUE DU MOULIN,0100,37600,37053,Chanceaux-près-Loches,37,,,370530000B0183,,,,,,,,,,,,,0,1,Maison,100,5,J,jardins,POTAG,Jardin potager,1337,0.982214,47.14746
2021-647510,2021-09-16,000001,Vente,58080,,,L ETANG,B022,37600,37053,Chanceaux-près-Loches,37,,,370530000B0201,,,,,,,,,,,,,0,,,,,T,terres,,,236,0.982499,47.147227
2021-647631,2021-09-30,000002,Vente,250000,4,,CHE DU BOIS MARIE,0020,37600,37053,Chanceaux-près-Loches,37,,,37053000ZA0028,,,,,,,,,,,,,0,3,Dépendance,,0,S,sols,,,215,0.980482,47.149699
2021-647631,2021-09-30,000002,Vente,250000,4,,CHE DU BOIS MARIE,0020,37600,37053,Chanceaux-près-Loches,37,,,37053000ZA0028,,,,,,,,,,,,,0,1,Maison,117,5,S,sols,,,215,0.980482,47.149699
2021-647944,2021-12-15,000001,Vente,15600,,,LE BOIS MARIE,B006,37600,37053,Chanceaux-près-Loches,37,,,37053000ZA0009,,,,,,,,,,,,,0,,,,,T,terres,,,31230,0.976633,47.148123
2021-647992,2021-12-15,000001,Vente,1000,,,L ETANG,B022,37600,37053,Chanceaux-près-Loches,37,,,370530000B0079,,,,,,,,,,,,,0,,,,,T,terres,,,892,0.989528,47.148377
2021-648021,2021-12-20,000001,Vente,150000,,,L ETANG,B022,37600,37053,Chanceaux-près-Loches,37,,,37053000ZA0041,,,,,,,,,,,,,0,,,,,T,terres,,,205,0.988602,47.149342
2021-648021,2021-12-20,000001,Vente,150000,,,L ETANG,B022,37600,37053,Chanceaux-près-Loches,37,,,37053000ZA0041,,,,,,,,,,,,,0,,,,,T,terres,,,614,0.988602,47.149342
2021-648021,2021-12-20,000001,Vente,150000,11,,RUE DE CORNILLE,0045,37600,37053,Chanceaux-près-Loches,37,,,37053000ZA0045,,,,,,,,,,,,,0,1,Maison,101,5,S,sols,,,500,0.988506,47.14925
2021-648021,2021-12-20,000001,Vente,150000,11,,RUE DE CORNILLE,0045,37600,37053,Chanceaux-près-Loches,37,,,37053000ZA0045,,,,,,,,,,,,,0,1,Maison,101,5,AG,terrains d'agrément,,,312,0.988506,47.14925
2021-648024,2021-12-20,000001,Vente,180000,,,L ETANG,B022,37600,37053,Chanceaux-près-Loches,37,,,37053000ZA0042,,,,,,,,,,,,,0,,,,,T,terres,,,137,0.98866,47.149396
2021-648024,2021-12-20,000001,Vente,180000,,,L ETANG,B022,37600,37053,Chanceaux-près-Loches,37,,,37053000ZA0042,,,,,,,,,,,,,0,,,,,T,terres,,,412,0.98866,47.149396
