id_mutation,date_mutation,numero_disposition,nature_mutation,valeur_fonciere,adresse_numero,adresse_suffixe,adresse_nom_voie,adresse_code_voie,code_postal,code_commune,nom_commune,code_departement,ancien_code_commune,ancien_nom_commune,id_parcelle,ancien_id_parcelle,numero_volume,lot1_numero,lot1_surface_carrez,lot2_numero,lot2_surface_carrez,lot3_numero,lot3_surface_carrez,lot4_numero,lot4_surface_carrez,lot5_numero,lot5_surface_carrez,nombre_lots,code_type_local,type_local,surface_reelle_bati,nombre_pieces_principales,code_nature_culture,nature_culture,code_nature_culture_speciale,nature_culture_speciale,surface_terrain,longitude,latitude
2021-672731,2021-01-06,000001,Vente,100000,,,LES VALUZES,B022,38270,38198,Jarcieu,38,,,38198000ZE0261,,,,,,,,,,,,,0,,,,,AB,terrains a bâtir,,,895,4.941929,45.332189
2021-673261,2021-02-12,000001,Vente,199000,22,,LOT LES ALOUETTES,A003,38270,38198,Jarcieu,38,,,381980000B1238,,,,,,,,,,,,,0,1,Maison,85,3,S,sols,,,1076,4.953022,45.336651
2021-673478,2021-02-18,000001,Vente,142898,646,,RTE DEPARTEMENTALE 519,0037,38270,38198,Jarcieu,38,,,381980000B1400,,,1,,,,,,,,,,1,2,Appartement,93,4,,,,,,4.954975,45.335308
2021-673478,2021-02-18,000001,Vente,142898,646,,RTE DEPARTEMENTALE 519,0037,38270,38198,Jarcieu,38,,,381980000B1400,,,4,,,,,,,,,,1,3,Dépendance,,0,,,,,,4.954975,45.335308
2021-673478,2021-02-18,000001,Vente,142898,646,,RTE DEPARTEMENTALE 519,0037,38270,38198,Jarcieu,38,,,381980000B1400,,,4,,,,,,,,,,1,3,Dépendance,,0,,,,,,4.954975,45.335308
2021-673761,2021-02-18,000001,Vente,180000,,,LES RANCINES,B020,38270,38198,Jarcieu,38,,,38198000ZB0137,,,,,,,,,,,,,0,,,,,AB,terrains a bâtir,,,907,4.947356,45.33841
2021-673761,2021-02-18,000001,Vente,180000,67,,LOT LE CLOS DU SOLEIL,A020,38270,38198,Jarcieu,38,,,38198000ZB0138,,,,,,,,,,,,,0,1,Maison,124,4,S,sols,,,847,4.947706,45.338598
2021-673761,2021-02-18,000001,Vente,180000,,,LES RANCINES,B020,38270,38198,Jarcieu,38,,,38198000ZB0139,,,,,,,,,,,,,0,,,,,AB,terrains a bâtir,,,844,4.948018,45.338677
2021-674000,2021-03-26,000001,Vente,270300,20,,LOT LE PUITS DODO,A050,38270,38198,Jarcieu,38,,,381980000B1365,,,,,,,,,,,,,0,1,Maison,105,5,S,sols,,,800,4.950137,45.336975
2021-674053,2021-02-18,000001,Vente terrain à bâtir,100000,,,LES RANCINES,B020,38270,38198,Jarcieu,38,,,38198000ZB0139,,,,,,,,,,,,,0,,,,,AB,terrains a bâtir,,,844,4.948018,45.338677
2021-674145,2021-03-25,000002,Echange,20711,,,PATIERES,B016,38270,38198,Jarcieu,38,,,38198000ZE0117,,,,,,,,,,,,,0,,,,,VE,vergers,,,29645,4.953214,45.328626
2021-674145,2021-03-25,000002,Echange,20711,,,PATIERES,B016,38270,38198,Jarcieu,38,,,38198000ZE0117,,,,,,,,,,,,,0,,,,,BT,taillis simples,,,4840,4.953214,45.328626
2021-674145,2021-03-25,000002,Echange,20711,,,LES VALUZES,B022,38270,38198,Jarcieu,38,,,38198000ZH0067,,,,,,,,,,,,,0,,,,,T,terres,,,16040,4.934811,45.32657
2021-674145,2021-03-25,000002,Echange,20711,,,LES VALUZES,B022,38270,38198,Jarcieu,38,,,38198000ZH0067,,,,,,,,,,,,,0,,,,,BT,taillis simples,,,1160,4.934811,45.32657
2021-674145,2021-03-25,000002,Echange,20711,,,LES VALUZES,B022,38270,38198,Jarcieu,38,,,38198000ZH0068,,,,,,,,,,,,,0,,,,,BT,taillis simples,,,988,4.935255,45.325509
2021-674146,2021-03-25,000003,Echange,6311,,,LES VALUZES,B022,38270,38198,Jarcieu,38,,,38198000ZE0299,,,,,,,,,,,,,0,,,,,T,terres,,,8264,4.945895,45.32978
2021-674146,2021-03-25,000003,Echange,6311,,,LES VALUZES,B022,38270,38198,Jarcieu,38,,,38198000ZE0301,,,,,,,,,,,,,0,,,,,VE,vergers,,,7790,4.944704,45.329516
2021-674158,2021-04-02,000001,Vente,65000,,,LES BLACHES,B002,38270,38198,Jarcieu,38,,,38198000ZE0249,,,,,,,,,,,,,0,,,,,T,terres,,,4669,,
2021-674158,2021-04-02,000001,Vente,65000,,,LES MARANDES,B013,38270,38198,Jarcieu,38,,,38198000ZE0275,,,,,,,,,,,,,0,,,,,AB,terrains a bâtir,,,157,,
2021-674158,2021-04-02,000001,Vente,65000,,,LES BLACHES,B002,38270,38198,Jarcieu,38,,,38198000ZE0281,,,,,,,,,,,,,0,,,,,T,terres,,,1218,,
2021-674158,2021-04-02,000001,Vente,65000,,,LES BLACHES,B002,38270,38198,Jarcieu,38,,,38198000ZE0285,,,,,,,,,,,,,0,,,,,S,sols,,,2718,,
2021-674317,2021-04-02,000003,Vente,8490,,,LES BLACHES,B002,38270,38198,Jarcieu,38,,,38198000ZE0295,,,,,,,,,,,,,0,,,,,S,sols,,,1541,4.959893,45.330764
2021-674317,2021-04-02,000003,Vente,8490,,,LES MARANDES,B013,38270,38198,Jarcieu,38,,,38198000ZE0296,,,,,,,,,,,,,0,,,,,AB,terrains a bâtir,,,157,4.960152,45.330891
2021-674863,2021-05-11,000001,Vente,335000,139,,CHE DU BOSQUET,0012,38270,38198,Jarcieu,38,,,38198000ZE0259,,,,,,,,,,,,,0,4,Local industriel. commercial ou assimilé,103,0,S,sols,,,630,4.942543,45.332387
2021-675127,2021-05-17,000001,Vente,60000,5215,,LE VILLAGE,B025,38270,38198,Jarcieu,38,,,381980000A0706,,,,,,,,,,,,,0,1,Maison,98,4,S,sols,,,710,4.945405,45.335483
2021-675127,2021-05-17,000001,Vente,60000,,,LE VILLAGE,B025,38270,38198,Jarcieu,38,,,381980000A0709,,,,,,,,,,,,,0,,,,,S,sols,,,19,4.945362,45.335431
2021-675754,2021-07-05,000001,Vente,432500,85,,LOT LE CLOS DU SOLEIL,A020,38270,38198,Jarcieu,38,,,38198000ZB0131,,,,,,,,,,,,,0,1,Maison,139,5,S,sols,,,1019,4.948364,45.338771
2021-675850,2021-07-05,000001,Vente,63000,,,LE VILLAGE,B025,38270,38198,Jarcieu,38,,,381980000B1432,,,,,,,,,,,,,0,,,,,AB,terrains a bâtir,,,688,4.94651,45.337302
2021-675864,2021-07-01,000001,Vente,213750,70,,LOT LE CLOS DES VALUZES,A021,38270,38198,Jarcieu,38,,,38198000ZE0212,,,2,113.1,,,,,,,,,1,1,Maison,112,5,,,,,,4.943583,45.332594
2021-675889,2021-06-23,000002,Echange,320,,,LE VILLAGE,B025,38270,38198,Jarcieu,38,,,381980000A0742,,,,,,,,,,,,,0,,,,,S,sols,,,32,4.945627,45.335111
2021-675889,2021-06-23,000003,Echange,320,,,LE VILLAGE,B025,38270,38198,Jarcieu,38,,,381980000A0744,,,,,,,,,,,,,0,,,,,S,sols,,,32,4.945763,45.335056
2021-676017,2021-07-08,000001,Vente,122000,2374,,RTE DEPARTEMENTALE 519,0037,38270,38198,Jarcieu,38,,,38198000ZB0140,,,,,,,,,,,,,0,1,Maison,103,4,,,,,,4.935265,45.336643
2021-676690,2021-06-23,000001,Vente,105000,45,,RTE DE ST SULPICE,0060,38270,38198,Jarcieu,38,,,381980000A0741,,,,,,,,,,,,,0,1,Maison,40,3,S,sols,,,325,4.945853,45.33512
2021-676690,2021-06-23,000001,Vente,105000,,,LE VILLAGE,B025,38270,38198,Jarcieu,38,,,381980000A0744,,,,,,,,,,,,,0,,,,,S,sols,,,32,4.945763,45.335056
2021-677249,2021-09-10,000001,Echange,1500,,,LE VILLAGE,B025,38270,38198,Jarcieu,38,,,381980000A0740,,2,,,,,,,,,,,0,,,,,,,,,,4.945758,45.333127
2021-677249,2021-09-10,000002,Echange,1500,,,LE VILLAGE,B025,38270,38198,Jarcieu,38,,,381980000A0738,,1,,,,,,,,,,,0,,,,,,,,,,4.945771,45.333171
2021-677508,2021-09-17,000001,Vente,241500,38,,LOT LE CLOS DES VALUZES,A021,38270,38198,Jarcieu,38,,,38198000ZE0211,,,1,106.96,,,,,,,,,1,1,Maison,107,4,,,,,,4.94333,45.332555
2021-677603,2021-09-10,000001,Vente,155000,1479,,RTE DEPARTEMENTALE 519,0037,38270,38198,Jarcieu,38,,,381980000A0737,,,,,,,,,,,,,0,1,Maison,77,4,S,sols,,,1443,4.945433,45.333022
2021-677603,2021-09-10,000001,Vente,155000,,,LE VILLAGE,B025,38270,38198,Jarcieu,38,,,381980000A0738,,2,,,,,,,,,,,0,,,,,,,,,,4.945771,45.333171
2021-677603,2021-09-10,000001,Vente,155000,,,LE VILLAGE,B025,38270,38198,Jarcieu,38,,,381980000A0740,,2,,,,,,,,,,,0,,,,,,,,,,4.945758,45.333127
2021-678272,2021-11-05,000001,Vente,261098.8,55,,RUE J DE ROSTAING LA VALUZE,0076,38270,38198,Jarcieu,38,,,381980000B1424,,,,,,,,,,,,,0,3,Dépendance,,0,S,sols,,,668,4.946356,45.336958
2021-678272,2021-11-05,000001,Vente,261098.8,55,,RUE J DE ROSTAING LA VALUZE,0076,38270,38198,Jarcieu,38,,,381980000B1424,,,,,,,,,,,,,0,1,Maison,95,5,S,sols,,,668,4.946356,45.336958
2021-678691,2021-11-26,000001,Vente,61500,,,LE VILLAGE,B025,38270,38198,Jarcieu,38,,,381980000B1430,,,,,,,,,,,,,0,,,,,AB,terrains a bâtir,,,673,4.945946,45.33712
2021-679130,2021-09-28,000001,Vente,274560,1488,,RTE DEPARTEMENTALE 519,0037,38270,38198,Jarcieu,38,,,381980000A0411,,,,,,,,,,,,,0,3,Dépendance,,0,S,sols,,,386,4.945195,45.333298
2021-679130,2021-09-28,000001,Vente,274560,1488,,RTE DEPARTEMENTALE 519,0037,38270,38198,Jarcieu,38,,,381980000A0411,,,,,,,,,,,,,0,3,Dépendance,,0,S,sols,,,386,4.945195,45.333298
2021-679130,2021-09-28,000001,Vente,274560,1488,,RTE DEPARTEMENTALE 519,0037,38270,38198,Jarcieu,38,,,381980000A0411,,,,,,,,,,,,,0,1,Maison,107,5,S,sols,,,386,4.945195,45.333298
2021-679130,2021-09-28,000001,Vente,274560,1488,,RTE DEPARTEMENTALE 519,0037,38270,38198,Jarcieu,38,,,381980000A0411,,,,,,,,,,,,,0,4,Local industriel. commercial ou assimilé,15,0,S,sols,,,386,4.945195,45.333298
