id_mutation,date_mutation,numero_disposition,nature_mutation,valeur_fonciere,adresse_numero,adresse_suffixe,adresse_nom_voie,adresse_code_voie,code_postal,code_commune,nom_commune,code_departement,ancien_code_commune,ancien_nom_commune,id_parcelle,ancien_id_parcelle,numero_volume,lot1_numero,lot1_surface_carrez,lot2_numero,lot2_surface_carrez,lot3_numero,lot3_surface_carrez,lot4_numero,lot4_surface_carrez,lot5_numero,lot5_surface_carrez,nombre_lots,code_type_local,type_local,surface_reelle_bati,nombre_pieces_principales,code_nature_culture,nature_culture,code_nature_culture_speciale,nature_culture_speciale,surface_terrain,longitude,latitude
2021-688518,2021-10-28,000001,Vente,875,,,CHAMP DU CIMETIERE,B020,39800,39065,Bonnefontaine,39,,,39065000ZA0051,,,,,,,,,,,,,0,,,,,T,terres,,,2627,5.723702,46.738653
2021-688518,2021-10-28,000001,Vente,875,,,CHAMP DU CIMETIERE,B020,39800,39065,Bonnefontaine,39,,,39065000ZA0052,,,,,,,,,,,,,0,,,,,T,terres,,,3842,5.723244,46.738542
2021-689031,2021-11-20,000001,Vente,,,,FONTAINE FROIDE,B080,39800,39065,Bonnefontaine,39,,,39065000ZE0040,,,,,,,,,,,,,0,,,,,AB,terrains a bâtir,CHEM,Chemin (non groupe),627,5.74405,46.716123
2021-689222,2021-11-30,000001,Vente,107500,,,VILLAGE,B140,39800,39065,Bonnefontaine,39,,,39065000AA0052,,,,,,,,,,,,,0,,,,,S,sols,,,977,,
2021-689222,2021-11-30,000001,Vente,107500,1,,RUE DE LA TOUPE,0080,39800,39065,Bonnefontaine,39,,,39065000AA0053,,,,,,,,,,,,,0,1,Maison,85,4,S,sols,,,1112,5.747226,46.727639
2021-689862,2021-12-16,000001,Vente,5500,,,AU CHAURET,B043,39800,39065,Bonnefontaine,39,,,39065000ZC0004,,,,,,,,,,,,,0,,,,,BT,taillis simples,,,1993,5.76453,46.737924
2021-689862,2021-12-16,000001,Vente,5500,,,AU CHAURET,B043,39800,39065,Bonnefontaine,39,,,39065000ZC0004,,,,,,,,,,,,,0,,,,,T,terres,,,13422,5.76453,46.737924
2021-689862,2021-12-16,000001,Vente,5500,,,AU CHAURET,B043,39800,39065,Bonnefontaine,39,,,39065000ZC0004,,,,,,,,,,,,,0,,,,,BT,taillis simples,,,4543,5.76453,46.737924
2021-689862,2021-12-16,000001,Vente,5500,,,AU BIEF RICHARD,B008,39800,39065,Bonnefontaine,39,,,39065000ZC0061,,,,,,,,,,,,,0,,,,,BS,taillis sous futaie,,,798,5.76749,46.736234
2021-689862,2021-12-16,000001,Vente,5500,,,LA COTE,B059,39800,39065,Bonnefontaine,39,,,39065000ZD0051,,,,,,,,,,,,,0,,,,,P,prés,,,1964,5.758814,46.730732
2021-689862,2021-12-16,000001,Vente,5500,,,LA COTE,B059,39800,39065,Bonnefontaine,39,,,39065000ZD0051,,,,,,,,,,,,,0,,,,,BT,taillis simples,,,760,5.758814,46.730732
2021-689862,2021-12-16,000001,Vente,5500,,,LA COTE,B059,39800,39065,Bonnefontaine,39,,,39065000ZD0051,,,,,,,,,,,,,0,,,,,BR,futaies résineuses,,,1151,5.758814,46.730732
2021-689864,2021-12-17,000001,Vente,1750,,,LA COTE,B059,39800,39065,Bonnefontaine,39,,,39065000ZD0048,,,,,,,,,,,,,0,,,,,BR,futaies résineuses,,,2594,5.758111,46.729825
2021-689864,2021-12-17,000001,Vente,1750,,,LA COTE,B059,39800,39065,Bonnefontaine,39,,,39065000ZD0048,,,,,,,,,,,,,0,,,,,P,prés,,,2880,5.758111,46.729825
2021-689865,2021-12-17,000002,Vente,600,,,CREVE COEUR,B062,39800,39065,Bonnefontaine,39,,,39065000ZB0016,,,,,,,,,,,,,0,,,,,BR,futaies résineuses,,,4952,5.747829,46.734994
