id_mutation,date_mutation,numero_disposition,nature_mutation,valeur_fonciere,adresse_numero,adresse_suffixe,adresse_nom_voie,adresse_code_voie,code_postal,code_commune,nom_commune,code_departement,ancien_code_commune,ancien_nom_commune,id_parcelle,ancien_id_parcelle,numero_volume,lot1_numero,lot1_surface_carrez,lot2_numero,lot2_surface_carrez,lot3_numero,lot3_surface_carrez,lot4_numero,lot4_surface_carrez,lot5_numero,lot5_surface_carrez,nombre_lots,code_type_local,type_local,surface_reelle_bati,nombre_pieces_principales,code_nature_culture,nature_culture,code_nature_culture_speciale,nature_culture_speciale,surface_terrain,longitude,latitude
2021-683368,2021-02-26,000002,Vente,2500,,,MOLARD CASSIS,B033,39250,39083,Censeau,39,,,39083000ZD0185,,,,,,,,,,,,,0,,,,,T,terres,,,3364,6.079334,46.801198
2021-683962,2021-03-30,000001,Vente,120000,,,AU VILLAGE,B075,39250,39083,Censeau,39,,,39083000AO0140,,,,,,,,,,,,,0,,,,,J,jardins,,,30,6.066422,46.814409
2021-683962,2021-03-30,000001,Vente,120000,3,,RUE DU MAGASIN,0050,39250,39083,Censeau,39,,,39083000AO0241,,,,,,,,,,,,,0,1,Maison,152,4,S,sols,,,380,6.066318,46.814383
2021-683962,2021-03-30,000001,Vente,120000,,,AU VILLAGE,B075,39250,39083,Censeau,39,,,39083000AO0242,,,,,,,,,,,,,0,,,,,S,sols,,,83,6.066498,46.814298
2021-683962,2021-03-30,000001,Vente,120000,,,AU VILLAGE,B075,39250,39083,Censeau,39,,,39083000AO0274,,,,,,,,,,,,,0,,,,,S,sols,,,300,6.066312,46.814211
2021-684467,2021-04-23,000001,Vente,220000,1,,RUE DU VAL DE MIEGES,0085,39250,39083,Censeau,39,,,39083000AO0158,,,2,106.28,4,,5,,6,,,,4,1,Maison,83,2,,,,,,6.067711,46.81363
2021-684499,2021-04-29,000002,Vente,68717,,,LE PARU,B046,39250,39083,Censeau,39,,,39083000ZA0285,,,,,,,,,,,,,0,,,,,T,terres,,,1123,6.063619,46.816474
2021-685364,2021-06-12,000001,Vente,248750,2,,RUE DES TARROTS,0072,39250,39083,Censeau,39,,,39083000ZA0207,,,,,,,,,,,,,0,1,Maison,106,4,S,sols,,,1000,6.06635,46.815799
2021-685364,2021-06-12,000001,Vente,248750,2,,RUE DES TARROTS,0072,39250,39083,Censeau,39,,,39083000ZA0207,,,,,,,,,,,,,0,3,Dépendance,,0,S,sols,,,1000,6.06635,46.815799
2021-685768,2021-06-22,000001,Vente,129100,1,,RUE DU VAL DE MIEGES,0085,39250,39083,Censeau,39,,,39083000AO0158,,,1,124.91,3,52.21,,,,,,,2,1,Maison,122,3,,,,,,6.067711,46.81363
2021-685768,2021-06-22,000001,Vente,129100,5162,,RUE DES FORGERONS,0027,39250,39083,Censeau,39,,,39083000AO0238,,,,,,,,,,,,,0,,,,,J,jardins,,,250,6.068158,46.813773
2021-686455,2021-07-13,000001,Vente,325000,23,,RUE DES TARROTS,0072,39250,39083,Censeau,39,,,39083000ZA0242,,,,,,,,,,,,,0,1,Maison,152,7,S,sols,,,1128,6.062683,46.816138
2021-686698,2021-07-27,000001,Vente,298100,10,T,RUE DU MAGASIN,0050,39250,39083,Censeau,39,,,39083000ZA0239,,,,,,,,,,,,,0,1,Maison,97,5,S,sols,,,850,6.062861,46.815823
2021-686698,2021-07-27,000001,Vente,298100,10,T,RUE DU MAGASIN,0050,39250,39083,Censeau,39,,,39083000ZA0239,,,,,,,,,,,,,0,3,Dépendance,,0,S,sols,,,850,6.062861,46.815823
2021-686698,2021-07-27,000001,Vente,298100,,,LE TARTRE,B068,39250,39083,Censeau,39,,,39083000ZA0260,,,,,,,,,,,,,0,,,,,T,terres,,,487,6.062522,46.815937
2021-686816,2021-07-29,000001,Vente,220623264,7,,RUE DU VIOLON,0090,39250,39083,Censeau,39,,,39083000AO0122,,,,,,,,,,,,,0,3,Dépendance,,0,S,sols,,,595,6.067256,46.814878
2021-686816,2021-07-29,000001,Vente,220623264,7,,RUE DU VIOLON,0090,39250,39083,Censeau,39,,,39083000AO0122,,,,,,,,,,,,,0,3,Dépendance,,0,S,sols,,,595,6.067256,46.814878
2021-686816,2021-07-29,000001,Vente,220623264,7,,RUE DU VIOLON,0090,39250,39083,Censeau,39,,,39083000AO0122,,,,,,,,,,,,,0,3,Dépendance,,0,S,sols,,,595,6.067256,46.814878
2021-686816,2021-07-29,000001,Vente,220623264,7,,RUE DU VIOLON,0090,39250,39083,Censeau,39,,,39083000AO0122,,,,,,,,,,,,,0,2,Appartement,141,3,S,sols,,,595,6.067256,46.814878
2021-686816,2021-07-29,000001,Vente,220623264,7,,RUE DU VIOLON,0090,39250,39083,Censeau,39,,,39083000AO0122,,,,,,,,,,,,,0,3,Dépendance,,0,S,sols,,,595,6.067256,46.814878
2021-686816,2021-07-29,000001,Vente,220623264,7,,RUE DU VIOLON,0090,39250,39083,Censeau,39,,,39083000AO0122,,,,,,,,,,,,,0,2,Appartement,87,4,S,sols,,,595,6.067256,46.814878
2021-686816,2021-07-29,000001,Vente,220623264,1,,RUE DE LA SOURCE,0070,39250,39083,Censeau,39,,,39083000ZA0162,,,,,,,,,,,,,0,3,Dépendance,,0,S,sols,,,2200,6.06672,46.813557
2021-686816,2021-07-29,000001,Vente,220623264,1,,RUE DE LA SOURCE,0070,39250,39083,Censeau,39,,,39083000ZA0162,,,,,,,,,,,,,0,3,Dépendance,,0,S,sols,,,2200,6.06672,46.813557
2021-686816,2021-07-29,000001,Vente,220623264,1,,RUE DE LA SOURCE,0070,39250,39083,Censeau,39,,,39083000ZA0162,,,,,,,,,,,,,0,3,Dépendance,,0,S,sols,,,2200,6.06672,46.813557
2021-686816,2021-07-29,000001,Vente,220623264,1,,RUE DE LA SOURCE,0070,39250,39083,Censeau,39,,,39083000ZA0162,,,,,,,,,,,,,0,3,Dépendance,,0,S,sols,,,2200,6.06672,46.813557
2021-686816,2021-07-29,000001,Vente,220623264,1,,RUE DE LA SOURCE,0070,39250,39083,Censeau,39,,,39083000ZA0162,,,,,,,,,,,,,0,3,Dépendance,,0,S,sols,,,2200,6.06672,46.813557
2021-686816,2021-07-29,000001,Vente,220623264,1,,RUE DE LA SOURCE,0070,39250,39083,Censeau,39,,,39083000ZA0162,,,,,,,,,,,,,0,2,Appartement,79,4,S,sols,,,2200,6.06672,46.813557
2021-686816,2021-07-29,000001,Vente,220623264,1,,RUE DE LA SOURCE,0070,39250,39083,Censeau,39,,,39083000ZA0162,,,,,,,,,,,,,0,3,Dépendance,,0,S,sols,,,2200,6.06672,46.813557
2021-686816,2021-07-29,000001,Vente,220623264,1,,RUE DE LA SOURCE,0070,39250,39083,Censeau,39,,,39083000ZA0162,,,,,,,,,,,,,0,2,Appartement,79,4,S,sols,,,2200,6.06672,46.813557
2021-686816,2021-07-29,000001,Vente,220623264,1,,RUE DE LA SOURCE,0070,39250,39083,Censeau,39,,,39083000ZA0162,,,,,,,,,,,,,0,3,Dépendance,,0,S,sols,,,2200,6.06672,46.813557
2021-686816,2021-07-29,000001,Vente,220623264,1,,RUE DE LA SOURCE,0070,39250,39083,Censeau,39,,,39083000ZA0162,,,,,,,,,,,,,0,2,Appartement,79,4,S,sols,,,2200,6.06672,46.813557
2021-686816,2021-07-29,000001,Vente,220623264,1,,RUE DE LA SOURCE,0070,39250,39083,Censeau,39,,,39083000ZA0162,,,,,,,,,,,,,0,3,Dépendance,,0,S,sols,,,2200,6.06672,46.813557
2021-686816,2021-07-29,000001,Vente,220623264,1,,RUE DE LA SOURCE,0070,39250,39083,Censeau,39,,,39083000ZA0162,,,,,,,,,,,,,0,3,Dépendance,,0,S,sols,,,2200,6.06672,46.813557
2021-686816,2021-07-29,000001,Vente,220623264,1,,RUE DE LA SOURCE,0070,39250,39083,Censeau,39,,,39083000ZA0162,,,,,,,,,,,,,0,3,Dépendance,,0,S,sols,,,2200,6.06672,46.813557
2021-686816,2021-07-29,000001,Vente,220623264,1,,RUE DE LA SOURCE,0070,39250,39083,Censeau,39,,,39083000ZA0162,,,,,,,,,,,,,0,3,Dépendance,,0,S,sols,,,2200,6.06672,46.813557
2021-686816,2021-07-29,000001,Vente,220623264,1,,RUE DE LA SOURCE,0070,39250,39083,Censeau,39,,,39083000ZA0162,,,,,,,,,,,,,0,2,Appartement,79,4,S,sols,,,2200,6.06672,46.813557
2021-686816,2021-07-29,000001,Vente,220623264,1,,RUE DE LA SOURCE,0070,39250,39083,Censeau,39,,,39083000ZA0162,,,,,,,,,,,,,0,3,Dépendance,,0,S,sols,,,2200,6.06672,46.813557
2021-686816,2021-07-29,000001,Vente,220623264,1,,RUE DE LA SOURCE,0070,39250,39083,Censeau,39,,,39083000ZA0162,,,,,,,,,,,,,0,3,Dépendance,,0,S,sols,,,2200,6.06672,46.813557
2021-686816,2021-07-29,000001,Vente,220623264,1,,RUE DE LA SOURCE,0070,39250,39083,Censeau,39,,,39083000ZA0162,,,,,,,,,,,,,0,2,Appartement,79,4,S,sols,,,2200,6.06672,46.813557
2021-686816,2021-07-29,000001,Vente,220623264,1,,RUE DE LA SOURCE,0070,39250,39083,Censeau,39,,,39083000ZA0162,,,,,,,,,,,,,0,3,Dépendance,,0,S,sols,,,2200,6.06672,46.813557
2021-686816,2021-07-29,000001,Vente,220623264,1,,RUE DE LA SOURCE,0070,39250,39083,Censeau,39,,,39083000ZA0162,,,,,,,,,,,,,0,3,Dépendance,,0,S,sols,,,2200,6.06672,46.813557
2021-686816,2021-07-29,000001,Vente,220623264,1,,RUE DE LA SOURCE,0070,39250,39083,Censeau,39,,,39083000ZA0162,,,,,,,,,,,,,0,3,Dépendance,,0,S,sols,,,2200,6.06672,46.813557
2021-686816,2021-07-29,000001,Vente,220623264,1,,RUE DE LA SOURCE,0070,39250,39083,Censeau,39,,,39083000ZA0162,,,,,,,,,,,,,0,3,Dépendance,,0,S,sols,,,2200,6.06672,46.813557
2021-686816,2021-07-29,000001,Vente,220623264,1,,RUE DE LA SOURCE,0070,39250,39083,Censeau,39,,,39083000ZA0162,,,,,,,,,,,,,0,3,Dépendance,,0,S,sols,,,2200,6.06672,46.813557
2021-686816,2021-07-29,000001,Vente,220623264,1,,RUE DE LA SOURCE,0070,39250,39083,Censeau,39,,,39083000ZA0162,,,,,,,,,,,,,0,2,Appartement,79,4,S,sols,,,2200,6.06672,46.813557
2021-686816,2021-07-29,000001,Vente,220623264,1,,RUE DE LA SOURCE,0070,39250,39083,Censeau,39,,,39083000ZA0162,,,,,,,,,,,,,0,3,Dépendance,,0,S,sols,,,2200,6.06672,46.813557
2021-686816,2021-07-29,000001,Vente,220623264,8,,RUE DE LA SOURCE,0070,39250,39083,Censeau,39,,,39083000ZA0175,,,,,,,,,,,,,0,2,Appartement,48,2,S,sols,,,2325,6.065743,46.813529
2021-686816,2021-07-29,000001,Vente,220623264,8,,RUE DE LA SOURCE,0070,39250,39083,Censeau,39,,,39083000ZA0175,,,,,,,,,,,,,0,2,Appartement,48,2,S,sols,,,2325,6.065743,46.813529
2021-686816,2021-07-29,000001,Vente,220623264,8,,RUE DE LA SOURCE,0070,39250,39083,Censeau,39,,,39083000ZA0175,,,,,,,,,,,,,0,3,Dépendance,,0,S,sols,,,2325,6.065743,46.813529
2021-686816,2021-07-29,000001,Vente,220623264,8,,RUE DE LA SOURCE,0070,39250,39083,Censeau,39,,,39083000ZA0175,,,,,,,,,,,,,0,2,Appartement,56,3,S,sols,,,2325,6.065743,46.813529
2021-686816,2021-07-29,000001,Vente,220623264,8,,RUE DE LA SOURCE,0070,39250,39083,Censeau,39,,,39083000ZA0175,,,,,,,,,,,,,0,2,Appartement,56,3,S,sols,,,2325,6.065743,46.813529
2021-686816,2021-07-29,000001,Vente,220623264,8,,RUE DE LA SOURCE,0070,39250,39083,Censeau,39,,,39083000ZA0175,,,,,,,,,,,,,0,3,Dépendance,,0,S,sols,,,2325,6.065743,46.813529
2021-686816,2021-07-29,000001,Vente,220623264,8,,RUE DE LA SOURCE,0070,39250,39083,Censeau,39,,,39083000ZA0175,,,,,,,,,,,,,0,3,Dépendance,,0,S,sols,,,2325,6.065743,46.813529
2021-686816,2021-07-29,000001,Vente,220623264,8,,RUE DE LA SOURCE,0070,39250,39083,Censeau,39,,,39083000ZA0175,,,,,,,,,,,,,0,3,Dépendance,,0,S,sols,,,2325,6.065743,46.813529
2021-686816,2021-07-29,000001,Vente,220623264,8,,RUE DE LA SOURCE,0070,39250,39083,Censeau,39,,,39083000ZA0175,,,,,,,,,,,,,0,2,Appartement,48,2,S,sols,,,2325,6.065743,46.813529
2021-686816,2021-07-29,000001,Vente,220623264,8,,RUE DE LA SOURCE,0070,39250,39083,Censeau,39,,,39083000ZA0175,,,,,,,,,,,,,0,3,Dépendance,,0,S,sols,,,2325,6.065743,46.813529
2021-686816,2021-07-29,000001,Vente,220623264,8,,RUE DE LA SOURCE,0070,39250,39083,Censeau,39,,,39083000ZA0175,,,,,,,,,,,,,0,3,Dépendance,,0,S,sols,,,2325,6.065743,46.813529
2021-686816,2021-07-29,000001,Vente,220623264,8,,RUE DE LA SOURCE,0070,39250,39083,Censeau,39,,,39083000ZA0175,,,,,,,,,,,,,0,2,Appartement,56,3,S,sols,,,2325,6.065743,46.813529
2021-686856,2021-08-10,000001,Vente,100000,22,,CHE DE LA SARRAZINE,0065,39250,39083,Censeau,39,,,39083000AO0348,,,,,,,,,,,,,0,1,Maison,145,5,S,sols,,,809,6.068108,46.816346
2021-687064,2021-08-30,000001,Vente,4320,,,LA VI DU GRE,B074,39250,39083,Censeau,39,,,39083000AE0053,,,,,,,,,,,,,0,,,,,BR,futaies résineuses,,,6129,6.099712,46.84021
2021-687330,2021-09-08,000001,Vente,12481,,,LE TARTRE,B068,39250,39083,Censeau,39,,,39083000ZA0246,,,,,,,,,,,,,0,,,,,T,terres,,,428,6.061446,46.816475
2021-687428,2021-09-16,000001,Vente,256500,3,,RUE DES TARROTS,0072,39250,39083,Censeau,39,,,39083000ZA0177,,,,,,,,,,,,,0,1,Maison,88,4,S,sols,,,112,6.066317,46.815224
2021-687428,2021-09-16,000001,Vente,256500,3,,RUE DES TARROTS,0072,39250,39083,Censeau,39,,,39083000ZA0177,,,,,,,,,,,,,0,1,Maison,88,4,T,terres,,,867,6.066317,46.815224
2021-687428,2021-09-16,000001,Vente,256500,,,LE TARTRE,B068,39250,39083,Censeau,39,,,39083000ZA0251,,,,,,,,,,,,,0,,,,,S,sols,,,81,6.066441,46.815412
2021-687428,2021-09-16,000001,Vente,256500,,,LE TARTRE,B068,39250,39083,Censeau,39,,,39083000ZA0253,,,,,,,,,,,,,0,,,,,S,sols,,,92,6.066533,46.81527
2021-687731,2021-10-08,000001,Vente,8869,,,SUR LES COMBES,B019,39250,39083,Censeau,39,,,39083000ZC0089,,,,,,,,,,,,,0,,,,,T,terres,,,17505,6.082796,46.814726
2021-687731,2021-10-08,000001,Vente,8869,,,SUR LES COMBES,B019,39250,39083,Censeau,39,,,39083000ZC0089,,,,,,,,,,,,,0,,,,,T,terres,,,5835,6.082796,46.814726
2021-687836,2021-09-28,000001,Vente,2350,,,LES COMBES,B018,39250,39083,Censeau,39,,,39083000ZH0052,,,,,,,,,,,,,0,,,,,P,prés,,,1525,6.09116,46.813642
2021-688260,2021-10-21,000001,Vente,5620,,,CHAMPS DU BOIS,B006,39250,39083,Censeau,39,,,39083000ZC0052,,,,,,,,,,,,,0,,,,,T,terres,,,14770,6.088758,46.820111
2021-688884,2021-11-16,000001,Vente,165000,14,,RUE DU MAGASIN,0050,39250,39083,Censeau,39,,,39083000AP0143,,,,,,,,,,,,,0,1,Maison,93,3,S,sols,,,1057,6.059604,46.816909
2021-689133,2021-12-01,000001,Vente,15000,,,LA MOUILLETTE,B035,39250,39083,Censeau,39,,,39083000ZD0009,,,,,,,,,,,,,0,,,,,T,terres,,,11625,6.072807,46.800587
2021-689133,2021-12-01,000001,Vente,15000,,,LA MOUILLETTE,B035,39250,39083,Censeau,39,,,39083000ZD0009,,,,,,,,,,,,,0,,,,,T,terres,,,11625,6.072807,46.800587
2021-689133,2021-12-01,000001,Vente,15000,,,CHAMPS DU POMMIER,B008,39250,39083,Censeau,39,,,39083000ZE0088,,,,,,,,,,,,,0,,,,,L,landes,,,1865,6.067795,46.797391
2021-689133,2021-12-01,000001,Vente,15000,,,CHAMPS DU POMMIER,B008,39250,39083,Censeau,39,,,39083000ZE0088,,,,,,,,,,,,,0,,,,,T,terres,,,28605,6.067795,46.797391
2021-689133,2021-12-01,000001,Vente,15000,,,CHAMPS DU POMMIER,B008,39250,39083,Censeau,39,,,39083000ZE0088,,,,,,,,,,,,,0,,,,,T,terres,,,28605,6.067795,46.797391
2021-689133,2021-12-01,000001,Vente,15000,,,CHAMPS DU POMMIER,B008,39250,39083,Censeau,39,,,39083000ZE0088,,,,,,,,,,,,,0,,,,,L,landes,,,1080,6.067795,46.797391
2021-689133,2021-12-01,000001,Vente,15000,,,CHAMPS DU POMMIER,B008,39250,39083,Censeau,39,,,39083000ZE0088,,,,,,,,,,,,,0,,,,,P,prés,,,785,6.067795,46.797391
2021-689133,2021-12-01,000001,Vente,15000,,,FONTAINE FROIDE,B026,39250,39083,Censeau,39,,,39083000ZI0007,,,,,,,,,,,,,0,,,,,T,terres,,,1760,6.060069,46.794777
2021-689133,2021-12-01,000001,Vente,15000,,,FONTAINE FROIDE,B026,39250,39083,Censeau,39,,,39083000ZI0007,,,,,,,,,,,,,0,,,,,T,terres,,,1760,6.060069,46.794777
2021-689305,2021-12-17,000001,Vente,266200.1,2,,CHE DE LA FONTAINE,0030,39250,39083,Censeau,39,,,39083000AP0025,,,,,,,,,,,,,0,1,Maison,125,5,S,sols,,,889,6.06071,46.817002
2021-689837,2021-12-22,000002,Vente,21300,,,LA SEIGNE,B065,39250,39083,Censeau,39,,,39083000ZA0290,,,,,,,,,,,,,0,,,,,T,terres,,,710,6.059009,46.815866
