id_mutation,date_mutation,numero_disposition,nature_mutation,valeur_fonciere,adresse_numero,adresse_suffixe,adresse_nom_voie,adresse_code_voie,code_postal,code_commune,nom_commune,code_departement,ancien_code_commune,ancien_nom_commune,id_parcelle,ancien_id_parcelle,numero_volume,lot1_numero,lot1_surface_carrez,lot2_numero,lot2_surface_carrez,lot3_numero,lot3_surface_carrez,lot4_numero,lot4_surface_carrez,lot5_numero,lot5_surface_carrez,nombre_lots,code_type_local,type_local,surface_reelle_bati,nombre_pieces_principales,code_nature_culture,nature_culture,code_nature_culture_speciale,nature_culture_speciale,surface_terrain,longitude,latitude
2021-682637,2021-01-13,000001,Vente,43500,,,EN LECHOUX,B039,39160,39378,Les Trois Châteaux,39,,,39378000ZC0343,,,,,,,,,,,,,0,,,,,P,prés,,,2426,5.360664,46.426083
2021-682776,2021-02-10,000001,Vente,109000,,,CESSIA VILLAGE,B175,39160,39378,Les Trois Châteaux,39,,,393784840A0150,,,,,,,,,,,,,0,,,,,J,jardins,,,145,5.361882,46.414837
2021-682776,2021-02-10,000001,Vente,109000,62,,RUE AIME BOULLY - CESSIA,0110,39160,39378,Les Trois Châteaux,39,,,393784840A0153,,,,,,,,,,,,,0,1,Maison,146,2,S,sols,,,735,5.361401,46.414884
2021-682806,2021-01-29,000001,Vente,47000,143,,RUE DU CENTRE - CESSIA,0113,39160,39378,Les Trois Châteaux,39,,,393784840A0159,,,,,,,,,,,,,0,1,Maison,59,1,S,sols,,,120,5.361661,46.415317
2021-682806,2021-01-29,000001,Vente,47000,,,CESSIA VILLAGE,B175,39160,39378,Les Trois Châteaux,39,,,393784840A1155,,,,,,,,,,,,,0,,,,,S,sols,,,226,5.361776,46.415379
2021-682943,2021-02-11,000001,Vente,237250,173,,RUE DE BALOVRE,0010,39160,39378,Les Trois Châteaux,39,,,393780000B0607,,,,,,,,,,,,,0,1,Maison,166,6,S,sols,,,387,5.361272,46.424295
2021-682943,2021-02-11,000001,Vente,237250,,,AU VILLAGE NANC,B065,39160,39378,Les Trois Châteaux,39,,,393780000B1133,,,,,,,,,,,,,0,,,,,P,prés,,,4040,5.361306,46.424687
2021-682943,2021-02-11,000001,Vente,237250,,,AU VILLAGE NANC,B065,39160,39378,Les Trois Châteaux,39,,,393780000B1211,,,,,,,,,,,,,0,,,,,J,jardins,,,586,5.361204,46.42403
2021-683008,2021-02-23,000001,Vente,100000,5061,,CHE DE L'HERMITAGE,0085,39160,39378,Les Trois Châteaux,39,,,39378023ZA0061,,,,,,,,,,,,,0,1,Maison,95,3,S,sols,,,1975,5.371581,46.440737
2021-683008,2021-02-23,000001,Vente,100000,5061,,CHE DE L'HERMITAGE,0085,39160,39378,Les Trois Châteaux,39,,,39378023ZA0061,,,,,,,,,,,,,0,1,Maison,95,3,P,prés,,,1545,5.371581,46.440737
2021-683009,2021-02-10,000001,Vente,5000,,,CESSIA VILLAGE,B175,39160,39378,Les Trois Châteaux,39,,,393784840A1075,,,,,,,,,,,,,0,,,,,S,sols,,,240,5.361506,46.414715
2021-683045,2021-02-10,000001,Vente,700,,,CESSIA VILLAGE,B175,39160,39378,Les Trois Châteaux,39,,,393784840A0151,,,,,,,,,,,,,0,,,,,J,jardins,,,135,5.361836,46.414794
2021-683508,2021-03-16,000001,Vente,3478,,,CHAMPS DE LA BROTINE,B181,39160,39378,Les Trois Châteaux,39,,,393784840A0987,,,,,,,,,,,,,0,,,,,L,landes,,,2560,5.372422,46.409231
2021-683508,2021-03-16,000001,Vente,3478,,,CHAMPS DE LA BROTINE,B181,39160,39378,Les Trois Châteaux,39,,,393784840A0988,,,,,,,,,,,,,0,,,,,PA,pâtures,,,990,5.37283,46.409611
2021-683508,2021-03-16,000001,Vente,3478,,,CHAMPS DE LA BROTINE,B181,39160,39378,Les Trois Châteaux,39,,,393784840A0991,,,,,,,,,,,,,0,,,,,BT,taillis simples,,,1300,5.371993,46.409301
2021-683508,2021-03-16,000001,Vente,3478,,,CHAMPS DE LA BROTINE,B181,39160,39378,Les Trois Châteaux,39,,,393784840A0994,,,,,,,,,,,,,0,,,,,PA,pâtures,,,2040,5.37118,46.407916
2021-683508,2021-03-16,000001,Vente,3478,,,CHAMPS DE LA BROTINE,B181,39160,39378,Les Trois Châteaux,39,,,393784840A0995,,,,,,,,,,,,,0,,,,,BT,taillis simples,,,1020,5.371612,46.407909
2021-683508,2021-03-16,000001,Vente,3478,,,LA GRANDE TERRE,B216,39160,39378,Les Trois Châteaux,39,,,39378484ZC0076,,,,,,,,,,,,,0,,,,,L,landes,,,380,5.361922,46.397429
2021-683508,2021-03-16,000001,Vente,3478,,,LA GRANDE TERRE,B216,39160,39378,Les Trois Châteaux,39,,,39378484ZC0076,,,,,,,,,,,,,0,,,,,P,prés,,,8129,5.361922,46.397429
2021-683528,2021-03-15,000001,Vente,158325,420,,RUE JEAN PUVELAND,0120,39160,39378,Les Trois Châteaux,39,,,393784840B0448,,,,,,,,,,,,,0,1,Maison,128,4,S,sols,,,316,5.358291,46.405785
2021-683528,2021-03-15,000001,Vente,158325,,,VILLAGE,B248,39160,39378,Les Trois Châteaux,39,,,393784840B0871,,,,,,,,,,,,,0,,,,,P,prés,,,160,5.358398,46.405734
2021-683648,2021-03-13,000001,Vente,64000,,,LES MIGNODES,B118,39160,39378,Les Trois Châteaux,39,,,39378023ZD0236,,,,,,,,,,,,,0,,,,,S,sols,,,340,,
2021-683648,2021-03-13,000001,Vente,64000,,,LES MIGNODES,B118,39160,39378,Les Trois Châteaux,39,,,39378023ZD0236,,,,,,,,,,,,,0,,,,,T,terres,,,1700,,
2021-683659,2021-03-12,000001,Vente,132,,,AUX COURBES,B149,39160,39378,Les Trois Châteaux,39,,,39378135ZB0020,,,,,,,,,,,,,0,,,,,T,terres,,,660,5.33846,46.405332
2021-683872,2021-03-30,000001,Vente,563600,8,,RUE DE LORIOL,0050,39160,39378,Les Trois Châteaux,39,,,393780000B0342,,,,,,,,,,,,,0,1,Maison,230,6,S,sols,,,810,5.358881,46.423877
2021-683872,2021-03-30,000001,Vente,563600,5153,,AU VILLAGE NANC,B065,39160,39378,Les Trois Châteaux,39,,,393780000B0353,,,,,,,,,,,,,0,3,Dépendance,,0,VE,vergers,,,5834,5.358415,46.423312
2021-683872,2021-03-30,000001,Vente,563600,5153,,AU VILLAGE NANC,B065,39160,39378,Les Trois Châteaux,39,,,393780000B0353,,,,,,,,,,,,,0,3,Dépendance,,0,S,sols,,,1010,5.358415,46.423312
2021-683872,2021-03-30,000001,Vente,563600,5153,,AU VILLAGE NANC,B065,39160,39378,Les Trois Châteaux,39,,,393780000B0353,,,,,,,,,,,,,0,3,Dépendance,,0,AG,terrains d'agrément,SPORT,Terrain de sport,756,5.358415,46.423312
2021-683872,2021-03-30,000001,Vente,563600,,,AU VILLAGE NANC,B065,39160,39378,Les Trois Châteaux,39,,,393780000B1182,,,,,,,,,,,,,0,,,,,P,prés,,,685,5.35796,46.423364
2021-684088,2021-04-15,000001,Vente,1500,,,BOIS A LA JEANNE,B070,39160,39378,Les Trois Châteaux,39,,,39378023ZA0118,,,,,,,,,,,,,0,,,,,BT,taillis simples,,,1360,5.376643,46.440047
2021-684088,2021-04-15,000001,Vente,1500,,,BOIS A LA JEANNE,B070,39160,39378,Les Trois Châteaux,39,,,39378023ZA0118,,,,,,,,,,,,,0,,,,,T,terres,,,1860,5.376643,46.440047
2021-684207,2021-04-21,000001,Vente,460,,,AUX JOLIVES,B221,39160,39378,Les Trois Châteaux,39,,,393784840A0748,,,,,,,,,,,,,0,,,,,BT,taillis simples,,,460,5.35602,46.407093
2021-684407,2021-04-20,000001,Vente,75000,,,EN VIGNEUX,B064,39160,39378,Les Trois Châteaux,39,,,39378000ZC0576,,,,,,,,,,,,,0,,,,,T,terres,,,523,5.355669,46.418136
2021-684407,2021-04-20,000001,Vente,75000,,,EN VIGNEUX,B064,39160,39378,Les Trois Châteaux,39,,,39378000ZC0577,,,,,,,,,,,,,0,,,,,T,terres,,,486,5.355351,46.418193
2021-684407,2021-04-20,000001,Vente,75000,,,EN VIGNEUX,B064,39160,39378,Les Trois Châteaux,39,,,39378000ZC0578,,,,,,,,,,,,,0,,,,,T,terres,,,641,5.354939,46.418267
2021-684407,2021-04-20,000001,Vente,75000,,,EN VIGNEUX,B064,39160,39378,Les Trois Châteaux,39,,,39378000ZC0595,,,,,,,,,,,,,0,,,,,T,terres,,,372,5.355385,46.418522
2021-684407,2021-04-20,000001,Vente,75000,,,EN VIGNEUX,B064,39160,39378,Les Trois Châteaux,39,,,39378000ZC0596,,,,,,,,,,,,,0,,,,,T,terres,,,410,5.354838,46.418617
2021-684748,2021-05-05,000001,Vente,152000,,,AU VILLAGE NANC,B065,39160,39378,Les Trois Châteaux,39,,,393780000B0555,,,,,,,,,,,,,0,,,,,VE,vergers,,,1649,5.360784,46.422883
2021-684748,2021-05-05,000001,Vente,152000,522,,GRANDE RUE,0045,39160,39378,Les Trois Châteaux,39,,,393780000B0567,,,,,,,,,,,,,0,1,Maison,73,2,S,sols,,,467,5.360856,46.42312
2021-684760,2021-05-21,000001,Vente,1553.28,,,EN COMBE DE FOURCHE,B097,39160,39378,Les Trois Châteaux,39,,,39378023ZB0125,,,,,,,,,,,,,0,,,,,PA,pâtures,,,1840,5.392445,46.434133
2021-684760,2021-05-21,000001,Vente,1553.28,,,EN COMBE DE FOURCHE,B097,39160,39378,Les Trois Châteaux,39,,,39378023ZB0125,,,,,,,,,,,,,0,,,,,T,terres,,,5349,5.392445,46.434133
2021-685116,2021-05-25,000001,Vente,800,,,AUX BUCLIERES,B081,39160,39378,Les Trois Châteaux,39,,,39378023ZA0102,,,,,,,,,,,,,0,,,,,BT,taillis simples,,,1670,5.378538,46.445596
2021-685116,2021-05-25,000001,Vente,800,,,AUX BUCLIERES,B081,39160,39378,Les Trois Châteaux,39,,,39378023ZA0102,,,,,,,,,,,,,0,,,,,P,prés,,,9580,5.378538,46.445596
2021-686189,2021-07-09,000001,Vente,568850,8,,RUE DE LORIOL,0050,39160,39378,Les Trois Châteaux,39,,,393780000B0342,,,,,,,,,,,,,0,3,Dépendance,,0,S,sols,,,810,5.358881,46.423877
2021-686189,2021-07-09,000001,Vente,568850,8,,RUE DE LORIOL,0050,39160,39378,Les Trois Châteaux,39,,,393780000B0342,,,,,,,,,,,,,0,1,Maison,230,6,S,sols,,,810,5.358881,46.423877
2021-686189,2021-07-09,000001,Vente,568850,8,,RUE DE LORIOL,0050,39160,39378,Les Trois Châteaux,39,,,393780000B0342,,,,,,,,,,,,,0,3,Dépendance,,0,S,sols,,,810,5.358881,46.423877
2021-686189,2021-07-09,000001,Vente,568850,5153,,AU VILLAGE NANC,B065,39160,39378,Les Trois Châteaux,39,,,393780000B0353,,,,,,,,,,,,,0,3,Dépendance,,0,VE,vergers,,,5834,5.358415,46.423312
2021-686189,2021-07-09,000001,Vente,568850,5153,,AU VILLAGE NANC,B065,39160,39378,Les Trois Châteaux,39,,,393780000B0353,,,,,,,,,,,,,0,3,Dépendance,,0,S,sols,,,1010,5.358415,46.423312
2021-686189,2021-07-09,000001,Vente,568850,5153,,AU VILLAGE NANC,B065,39160,39378,Les Trois Châteaux,39,,,393780000B0353,,,,,,,,,,,,,0,3,Dépendance,,0,AG,terrains d'agrément,SPORT,Terrain de sport,756,5.358415,46.423312
2021-686189,2021-07-09,000001,Vente,568850,5153,,AU VILLAGE NANC,B065,39160,39378,Les Trois Châteaux,39,,,393780000B0353,,,,,,,,,,,,,0,3,Dépendance,,0,AG,terrains d'agrément,SPORT,Terrain de sport,756,5.358415,46.423312
2021-686189,2021-07-09,000001,Vente,568850,5153,,AU VILLAGE NANC,B065,39160,39378,Les Trois Châteaux,39,,,393780000B0353,,,,,,,,,,,,,0,3,Dépendance,,0,VE,vergers,,,5834,5.358415,46.423312
2021-686189,2021-07-09,000001,Vente,568850,5153,,AU VILLAGE NANC,B065,39160,39378,Les Trois Châteaux,39,,,393780000B0353,,,,,,,,,,,,,0,3,Dépendance,,0,S,sols,,,1010,5.358415,46.423312
2021-686189,2021-07-09,000001,Vente,568850,,,AU VILLAGE NANC,B065,39160,39378,Les Trois Châteaux,39,,,393780000B1182,,,,,,,,,,,,,0,,,,,P,prés,,,685,5.35796,46.423364
2021-686396,2021-07-17,000001,Vente,87000,,,L AUBEPIN,B069,39160,39378,Les Trois Châteaux,39,,,393780230B0144,,,,,,,,,,,,,0,,,,,BT,taillis simples,,,135,5.372346,46.439819
2021-686396,2021-07-17,000001,Vente,87000,,,L AUBEPIN,B069,39160,39378,Les Trois Châteaux,39,,,393780230B0151,,,,,,,,,,,,,0,,,,,S,sols,,,240,5.372464,46.439951
2021-686396,2021-07-17,000001,Vente,87000,5058,,RUE PRINCIPALE L'AUBEPIN,0087,39160,39378,Les Trois Châteaux,39,,,393780230B0155,,,,,,,,,,,,,0,1,Maison,112,4,S,sols,,,325,5.372784,46.439878
2021-686916,2021-08-30,000001,Vente,217000,1000,,RUE PRINCIPALE CHAZELLES,0100,39160,39378,Les Trois Châteaux,39,,,39378135ZB0191,,,,,,,,,,,,,0,3,Dépendance,,0,S,sols,,,998,5.344458,46.40583
2021-686916,2021-08-30,000001,Vente,217000,1000,,RUE PRINCIPALE CHAZELLES,0100,39160,39378,Les Trois Châteaux,39,,,39378135ZB0191,,,,,,,,,,,,,0,3,Dépendance,,0,S,sols,,,998,5.344458,46.40583
2021-686916,2021-08-30,000001,Vente,217000,1000,,RUE PRINCIPALE CHAZELLES,0100,39160,39378,Les Trois Châteaux,39,,,39378135ZB0191,,,,,,,,,,,,,0,1,Maison,93,4,S,sols,,,998,5.344458,46.40583
2021-686916,2021-08-30,000001,Vente,217000,,,A LA RUINE,B165,39160,39378,Les Trois Châteaux,39,,,39378135ZB0192,,,,,,,,,,,,,0,,,,,T,terres,,,1125,5.344651,46.405945
2021-686916,2021-08-30,000001,Vente,217000,,,A LA RUINE,B165,39160,39378,Les Trois Châteaux,39,,,39378135ZB0193,,,,,,,,,,,,,0,,,,,T,terres,,,133,5.345001,46.405866
2021-687109,2021-06-07,000001,Adjudication,52000,,,LES CONDAMINES,B099,39160,39378,Les Trois Châteaux,39,,,393780230B0657,,,,,,,,,,,,,0,,,,,S,sols,,,113,5.373674,46.440054
2021-687109,2021-06-07,000001,Adjudication,52000,,,LES CONDAMINES,B099,39160,39378,Les Trois Châteaux,39,,,393780230B0658,,,,,,,,,,,,,0,,,,,S,sols,,,27,5.373652,46.439991
2021-687109,2021-06-07,000001,Adjudication,52000,,,LES CONDAMINES,B099,39160,39378,Les Trois Châteaux,39,,,393780230B0659,,,,,,,,,,,,,0,,,,,S,sols,,,35,5.373651,46.439957
2021-687109,2021-06-07,000001,Adjudication,52000,5041,,IMP DES CONDAMINES,0081,39160,39378,Les Trois Châteaux,39,,,393780230B0661,,,,,,,,,,,,,0,1,Maison,60,1,S,sols,,,150,5.37344,46.439988
2021-687109,2021-06-07,000001,Adjudication,52000,5041,,IMP DES CONDAMINES,0081,39160,39378,Les Trois Châteaux,39,,,393780230B0661,,,,,,,,,,,,,0,1,Maison,65,1,S,sols,,,150,5.37344,46.439988
2021-687109,2021-06-07,000001,Adjudication,52000,,,LES CONDAMINES,B099,39160,39378,Les Trois Châteaux,39,,,393780230B0662,,,,,,,,,,,,,0,,,,,S,sols,,,30,5.373505,46.439981
2021-687109,2021-06-07,000001,Adjudication,52000,,,LES CONDAMINES,B099,39160,39378,Les Trois Châteaux,39,,,393780230B0663,,,,,,,,,,,,,0,,,,,S,sols,,,20,5.373513,46.440005
2021-687161,2021-08-30,000001,Vente,139000,100,,RUE AIME BOULLY - CESSIA,0110,39160,39378,Les Trois Châteaux,39,,,393784840A1171,,,,,,,,,,,,,0,1,Maison,106,5,S,sols,,,469,5.361689,46.415109
2021-687161,2021-08-30,000001,Vente,139000,100,,RUE AIME BOULLY - CESSIA,0110,39160,39378,Les Trois Châteaux,39,,,393784840A1171,,,,,,,,,,,,,0,3,Dépendance,,0,S,sols,,,469,5.361689,46.415109
2021-687475,2021-09-20,000001,Vente,1475,,,SUR LE FER,B109,39160,39378,Les Trois Châteaux,39,,,39378023ZC0086,,,,,,,,,,,,,0,,,,,PA,pâtures,,,2660,5.389503,46.433171
2021-687475,2021-09-20,000001,Vente,1475,,,SUR LE FER,B109,39160,39378,Les Trois Châteaux,39,,,39378023ZC0086,,,,,,,,,,,,,0,,,,,T,terres,,,12020,5.389503,46.433171
2021-687475,2021-09-20,000001,Vente,1475,,,SUR LE FER,B109,39160,39378,Les Trois Châteaux,39,,,39378023ZC0086,,,,,,,,,,,,,0,,,,,PA,pâtures,,,6380,5.389503,46.433171
2021-687476,2021-09-17,000001,Vente,800,,,A LA GRANDE FOUILLAT,B035,39160,39378,Les Trois Châteaux,39,,,393780000B0972,,,,,,,,,,,,,0,,,,,BS,taillis sous futaie,,,3035,5.376533,46.415737
2021-687476,2021-09-17,000001,Vente,800,,,A LA GRANDE FOUILLAT,B035,39160,39378,Les Trois Châteaux,39,,,393780000B0973,,,,,,,,,,,,,0,,,,,BR,futaies résineuses,,,4930,5.376033,46.41553
2021-687518,2021-09-17,000001,Vente,560,,,A LA GRANDE FOUILLAT,B035,39160,39378,Les Trois Châteaux,39,,,393780000B0974,,,,,,,,,,,,,0,,,,,BS,taillis sous futaie,,,5590,5.375572,46.415493
2021-687520,2021-09-20,000001,Vente,145000,,,A LA BARBIERE,B002,39160,39378,Les Trois Châteaux,39,,,39378000ZC0482,,,,,,,,,,,,,0,,,,,VE,vergers,,,188,5.356579,46.420432
2021-687520,2021-09-20,000001,Vente,145000,225,,RTE DE CESSIA,0025,39160,39378,Les Trois Châteaux,39,,,39378000ZC0508,,,,,,,,,,,,,0,1,Maison,96,4,S,sols,,,1183,5.356659,46.420285
2021-687638,2021-09-21,000001,Vente,39732,,,EN VIGNEUX,B064,39160,39378,Les Trois Châteaux,39,,,39378000ZC0587,,,,,,,,,,,,,0,,,,,AB,terrains a bâtir,,,520,5.35635,46.418245
2021-687638,2021-09-21,000001,Vente,39732,,,EN VIGNEUX,B064,39160,39378,Les Trois Châteaux,39,,,39378000ZC0592,,,,,,,,,,,,,0,,,,,T,terres,,,426,5.356384,46.418406
2021-687942,2021-10-11,000001,Vente,44604,,,EN VIGNEUX,B064,39160,39378,Les Trois Châteaux,39,,,39378000ZC0573,,,,,,,,,,,,,0,,,,,T,terres,,,849,5.356896,46.417915
2021-687942,2021-10-11,000001,Vente,44604,,,EN VIGNEUX,B064,39160,39378,Les Trois Châteaux,39,,,39378000ZC0579,,,,,,,,,,,,,0,,,,,S,sols,,,213,5.356975,46.418096
2021-688203,2021-10-22,000001,Vente,248700,,,VIGNE JEANNIN,B246,39160,39378,Les Trois Châteaux,39,,,39378484ZA0046,,,,,,,,,,,,,0,,,,,P,prés,,,2740,5.364023,46.414763
2021-688203,2021-10-22,000001,Vente,248700,426,,RTE DU BIE ROUGE - CESSIA,0112,39160,39378,Les Trois Châteaux,39,,,39378484ZA0300,,,,,,,,,,,,,0,1,Maison,150,4,S,sols,,,1000,5.35835,46.415629
2021-688203,2021-10-22,000001,Vente,248700,426,,RTE DU BIE ROUGE - CESSIA,0112,39160,39378,Les Trois Châteaux,39,,,39378484ZA0300,,,,,,,,,,,,,0,1,Maison,150,4,T,terres,,,1005,5.35835,46.415629
2021-688371,2021-10-15,000001,Vente,125000,277,,GRANDE RUE,0045,39160,39378,Les Trois Châteaux,39,,,393780000B0363,,,,,,,,,,,,,0,1,Maison,50,1,S,sols,,,692,5.358836,46.422498
2021-688371,2021-10-15,000001,Vente,125000,,,AU VILLAGE NANC,B065,39160,39378,Les Trois Châteaux,39,,,393780000B0365,,,,,,,,,,,,,0,,,,,VE,vergers,,,574,5.358824,46.422842
2021-688371,2021-10-15,000001,Vente,125000,277,,GRANDE RUE,0045,39160,39378,Les Trois Châteaux,39,,,393780000B0999,,,,,,,,,,,,,0,1,Maison,52,1,S,sols,,,1097,5.358939,46.422607
2021-688573,2021-11-03,000001,Vente,225000,,,LE CLOS L'AUBEPIN,B092,39160,39378,Les Trois Châteaux,39,,,39378023ZD0194,,,,,,,,,,,,,0,,,,,T,terres,,,360,5.364022,46.428944
2021-688573,2021-11-03,000001,Vente,225000,5082,,CHE DES VIGNES VILLETTE,0093,39160,39378,Les Trois Châteaux,39,,,39378023ZD0195,,,,,,,,,,,,,0,1,Maison,104,4,S,sols,,,1018,5.36361,46.428963
2021-688573,2021-11-03,000001,Vente,225000,5082,,CHE DES VIGNES VILLETTE,0093,39160,39378,Les Trois Châteaux,39,,,39378023ZD0195,,,,,,,,,,,,,0,1,Maison,104,4,P,prés,,,822,5.36361,46.428963
2021-688573,2021-11-03,000001,Vente,225000,5082,,CHE DES VIGNES VILLETTE,0093,39160,39378,Les Trois Châteaux,39,,,39378023ZD0195,,,,,,,,,,,,,0,1,Maison,104,4,VI,vignes,,,540,5.36361,46.428963
2021-688955,2021-11-27,000001,Vente,240000,,,AU VILLAGE NANC,B065,39160,39378,Les Trois Châteaux,39,,,393780000B1155,,,,,,,,,,,,,0,,,,,S,sols,,,12,5.358136,46.424024
2021-688955,2021-11-27,000001,Vente,240000,292,,RUE DE L'EGLISE,0040,39160,39378,Les Trois Châteaux,39,,,393780000B1252,,1,,,,,,,,,,,0,,,,,,,,,,5.358011,46.423861
2021-688955,2021-11-27,000001,Vente,240000,,,RUE DE L'EGLISE,0040,39160,39378,Les Trois Châteaux,39,,,393780000B1253,,,,,,,,,,,,,0,,,,,S,sols,,,226,5.357913,46.423882
2021-688955,2021-11-27,000001,Vente,240000,,,RUE DE L'EGLISE,0040,39160,39378,Les Trois Châteaux,39,,,393780000B1254,,,,,,,,,,,,,0,,,,,S,sols,,,15,5.358089,46.423896
2021-689255,2021-12-06,000001,Vente,90000,181,,RUE AIME BOULLY - CESSIA,0110,39160,39378,Les Trois Châteaux,39,,,393784840A0147,,,,,,,,,,,,,0,1,Maison,76,2,S,sols,,,210,5.362163,46.414881
2021-689255,2021-12-06,000001,Vente,90000,,,CESSIA VILLAGE,B175,39160,39378,Les Trois Châteaux,39,,,393784840A0149,,,,,,,,,,,,,0,,,,,J,jardins,,,30,5.361978,46.414892
2021-689820,2021-12-21,000001,Vente,48552,,,EN VIGNEUX,B064,39160,39378,Les Trois Châteaux,39,,,39378000ZC0574,,,,,,,,,,,,,0,,,,,AB,terrains a bâtir,,,955,5.356424,46.418
2021-689820,2021-12-21,000001,Vente,48552,,,EN VIGNEUX,B064,39160,39378,Les Trois Châteaux,39,,,39378000ZC0580,,,,,,,,,,,,,0,,,,,S,sols,,,201,5.356572,46.418148
