id_mutation,date_mutation,numero_disposition,nature_mutation,valeur_fonciere,adresse_numero,adresse_suffixe,adresse_nom_voie,adresse_code_voie,code_postal,code_commune,nom_commune,code_departement,ancien_code_commune,ancien_nom_commune,id_parcelle,ancien_id_parcelle,numero_volume,lot1_numero,lot1_surface_carrez,lot2_numero,lot2_surface_carrez,lot3_numero,lot3_surface_carrez,lot4_numero,lot4_surface_carrez,lot5_numero,lot5_surface_carrez,nombre_lots,code_type_local,type_local,surface_reelle_bati,nombre_pieces_principales,code_nature_culture,nature_culture,code_nature_culture_speciale,nature_culture_speciale,surface_terrain,longitude,latitude
2021-682321,2021-01-18,000001,Vente,120000,46,,RUE PASTEUR,0550,39110,39500,Salins-les-Bains,39,,,39500000AR0213,,,,,,,,,,,,,0,2,Appartement,81,3,S,sols,,,318,5.885025,46.929399
2021-682321,2021-01-18,000001,Vente,120000,46,,RUE PASTEUR,0550,39110,39500,Salins-les-Bains,39,,,39500000AR0213,,,,,,,,,,,,,0,3,Dépendance,,0,S,sols,,,318,5.885025,46.929399
2021-682321,2021-01-18,000001,Vente,120000,46,,RUE PASTEUR,0550,39110,39500,Salins-les-Bains,39,,,39500000AR0213,,,,,,,,,,,,,0,2,Appartement,44,1,S,sols,,,318,5.885025,46.929399
2021-682321,2021-01-18,000001,Vente,120000,46,,RUE PASTEUR,0550,39110,39500,Salins-les-Bains,39,,,39500000AR0213,,,,,,,,,,,,,0,2,Appartement,100,3,S,sols,,,318,5.885025,46.929399
2021-682321,2021-01-18,000001,Vente,120000,46,,RUE PASTEUR,0550,39110,39500,Salins-les-Bains,39,,,39500000AR0213,,,,,,,,,,,,,0,2,Appartement,86,2,S,sols,,,318,5.885025,46.929399
2021-682321,2021-01-18,000001,Vente,120000,46,,RUE PASTEUR,0550,39110,39500,Salins-les-Bains,39,,,39500000AR0213,,,,,,,,,,,,,0,2,Appartement,72,3,S,sols,,,318,5.885025,46.929399
2021-682321,2021-01-18,000001,Vente,120000,46,,RUE PASTEUR,0550,39110,39500,Salins-les-Bains,39,,,39500000AR0213,,,,,,,,,,,,,0,4,Local industriel. commercial ou assimilé,66,0,S,sols,,,318,5.885025,46.929399
2021-682418,2021-01-21,000001,Vente,139700,11,,ALL DU PETIT PUITS,0558,39110,39500,Salins-les-Bains,39,,,39500000ZA0145,,,16,28.2,,,,,,,,,1,4,Local industriel. commercial ou assimilé,28,0,,,,,,5.84781,46.953517
2021-682453,2021-01-15,000001,Vente,18300,34,,RUE CHARLES MAGNIN,0210,39110,39500,Salins-les-Bains,39,,,39500000AN0188,,,,,,,,,,,,,0,3,Dépendance,,0,S,sols,,,63,5.879371,46.941904
2021-682453,2021-01-15,000001,Vente,18300,34,,RUE CHARLES MAGNIN,0210,39110,39500,Salins-les-Bains,39,,,39500000AN0188,,,,,,,,,,,,,0,2,Appartement,70,3,S,sols,,,63,5.879371,46.941904
2021-682453,2021-01-15,000001,Vente,18300,34,,RUE CHARLES MAGNIN,0210,39110,39500,Salins-les-Bains,39,,,39500000AN0188,,,,,,,,,,,,,0,2,Appartement,30,1,S,sols,,,63,5.879371,46.941904
2021-682475,2021-01-26,000001,Vente,3500,,,EN CHAMEAU,B019,39110,39500,Salins-les-Bains,39,,,395000000A0286,,,,,,,,,,,,,0,,,,,VE,vergers,,,1824,5.859185,46.959197
2021-682475,2021-01-26,000001,Vente,3500,,,EN CHAMEAU,B019,39110,39500,Salins-les-Bains,39,,,395000000A0286,,,,,,,,,,,,,0,,,,,S,sols,,,300,5.859185,46.959197
2021-682539,2021-01-29,000001,Vente,53300,11,,RUE DE LA LIBERTE,0430,39110,39500,Salins-les-Bains,39,,,39500000AN0006,,,2,,3,,,,,,,,2,3,Dépendance,,0,,,,,,5.878471,46.941378
2021-682539,2021-01-29,000001,Vente,53300,9,,RUE DE LA LIBERTE,0430,39110,39500,Salins-les-Bains,39,,,39500000AN0284,,,51,,,,,,,,,,1,3,Dépendance,,0,,,,,,5.878354,46.941415
2021-682539,2021-01-29,000001,Vente,53300,9,,RUE DE LA LIBERTE,0430,39110,39500,Salins-les-Bains,39,,,39500000AN0284,,,56,,,,,,,,,,1,3,Dépendance,,0,,,,,,5.878354,46.941415
2021-682539,2021-01-29,000001,Vente,53300,9,,RUE DE LA LIBERTE,0430,39110,39500,Salins-les-Bains,39,,,39500000AN0284,,,43,40.88,,,,,,,,,1,2,Appartement,40,3,,,,,,5.878354,46.941415
2021-682820,2021-02-16,000001,Vente,10000,27,,RUE GAMBETTA,0330,39110,39500,Salins-les-Bains,39,,,39500000AM0226,,,25,,,,,,,,,,1,3,Dépendance,,0,,,,,,5.878518,46.945792
2021-682837,2021-01-28,000001,Vente,45000,9027,B,RTE DE CHAMPAGNOLE,0190,39110,39500,Salins-les-Bains,39,,,39500000AW0134,,,,,,,,,,,,,0,4,Local industriel. commercial ou assimilé,300,0,S,sols,,,295,5.885996,46.919644
2021-682837,2021-01-28,000001,Vente,45000,,,LES PRES SITOZ NORD,B170,39110,39500,Salins-les-Bains,39,,,39500000AW0135,,,,,,,,,,,,,0,,,,,S,sols,,,581,5.885976,46.919711
2021-682838,2021-01-28,000002,Vente,25000,9027,,RTE DE CHAMPAGNOLE,0190,39110,39500,Salins-les-Bains,39,,,39500000AW0130,,,,,,,,,,,,,0,4,Local industriel. commercial ou assimilé,,0,S,sols,,,1549,,
2021-682838,2021-01-28,000002,Vente,25000,9027,,RTE DE CHAMPAGNOLE,0190,39110,39500,Salins-les-Bains,39,,,39500000AW0130,,,,,,,,,,,,,0,4,Local industriel. commercial ou assimilé,100,0,S,sols,,,1549,,
2021-682838,2021-01-28,000002,Vente,25000,9027,,RTE DE CHAMPAGNOLE,0190,39110,39500,Salins-les-Bains,39,,,39500000AW0130,,,,,,,,,,,,,0,4,Local industriel. commercial ou assimilé,100,0,S,sols,,,1549,,
2021-682965,2021-02-19,000001,Vente,1000,,,MONT DE SIMON,B144,39110,39500,Salins-les-Bains,39,,,39500000AH0075,,,,,,,,,,,,,0,,,,,VE,vergers,,,2044,5.86924,46.950662
2021-683178,2021-03-05,000001,Vente,59600,19,,RUE CHARLES MAGNIN,0210,39110,39500,Salins-les-Bains,39,,,39500000AP0291,,,16,55.15,,,,,,,,,1,2,Appartement,58,2,,,,,,5.878203,46.939773
2021-683267,2021-02-23,000001,Vente,150000,,,AU MARTINET,B138,39110,39500,Salins-les-Bains,39,,,39500000AX0007,,,,,,,,,,,,,0,,,,,J,jardins,POTAG,Jardin potager,1100,5.888362,46.9156
2021-683267,2021-02-23,000001,Vente,150000,9001,,AU MARTINET,B138,39110,39500,Salins-les-Bains,39,,,39500000AX0008,,,,,,,,,,,,,0,2,Appartement,41,4,S,sols,,,1530,5.88816,46.915491
2021-683267,2021-02-23,000001,Vente,150000,9001,,AU MARTINET,B138,39110,39500,Salins-les-Bains,39,,,39500000AX0008,,,,,,,,,,,,,0,2,Appartement,155,7,S,sols,,,1530,5.88816,46.915491
2021-683267,2021-02-23,000001,Vente,150000,9001,,AU MARTINET,B138,39110,39500,Salins-les-Bains,39,,,39500000AX0008,,,,,,,,,,,,,0,3,Dépendance,,0,S,sols,,,1530,5.88816,46.915491
2021-683267,2021-02-23,000001,Vente,150000,9001,,AU MARTINET,B138,39110,39500,Salins-les-Bains,39,,,39500000AX0008,,,,,,,,,,,,,0,3,Dépendance,,0,S,sols,,,1530,5.88816,46.915491
2021-683267,2021-02-23,000001,Vente,150000,9001,,AU MARTINET,B138,39110,39500,Salins-les-Bains,39,,,39500000AX0008,,,,,,,,,,,,,0,3,Dépendance,,0,S,sols,,,1530,5.88816,46.915491
2021-683267,2021-02-23,000001,Vente,150000,9001,,AU MARTINET,B138,39110,39500,Salins-les-Bains,39,,,39500000AX0008,,,,,,,,,,,,,0,2,Appartement,140,7,S,sols,,,1530,5.88816,46.915491
2021-683267,2021-02-23,000001,Vente,150000,9001,,AU MARTINET,B138,39110,39500,Salins-les-Bains,39,,,39500000AX0008,,,,,,,,,,,,,0,3,Dépendance,,0,S,sols,,,1530,5.88816,46.915491
2021-683267,2021-02-23,000001,Vente,150000,,,AU MARTINET,B138,39110,39500,Salins-les-Bains,39,,,39500000AX0037,,,,,,,,,,,,,0,,,,,P,prés,,,5562,5.888166,46.915769
2021-683428,2021-03-15,000001,Vente,191110,98,,RUE DE LA LIBERTE,0430,39110,39500,Salins-les-Bains,39,,,39500000AN0142,,,,,,,,,,,,,0,1,Maison,107,6,S,sols,,,516,5.88062,46.943313
2021-683489,2021-03-19,000001,Vente,66600,14,,RUE DE LA LIBERTE,0430,39110,39500,Salins-les-Bains,39,,,39500000AP0498,,,2,66.79,,,,,,,,,1,2,Appartement,67,3,,,,,,5.878164,46.939942
2021-683514,2021-03-22,000001,Vente,180000,4,,RTE DE GOUAILLE,0355,39110,39500,Salins-les-Bains,39,,,39500000AT0135,,,,,,,,,,,,,0,1,Maison,112,4,S,sols,,,1204,5.896281,46.930142
2021-683597,2021-03-19,000001,Vente,55000,4,,ESC DE CICON,0230,39110,39500,Salins-les-Bains,39,,,39500000AM0098,,,,,,,,,,,,,0,1,Maison,82,4,S,sols,,,79,5.878683,46.943805
2021-683662,2021-03-22,000001,Vente,66500,6,,RUE DES CLARISTES,0240,39110,39500,Salins-les-Bains,39,,,39500000AP0068,,,10,,,,,,,,,,1,3,Dépendance,,0,,,,,,5.878762,46.936869
2021-683662,2021-03-22,000001,Vente,66500,6,,RUE DES CLARISTES,0240,39110,39500,Salins-les-Bains,39,,,39500000AP0068,,,2,101.77,,,,,,,,,1,2,Appartement,85,4,,,,,,5.878762,46.936869
2021-683662,2021-03-22,000001,Vente,66500,6,,RUE DES CLARISTES,0240,39110,39500,Salins-les-Bains,39,,,39500000AP0068,,,6,,,,,,,,,,1,3,Dépendance,,0,,,,,,5.878762,46.936869
2021-683663,2021-03-22,000001,Vente,500,6,,RUE DES CLARISTES,0240,39110,39500,Salins-les-Bains,39,,,39500000AP0068,,,6,,,,,,,,,,1,3,Dépendance,,0,,,,,,5.878762,46.936869
2021-683851,2021-04-08,000001,Vente,500,,,LES VERGERS DE LA CROIX,B210,39110,39500,Salins-les-Bains,39,,,39500000ZR0010,,,,,,,,,,,,,0,,,,,BT,taillis simples,,,1817,5.905132,46.934938
2021-683854,2021-04-06,000001,Vente,400,,,MONTEILLER,B145,39110,39500,Salins-les-Bains,39,,,39500000ZB0050,,,,,,,,,,,,,0,,,,,P,prés,,,1060,5.868949,46.950281
2021-683878,2021-04-12,000001,Vente,26000,,,LES GALVOZ,B106,39110,39500,Salins-les-Bains,39,,,39500000AR0273,,,,,,,,,,,,,0,,,,,S,sols,,,57,5.882667,46.932425
2021-683878,2021-04-12,000001,Vente,26000,,,LES GALVOZ,B106,39110,39500,Salins-les-Bains,39,,,39500000AR0359,,,,,,,,,,,,,0,,,,,VE,vergers,,,2176,5.882424,46.932072
2021-683968,2021-04-19,000001,Vente,3000,,,SAINT ROCH EST,B232,39110,39500,Salins-les-Bains,39,,,39500000AP0021,,,,,,,,,,,,,0,,,,,BT,taillis simples,,,2500,5.88064,46.939077
2021-683968,2021-04-19,000001,Vente,3000,,,SAINT ROCH EST,B232,39110,39500,Salins-les-Bains,39,,,39500000AP0022,,,,,,,,,,,,,0,,,,,VE,vergers,,,2190,5.880395,46.938717
2021-683968,2021-04-19,000001,Vente,3000,,,SAINT ROCH EST,B232,39110,39500,Salins-les-Bains,39,,,39500000AP0023,,,,,,,,,,,,,0,,,,,BT,taillis simples,,,1170,5.880251,46.93824
2021-683968,2021-04-19,000001,Vente,3000,,,SAINT ROCH EST,B232,39110,39500,Salins-les-Bains,39,,,39500000AP0025,,,,,,,,,,,,,0,,,,,P,prés,,,5417,5.880444,46.938104
2021-683969,2021-04-15,000001,Vente,56000,15,,RUE PASTEUR,0550,39110,39500,Salins-les-Bains,39,,,39500000AR0152,,,,,,,,,,,,,0,1,Maison,112,4,S,sols,,,57,5.884828,46.929821
2021-684126,2021-04-16,000001,Vente,56000,56,,RUE DE LA REPUBLIQUE,0620,39110,39500,Salins-les-Bains,39,,,39500000AP0179,,,,,,,,,,,,,0,3,Dépendance,,0,S,sols,,,318,5.877306,46.934475
2021-684126,2021-04-16,000001,Vente,56000,56,,RUE DE LA REPUBLIQUE,0620,39110,39500,Salins-les-Bains,39,,,39500000AP0179,,,,,,,,,,,,,0,2,Appartement,192,8,S,sols,,,318,5.877306,46.934475
2021-684126,2021-04-16,000001,Vente,56000,56,,RUE DE LA REPUBLIQUE,0620,39110,39500,Salins-les-Bains,39,,,39500000AP0179,,,,,,,,,,,,,0,2,Appartement,49,2,S,sols,,,318,5.877306,46.934475
2021-684126,2021-04-16,000001,Vente,56000,56,,RUE DE LA REPUBLIQUE,0620,39110,39500,Salins-les-Bains,39,,,39500000AP0179,,,,,,,,,,,,,0,2,Appartement,87,2,S,sols,,,318,5.877306,46.934475
2021-684126,2021-04-16,000001,Vente,56000,56,,RUE DE LA REPUBLIQUE,0620,39110,39500,Salins-les-Bains,39,,,39500000AP0179,,,,,,,,,,,,,0,4,Local industriel. commercial ou assimilé,120,0,S,sols,,,318,5.877306,46.934475
2021-684126,2021-04-16,000001,Vente,56000,56,,RUE DE LA REPUBLIQUE,0620,39110,39500,Salins-les-Bains,39,,,39500000AP0179,,,,,,,,,,,,,0,2,Appartement,41,2,S,sols,,,318,5.877306,46.934475
2021-684126,2021-04-16,000001,Vente,56000,56,,RUE DE LA REPUBLIQUE,0620,39110,39500,Salins-les-Bains,39,,,39500000AP0179,,,,,,,,,,,,,0,2,Appartement,41,2,S,sols,,,318,5.877306,46.934475
2021-684126,2021-04-16,000001,Vente,56000,56,,RUE DE LA REPUBLIQUE,0620,39110,39500,Salins-les-Bains,39,,,39500000AP0179,,,,,,,,,,,,,0,2,Appartement,87,3,S,sols,,,318,5.877306,46.934475
2021-684126,2021-04-16,000001,Vente,56000,56,,RUE DE LA REPUBLIQUE,0620,39110,39500,Salins-les-Bains,39,,,39500000AP0179,,,,,,,,,,,,,0,3,Dépendance,,0,S,sols,,,318,5.877306,46.934475
2021-684126,2021-04-16,000001,Vente,56000,56,,RUE DE LA REPUBLIQUE,0620,39110,39500,Salins-les-Bains,39,,,39500000AP0179,,,,,,,,,,,,,0,3,Dépendance,,0,S,sols,,,318,5.877306,46.934475
2021-684126,2021-04-16,000001,Vente,56000,56,,RUE DE LA REPUBLIQUE,0620,39110,39500,Salins-les-Bains,39,,,39500000AP0179,,,,,,,,,,,,,0,3,Dépendance,,0,S,sols,,,318,5.877306,46.934475
2021-684218,2021-04-23,000001,Vente,172500,105,,RUE DE LA REPUBLIQUE,0620,39110,39500,Salins-les-Bains,39,,,39500000AP0146,,,23,,5,236.13,7,,,,,,3,2,Appartement,222,5,,,,,,5.878331,46.933638
2021-684218,2021-04-23,000001,Vente,172500,105,,RUE DE LA REPUBLIQUE,0620,39110,39500,Salins-les-Bains,39,,,39500000AP0146,,,1,,,,,,,,,,1,3,Dépendance,,0,,,,,,5.878331,46.933638
2021-684371,2021-04-28,000001,Vente,183600,16,,RUE DE LA LIBERTE,0430,39110,39500,Salins-les-Bains,39,,,39500000AP0297,,,,,,,,,,,,,0,4,Local industriel. commercial ou assimilé,105,0,S,sols,,,264,5.878206,46.939997
2021-684371,2021-04-28,000001,Vente,183600,16,,RUE DE LA LIBERTE,0430,39110,39500,Salins-les-Bains,39,,,39500000AP0297,,,,,,,,,,,,,0,2,Appartement,44,2,S,sols,,,264,5.878206,46.939997
2021-684371,2021-04-28,000001,Vente,183600,16,,RUE DE LA LIBERTE,0430,39110,39500,Salins-les-Bains,39,,,39500000AP0297,,,,,,,,,,,,,0,4,Local industriel. commercial ou assimilé,62,0,S,sols,,,264,5.878206,46.939997
2021-684371,2021-04-28,000001,Vente,183600,16,,RUE DE LA LIBERTE,0430,39110,39500,Salins-les-Bains,39,,,39500000AP0297,,,,,,,,,,,,,0,2,Appartement,130,4,S,sols,,,264,5.878206,46.939997
2021-684371,2021-04-28,000001,Vente,183600,16,,RUE DE LA LIBERTE,0430,39110,39500,Salins-les-Bains,39,,,39500000AP0297,,,,,,,,,,,,,0,2,Appartement,130,4,S,sols,,,264,5.878206,46.939997
2021-684371,2021-04-28,000001,Vente,183600,16,,RUE DE LA LIBERTE,0430,39110,39500,Salins-les-Bains,39,,,39500000AP0297,,,,,,,,,,,,,0,2,Appartement,115,3,S,sols,,,264,5.878206,46.939997
2021-684371,2021-04-28,000001,Vente,183600,16,,RUE DE LA LIBERTE,0430,39110,39500,Salins-les-Bains,39,,,39500000AP0297,,,,,,,,,,,,,0,2,Appartement,130,4,S,sols,,,264,5.878206,46.939997
2021-684371,2021-04-28,000001,Vente,183600,,,EN VILLE,B215,39110,39500,Salins-les-Bains,39,,,39500000AP0497,,3,,,,,,,,,,,0,,,,,,,,,,5.878129,46.939959
2021-684374,2021-05-03,000001,Vente,20000,54,,RUE PREVAL,0600,39110,39500,Salins-les-Bains,39,,,39500000AR0255,,,,,,,,,,,,,0,4,Local industriel. commercial ou assimilé,192,0,S,sols,,,500,5.882203,46.931241
2021-684374,2021-05-03,000001,Vente,20000,,,LES GALVOZ,B106,39110,39500,Salins-les-Bains,39,,,39500000AR0393,,,,,,,,,,,,,0,,,,,S,sols,,,165,5.882035,46.931405
2021-684413,2021-05-03,000001,Vente,5000,41,,RUE D ORGEMONT,0520,39110,39500,Salins-les-Bains,39,,,39500000AP0474,,,1,118.23,9,,,,,,,,2,2,Appartement,115,5,,,,,,5.878162,46.936043
2021-684413,2021-05-03,000001,Vente,5000,41,,RUE D ORGEMONT,0520,39110,39500,Salins-les-Bains,39,,,39500000AP0474,,,17,,18,,,,,,,,2,3,Dépendance,,0,,,,,,5.878162,46.936043
2021-684413,2021-05-03,000001,Vente,5000,41,,RUE D ORGEMONT,0520,39110,39500,Salins-les-Bains,39,,,39500000AP0474,,,12,,16,,,,,,,,2,3,Dépendance,,0,,,,,,5.878162,46.936043
2021-684520,2021-05-12,000001,Vente,173488,11,,ALL DU PETIT PUITS,0558,39110,39500,Salins-les-Bains,39,,,39500000ZA0145,,,13,21.35,,,,,,,,,1,4,Local industriel. commercial ou assimilé,21,0,,,,,,5.84781,46.953517
2021-684613,2021-05-10,000001,Vente,94150,17,,RUE DE LA REPUBLIQUE,0620,39110,39500,Salins-les-Bains,39,,,39500000AP0264,,,30,83.84,,,,,,,,,1,2,Appartement,112,3,,,,,,5.877607,46.937941
2021-684614,2021-05-07,000001,Vente,155000,1,,RUE DES BARRES,0110,39110,39500,Salins-les-Bains,39,,,39500000AO0053,,,,,,,,,,,,,0,1,Maison,86,5,S,sols,,,190,5.877504,46.940921
2021-684616,2021-05-10,000001,Vente,115730,10,,RUE VICTOR CONSIDERANT,0765,39110,39500,Salins-les-Bains,39,,,39500000AP0264,,,12,131.41,17,,19,,25,,26,,7,2,Appartement,160,5,,,,,,5.877607,46.937941
2021-684637,2021-05-20,000001,Vente,40000,9009,,PL AUBAREDE,0070,39110,39500,Salins-les-Bains,39,,,39500000AP0150,,,,,,,,,,,,,0,1,Maison,72,4,S,sols,,,77,5.878825,46.932457
2021-684637,2021-05-20,000001,Vente,40000,,,EN VILLE,B215,39110,39500,Salins-les-Bains,39,,,39500000AP0430,,,,,,,,,,,,,0,,,,,S,sols,,,50,5.878768,46.932494
2021-684640,2021-05-21,000002,Vente,35000,9027,B,RTE DE CHAMPAGNOLE,0190,39110,39500,Salins-les-Bains,39,,,39500000AW0137,,,,,,,,,,,,,0,4,Local industriel. commercial ou assimilé,480,0,S,sols,,,599,5.885936,46.919929
2021-684771,2021-05-21,000001,Vente,111500,21,,RUE CHARLES MAGNIN,0210,39110,39500,Salins-les-Bains,39,,,39500000AP0292,,,10,96.7,6,,,,,,,,2,2,Appartement,91,2,,,,,,5.878164,46.939833
2021-685281,2021-06-03,000001,Vente,60000,,,QUARTIER SAINT MAURICE,B172,39110,39500,Salins-les-Bains,39,,,39500000AN0011,,,,,,,,,,,,,0,,,,,S,sols,,,256,5.87864,46.941768
2021-685281,2021-06-03,000001,Vente,60000,3,,COUR DES HALLES,0400,39110,39500,Salins-les-Bains,39,,,39500000AN0012,,,,,,,,,,,,,0,2,Appartement,59,2,S,sols,,,465,5.878441,46.94189
2021-685281,2021-06-03,000001,Vente,60000,3,,COUR DES HALLES,0400,39110,39500,Salins-les-Bains,39,,,39500000AN0012,,,,,,,,,,,,,0,2,Appartement,64,2,S,sols,,,465,5.878441,46.94189
2021-685281,2021-06-03,000001,Vente,60000,3,,COUR DES HALLES,0400,39110,39500,Salins-les-Bains,39,,,39500000AN0012,,,,,,,,,,,,,0,3,Dépendance,,0,S,sols,,,465,5.878441,46.94189
2021-685281,2021-06-03,000001,Vente,60000,3,,COUR DES HALLES,0400,39110,39500,Salins-les-Bains,39,,,39500000AN0012,,,,,,,,,,,,,0,3,Dépendance,,0,S,sols,,,465,5.878441,46.94189
2021-685281,2021-06-03,000001,Vente,60000,3,,COUR DES HALLES,0400,39110,39500,Salins-les-Bains,39,,,39500000AN0012,,,,,,,,,,,,,0,3,Dépendance,,0,S,sols,,,465,5.878441,46.94189
2021-685281,2021-06-03,000001,Vente,60000,3,,COUR DES HALLES,0400,39110,39500,Salins-les-Bains,39,,,39500000AN0012,,,,,,,,,,,,,0,3,Dépendance,,0,S,sols,,,465,5.878441,46.94189
2021-685281,2021-06-03,000001,Vente,60000,3,,COUR DES HALLES,0400,39110,39500,Salins-les-Bains,39,,,39500000AN0012,,,,,,,,,,,,,0,3,Dépendance,,0,S,sols,,,465,5.878441,46.94189
2021-685281,2021-06-03,000001,Vente,60000,3,,COUR DES HALLES,0400,39110,39500,Salins-les-Bains,39,,,39500000AN0012,,,,,,,,,,,,,0,3,Dépendance,,0,S,sols,,,465,5.878441,46.94189
2021-685281,2021-06-03,000001,Vente,60000,3,,COUR DES HALLES,0400,39110,39500,Salins-les-Bains,39,,,39500000AN0012,,,,,,,,,,,,,0,2,Appartement,65,2,S,sols,,,465,5.878441,46.94189
2021-685281,2021-06-03,000001,Vente,60000,3,,COUR DES HALLES,0400,39110,39500,Salins-les-Bains,39,,,39500000AN0012,,,,,,,,,,,,,0,2,Appartement,66,2,S,sols,,,465,5.878441,46.94189
2021-685281,2021-06-03,000001,Vente,60000,3,,COUR DES HALLES,0400,39110,39500,Salins-les-Bains,39,,,39500000AN0012,,,,,,,,,,,,,0,2,Appartement,65,2,S,sols,,,465,5.878441,46.94189
2021-685281,2021-06-03,000001,Vente,60000,3,,COUR DES HALLES,0400,39110,39500,Salins-les-Bains,39,,,39500000AN0012,,,,,,,,,,,,,0,3,Dépendance,,0,S,sols,,,465,5.878441,46.94189
2021-685281,2021-06-03,000001,Vente,60000,3,,COUR DES HALLES,0400,39110,39500,Salins-les-Bains,39,,,39500000AN0012,,,,,,,,,,,,,0,2,Appartement,57,1,S,sols,,,465,5.878441,46.94189
2021-685281,2021-06-03,000001,Vente,60000,3,,COUR DES HALLES,0400,39110,39500,Salins-les-Bains,39,,,39500000AN0012,,,,,,,,,,,,,0,3,Dépendance,,0,S,sols,,,465,5.878441,46.94189
2021-685281,2021-06-03,000001,Vente,60000,3,,COUR DES HALLES,0400,39110,39500,Salins-les-Bains,39,,,39500000AN0012,,,,,,,,,,,,,0,3,Dépendance,,0,S,sols,,,465,5.878441,46.94189
2021-685281,2021-06-03,000001,Vente,60000,3,,COUR DES HALLES,0400,39110,39500,Salins-les-Bains,39,,,39500000AN0012,,,,,,,,,,,,,0,3,Dépendance,,0,S,sols,,,465,5.878441,46.94189
2021-685281,2021-06-03,000001,Vente,60000,3,,COUR DES HALLES,0400,39110,39500,Salins-les-Bains,39,,,39500000AN0012,,,,,,,,,,,,,0,3,Dépendance,,0,S,sols,,,465,5.878441,46.94189
2021-685281,2021-06-03,000001,Vente,60000,3,,COUR DES HALLES,0400,39110,39500,Salins-les-Bains,39,,,39500000AN0012,,,,,,,,,,,,,0,3,Dépendance,,0,S,sols,,,465,5.878441,46.94189
2021-685358,2021-06-11,000002,Vente,170000,3,,CHE DE LA PLAINE,0566,39110,39500,Salins-les-Bains,39,,,39500000ZH0093,,,,,,,,,,,,,0,1,Maison,128,6,,,,,,5.882997,46.944894
2021-685561,2021-06-28,000001,Vente,140500,4,,ESC D'ARCON,0040,39110,39500,Salins-les-Bains,39,,,39500000AP0219,,,,,,,,,,,,,0,2,Appartement,60,3,S,sols,,,53,5.877914,46.937092
2021-685561,2021-06-28,000001,Vente,140500,4,,ESC D'ARCON,0040,39110,39500,Salins-les-Bains,39,,,39500000AP0219,,,,,,,,,,,,,0,2,Appartement,68,2,S,sols,,,53,5.877914,46.937092
2021-685561,2021-06-28,000001,Vente,140500,4,,ESC D'ARCON,0040,39110,39500,Salins-les-Bains,39,,,39500000AP0219,,,,,,,,,,,,,0,2,Appartement,37,1,S,sols,,,53,5.877914,46.937092
2021-685563,2021-06-15,000001,Vente,100000,40,,RUE DE LA REPUBLIQUE,0620,39110,39500,Salins-les-Bains,39,,,39500000AO0125,,,,,,,,,,,,,0,2,Appartement,102,4,S,sols,,,257,5.877248,46.935183
2021-685563,2021-06-15,000001,Vente,100000,40,,RUE DE LA REPUBLIQUE,0620,39110,39500,Salins-les-Bains,39,,,39500000AO0125,,,,,,,,,,,,,0,2,Appartement,39,2,S,sols,,,257,5.877248,46.935183
2021-685563,2021-06-15,000001,Vente,100000,40,,RUE DE LA REPUBLIQUE,0620,39110,39500,Salins-les-Bains,39,,,39500000AO0125,,,,,,,,,,,,,0,2,Appartement,85,4,S,sols,,,257,5.877248,46.935183
2021-685563,2021-06-15,000001,Vente,100000,40,,RUE DE LA REPUBLIQUE,0620,39110,39500,Salins-les-Bains,39,,,39500000AO0125,,,,,,,,,,,,,0,4,Local industriel. commercial ou assimilé,45,0,S,sols,,,257,5.877248,46.935183
2021-685563,2021-06-15,000001,Vente,100000,40,,RUE DE LA REPUBLIQUE,0620,39110,39500,Salins-les-Bains,39,,,39500000AO0125,,,,,,,,,,,,,0,2,Appartement,15,1,S,sols,,,257,5.877248,46.935183
2021-685563,2021-06-15,000001,Vente,100000,40,,RUE DE LA REPUBLIQUE,0620,39110,39500,Salins-les-Bains,39,,,39500000AO0125,,,,,,,,,,,,,0,4,Local industriel. commercial ou assimilé,60,0,S,sols,,,257,5.877248,46.935183
2021-685563,2021-06-15,000001,Vente,100000,40,,RUE DE LA REPUBLIQUE,0620,39110,39500,Salins-les-Bains,39,,,39500000AO0125,,,,,,,,,,,,,0,3,Dépendance,,0,S,sols,,,257,5.877248,46.935183
2021-685563,2021-06-15,000001,Vente,100000,40,,RUE DE LA REPUBLIQUE,0620,39110,39500,Salins-les-Bains,39,,,39500000AO0125,,,,,,,,,,,,,0,3,Dépendance,,0,S,sols,,,257,5.877248,46.935183
2021-685570,2021-06-17,000001,Vente,74450,1,,RUE CHARLES MAGNIN,0210,39110,39500,Salins-les-Bains,39,,,39500000AP0469,,,,,,,,,,,,,0,3,Dépendance,,0,S,sols,,,62,5.878083,46.939031
2021-685570,2021-06-17,000001,Vente,74450,1,,RUE CHARLES MAGNIN,0210,39110,39500,Salins-les-Bains,39,,,39500000AP0469,,,,,,,,,,,,,0,3,Dépendance,,0,S,sols,,,62,5.878083,46.939031
2021-685570,2021-06-17,000001,Vente,74450,1,,RUE CHARLES MAGNIN,0210,39110,39500,Salins-les-Bains,39,,,39500000AP0469,,,,,,,,,,,,,0,2,Appartement,113,4,S,sols,,,62,5.878083,46.939031
2021-685570,2021-06-17,000001,Vente,74450,1,,RUE CHARLES MAGNIN,0210,39110,39500,Salins-les-Bains,39,,,39500000AP0469,,,,,,,,,,,,,0,2,Appartement,33,2,S,sols,,,62,5.878083,46.939031
2021-685676,2021-07-01,000001,Vente,25800,52,B,RUE PASTEUR,0550,39110,39500,Salins-les-Bains,39,,,39500000AR0210,,,,,,,,,,,,,0,1,Maison,81,4,S,sols,,,101,5.885311,46.929287
2021-685677,2021-07-01,000001,Vente,12000,,,LES PRAILLES OUEST,B159,39110,39500,Salins-les-Bains,39,,,39500000AV0066,,,,,,,,,,,,,0,,,,,J,jardins,POTAG,Jardin potager,556,5.886202,46.924478
2021-685685,2021-06-28,000001,Vente,40000,51,,RUE CHARLES MAGNIN,0210,39110,39500,Salins-les-Bains,39,,,39500000AN0251,,,3,46.17,,,,,,,,,1,2,Appartement,44,2,,,,,,5.878922,46.941434
2021-685976,2021-07-06,000001,Vente,390000,74,,RUE DE LA REPUBLIQUE,0620,39110,39500,Salins-les-Bains,39,,,39500000AP0403,,,3,68,7,,,,,,,,2,2,Appartement,50,2,,,,,,5.877547,46.933956
2021-685976,2021-07-06,000001,Vente,390000,74,,RUE DE LA REPUBLIQUE,0620,39110,39500,Salins-les-Bains,39,,,39500000AP0403,,,1,120,,,,,,,,,1,4,Local industriel. commercial ou assimilé,107,0,,,,,,5.877547,46.933956
2021-685976,2021-07-06,000001,Vente,390000,74,,RUE DE LA REPUBLIQUE,0620,39110,39500,Salins-les-Bains,39,,,39500000AP0403,,,4,49.23,6,,,,,,,,2,2,Appartement,57,3,,,,,,5.877547,46.933956
2021-685976,2021-07-06,000001,Vente,390000,74,,RUE DE LA REPUBLIQUE,0620,39110,39500,Salins-les-Bains,39,,,39500000AP0403,,,2,70,5,,8,,9,,,,4,2,Appartement,90,2,,,,,,5.877547,46.933956
2021-685976,2021-07-06,000001,Vente,390000,74,,RUE DE LA REPUBLIQUE,0620,39110,39500,Salins-les-Bains,39,,,39500000AP0403,,,3,68,7,,,,,,,,2,3,Dépendance,,0,,,,,,5.877547,46.933956