id_mutation,date_mutation,numero_disposition,nature_mutation,valeur_fonciere,adresse_numero,adresse_suffixe,adresse_nom_voie,adresse_code_voie,code_postal,code_commune,nom_commune,code_departement,ancien_code_commune,ancien_nom_commune,id_parcelle,ancien_id_parcelle,numero_volume,lot1_numero,lot1_surface_carrez,lot2_numero,lot2_surface_carrez,lot3_numero,lot3_surface_carrez,lot4_numero,lot4_surface_carrez,lot5_numero,lot5_surface_carrez,nombre_lots,code_type_local,type_local,surface_reelle_bati,nombre_pieces_principales,code_nature_culture,nature_culture,code_nature_culture_speciale,nature_culture_speciale,surface_terrain,longitude,latitude
2021-706192,2021-01-20,000001,Vente,10500,,,LA CROIX BEDIN,B019,41100,41003,Areines,41,,,410030000A1358,,,,,,,,,,,,,0,,,,,P,prés,,,1240,1.084089,47.799076
2021-706192,2021-01-20,000001,Vente,10500,,,LA CROIX BEDIN,B019,41100,41003,Areines,41,,,410030000A1359,,,,,,,,,,,,,0,,,,,P,prés,,,1393,1.083961,47.799256
2021-706192,2021-01-20,000001,Vente,10500,,,LA CROIX BEDIN,B019,41100,41003,Areines,41,,,410030000A1361,,,,,,,,,,,,,0,,,,,P,prés,,,1841,1.084564,47.798487
2021-707694,2021-03-11,000001,Vente,33000,13,,RTE DE LA NONNETIERE,0058,41100,41003,Areines,41,,,41003000ZB0190,,,,,,,,,,,,,0,3,Dépendance,,0,S,sols,,,899,1.1018,47.801475
2021-707694,2021-03-11,000001,Vente,33000,13,,RTE DE LA NONNETIERE,0058,41100,41003,Areines,41,,,41003000ZB0190,,,,,,,,,,,,,0,3,Dépendance,,0,AG,terrains d'agrément,,,1216,1.1018,47.801475
2021-708094,2021-04-06,000001,Vente,232600,3,,CHE DE MALABRY,0048,41100,41003,Areines,41,,,410030000A1268,,,,,,,,,,,,,0,1,Maison,198,5,S,sols,,,1020,1.11409,47.802505
2021-709042,2021-05-11,000001,Vente,1800,,,BRULENE,B010,41100,41003,Areines,41,,,410030000A0789,,,,,,,,,,,,,0,,,,,T,terres,,,985,1.109419,47.793696
2021-709042,2021-05-11,000001,Vente,1800,,,LA FONTENELLE,B028,41100,41003,Areines,41,,,41003000ZB0025,,,,,,,,,,,,,0,,,,,T,terres,,,4890,1.106254,47.798178
2021-710052,2021-05-31,000001,Vente,180000,28,,RUE DE LA VALLEE DU LOIR,0100,41100,41003,Areines,41,,,410030000A0395,,,,,,,,,,,,,0,1,Maison,204,7,S,sols,,,1058,1.092965,47.801629
2021-710052,2021-05-31,000001,Vente,180000,28,,RUE DE LA VALLEE DU LOIR,0100,41100,41003,Areines,41,,,410030000A0395,,,,,,,,,,,,,0,3,Dépendance,,0,S,sols,,,1058,1.092965,47.801629
2021-710052,2021-05-31,000001,Vente,180000,,,LE BOURG,B009,41100,41003,Areines,41,,,410030000A0911,,,,,,,,,,,,,0,,,,,J,jardins,,,728,1.092767,47.801605
2021-710084,2021-06-02,000001,Vente,90000,22,,RTE DE ROCE,0070,41100,41003,Areines,41,,,410030000A1013,,,,,,,,,,,,,0,1,Maison,65,3,S,sols,,,800,1.108229,47.798765
2021-710127,2021-06-17,000001,Vente,11500,,,ENTRE LES PONTS,B025,41100,41003,Areines,41,,,41003000ZA0094,,,,,,,,,,,,,0,,,,,S,sols,,,23,1.084218,47.802468
2021-710127,2021-06-17,000001,Vente,11500,,,ENTRE LES PONTS,B025,41100,41003,Areines,41,,,41003000ZA0095,,,,,,,,,,,,,0,,,,,J,jardins,,,734,1.084289,47.802442
2021-710127,2021-06-17,000001,Vente,11500,,,ENTRE LES PONTS,B025,41100,41003,Areines,41,,,41003000ZA0217,,,,,,,,,,,,,0,,,,,P,prés,,,860,1.084818,47.802
2021-710127,2021-06-17,000001,Vente,11500,,,ENTRE LES PONTS,B025,41100,41003,Areines,41,,,41003000ZA0219,,,,,,,,,,,,,0,,,,,P,prés,,,33,1.084738,47.80115
2021-710668,2021-07-05,000001,Vente,70000,14,,RUE DE L ECOLE,0023,41100,41003,Areines,41,,,410030000A0411,,,,,,,,,,,,,0,1,Maison,106,5,S,sols,,,209,1.094575,47.801214
2021-710668,2021-07-05,000001,Vente,70000,14,,RUE DE L ECOLE,0023,41100,41003,Areines,41,,,410030000A0411,,,,,,,,,,,,,0,3,Dépendance,,0,S,sols,,,209,1.094575,47.801214
2021-711028,2021-06-28,000001,Vente,200000,,,LE BOURG,B009,41100,41003,Areines,41,,,410030000A1339,,,,,,,,,,,,,0,,,,,AB,terrains a bâtir,,,654,1.095513,47.801075
2021-714263,2021-10-21,000001,Vente,3000,,,BRULENE,B010,41100,41003,Areines,41,,,410030000A0783,,,,,,,,,,,,,0,,,,,E,eaux,,,420,1.111343,47.793047
2021-714263,2021-10-21,000001,Vente,3000,,,BRULENE,B010,41100,41003,Areines,41,,,410030000A0784,,,,,,,,,,,,,0,,,,,T,terres,,,3928,1.110925,47.793303
2021-714263,2021-10-21,000001,Vente,3000,,,BRULENE,B010,41100,41003,Areines,41,,,410030000A0785,,,,,,,,,,,,,0,,,,,T,terres,,,3604,1.109108,47.794469
2021-714290,2021-10-21,000001,Vente,900,,,LA BIZARDERIE,B003,41100,41003,Areines,41,,,410030000A0655,,,,,,,,,,,,,0,,,,,T,terres,,,2485,1.109918,47.798549
2021-714404,2021-10-26,000002,Vente,317800,22,B,RTE DE BEAUGENCY,0005,41100,41003,Areines,41,,,41003000ZA0220,,,,,,,,,,,,,0,1,Maison,71,4,,,,,,1.092007,47.794572
2021-714404,2021-10-26,000002,Vente,317800,22,,RTE DE BEAUGENCY,0005,41100,41003,Areines,41,,,41003000ZA0223,,,,,,,,,,,,,0,1,Maison,136,5,,,,,,1.09217,47.794534
2021-715314,2021-11-24,000001,Vente,116000,2,,RUE DE COGNEBUEE,0015,41100,41003,Areines,41,,,41003000ZB0107,,,,,,,,,,,,,0,1,Maison,94,5,S,sols,,,621,1.094303,47.801986
