id_mutation,date_mutation,numero_disposition,nature_mutation,valeur_fonciere,adresse_numero,adresse_suffixe,adresse_nom_voie,adresse_code_voie,code_postal,code_commune,nom_commune,code_departement,ancien_code_commune,ancien_nom_commune,id_parcelle,ancien_id_parcelle,numero_volume,lot1_numero,lot1_surface_carrez,lot2_numero,lot2_surface_carrez,lot3_numero,lot3_surface_carrez,lot4_numero,lot4_surface_carrez,lot5_numero,lot5_surface_carrez,nombre_lots,code_type_local,type_local,surface_reelle_bati,nombre_pieces_principales,code_nature_culture,nature_culture,code_nature_culture_speciale,nature_culture_speciale,surface_terrain,longitude,latitude
2021-706641,2021-01-26,000001,Vente,2900,,,FOSSE PINEUSE,B056,41310,41107,Lancé,41,,,411070000C0128,,,,,,,,,,,,,0,,,,,BS,taillis sous futaie,,,3200,1.086628,47.678782
2021-707318,2021-02-23,000001,Vente,31000,,,LE PETIT BOIS,B111,41310,41107,Lancé,41,,,41107000ZI0007,,,,,,,,,,,,,0,,,,,BT,taillis simples,,,3040,1.055828,47.664554
2021-707318,2021-02-23,000001,Vente,31000,,,BOIS DE LA LOUVE,B009,41310,41107,Lancé,41,,,41107000ZI0026,,,,,,,,,,,,,0,,,,,BT,taillis simples,,,1800,1.054825,47.667861
2021-707318,2021-02-23,000001,Vente,31000,145,,LES JUMEAUX,B087,41310,41107,Lancé,41,,,41107000ZK0032,,,,,,,,,,,,,0,1,Maison,22,1,T,terres,,,10260,1.052132,47.670291
2021-707318,2021-02-23,000001,Vente,31000,145,,LES JUMEAUX,B087,41310,41107,Lancé,41,,,41107000ZK0032,,,,,,,,,,,,,0,1,Maison,22,1,VE,vergers,,,1640,1.052132,47.670291
2021-707318,2021-02-23,000001,Vente,31000,145,,LES JUMEAUX,B087,41310,41107,Lancé,41,,,41107000ZK0032,,,,,,,,,,,,,0,1,Maison,22,1,S,sols,,,1170,1.052132,47.670291
2021-707318,2021-02-23,000001,Vente,31000,,,PIECE DE LA CHAPELLE,B117,41310,41107,Lancé,41,,,41107000ZK0038,,,,,,,,,,,,,0,,,,,T,terres,,,27220,1.05142,47.666937
2021-708034,2021-03-19,000001,Vente,90000,38,,RUE SAINT MARTIN,0105,41310,41107,Lancé,41,,,411070000B0580,,,,,,,,,,,,,0,1,Maison,75,4,S,sols,,,460,1.06846,47.695256
2021-708034,2021-03-19,000001,Vente,90000,,,LE BOURG,B015,41310,41107,Lancé,41,,,411070000B0738,,,,,,,,,,,,,0,,,,,S,sols,,,42,1.068169,47.695278
2021-708034,2021-03-19,000001,Vente,90000,,,LE BOURG,B015,41310,41107,Lancé,41,,,411070000B0738,,,,,,,,,,,,,0,,,,,T,terres,,,3192,1.068169,47.695278
2021-708034,2021-03-19,000001,Vente,90000,,,LE BOURG,B015,41310,41107,Lancé,41,,,411070000B0762,,,,,,,,,,,,,0,,,,,J,jardins,,,627,1.068152,47.694949
2021-708060,2021-03-11,000001,Vente,78000,142,,LE PETIT BOIS,B111,41310,41107,Lancé,41,,,41107000ZI0006,,,,,,,,,,,,,0,1,Maison,60,1,S,sols,,,3305,1.053959,47.662998
2021-708060,2021-03-11,000001,Vente,78000,142,,LE PETIT BOIS,B111,41310,41107,Lancé,41,,,41107000ZI0006,,,,,,,,,,,,,0,1,Maison,60,1,T,terres,,,26982,1.053959,47.662998
2021-708060,2021-03-11,000001,Vente,78000,142,,LE PETIT BOIS,B111,41310,41107,Lancé,41,,,41107000ZI0006,,,,,,,,,,,,,0,1,Maison,60,1,E,eaux,MARE,Mare,1393,1.053959,47.662998
2021-709415,2021-05-18,000001,Vente,1508,,,LE CHAMP DES GENETS,B022,41310,41107,Lancé,41,,,411070000B0211,,,,,,,,,,,,,0,,,,,BS,taillis sous futaie,,,3770,1.086898,47.684906
2021-709425,2021-05-18,000001,Vente,3150,,,LA MUSSE,B098,41310,41107,Lancé,41,,,41107000ZD0007,,,,,,,,,,,,,0,,,,,BT,taillis simples,,,7000,1.069203,47.684294
2021-712447,2021-08-17,000001,Vente,3970,,,LES LINCERES,B089,41310,41107,Lancé,41,,,41107000ZO0010,,,,,,,,,,,,,0,,,,,P,prés,,,7940,1.051324,47.697979
2021-713343,2021-09-09,000001,Vente,308000,8,,RUE DU PONT,0040,41310,41107,Lancé,41,,,41107000ZD0164,,,,,,,,,,,,,0,3,Dépendance,,0,S,sols,,,591,1.067751,47.691411
2021-713343,2021-09-09,000001,Vente,308000,8,,RUE DU PONT,0040,41310,41107,Lancé,41,,,41107000ZD0164,,,,,,,,,,,,,0,1,Maison,77,3,AG,terrains d'agrément,,,352,1.067751,47.691411
2021-713343,2021-09-09,000001,Vente,308000,8,,RUE DU PONT,0040,41310,41107,Lancé,41,,,41107000ZD0164,,,,,,,,,,,,,0,3,Dépendance,,0,AG,terrains d'agrément,,,352,1.067751,47.691411
2021-713343,2021-09-09,000001,Vente,308000,8,,RUE DU PONT,0040,41310,41107,Lancé,41,,,41107000ZD0164,,,,,,,,,,,,,0,3,Dépendance,,0,AG,terrains d'agrément,,,352,1.067751,47.691411
2021-713343,2021-09-09,000001,Vente,308000,8,,RUE DU PONT,0040,41310,41107,Lancé,41,,,41107000ZD0164,,,,,,,,,,,,,0,3,Dépendance,,0,AG,terrains d'agrément,,,352,1.067751,47.691411
2021-713343,2021-09-09,000001,Vente,308000,8,,RUE DU PONT,0040,41310,41107,Lancé,41,,,41107000ZD0164,,,,,,,,,,,,,0,3,Dépendance,,0,S,sols,,,591,1.067751,47.691411
2021-713343,2021-09-09,000001,Vente,308000,8,,RUE DU PONT,0040,41310,41107,Lancé,41,,,41107000ZD0164,,,,,,,,,,,,,0,3,Dépendance,,0,S,sols,,,591,1.067751,47.691411
2021-713343,2021-09-09,000001,Vente,308000,8,,RUE DU PONT,0040,41310,41107,Lancé,41,,,41107000ZD0164,,,,,,,,,,,,,0,1,Maison,77,3,S,sols,,,591,1.067751,47.691411
2021-713343,2021-09-09,000001,Vente,308000,,,LE CREVE,B039,41310,41107,Lancé,41,,,41107000ZD0166,,,,,,,,,,,,,0,,,,,AG,terrains d'agrément,,,737,1.067738,47.691511
2021-713343,2021-09-09,000001,Vente,308000,,,LE CREVE,B039,41310,41107,Lancé,41,,,41107000ZD0166,,,,,,,,,,,,,0,,,,,S,sols,,,263,1.067738,47.691511
2021-715513,2021-12-01,000001,Vente,125000,10,,LE PETIT PONT,B113,41310,41107,Lancé,41,,,41107000ZD0187,,,,,,,,,,,,,0,1,Maison,115,4,S,sols,,,569,1.070723,47.691604
2021-715601,2021-12-13,000002,Vente,80000,85,,LA TROISNE,B162,41310,41107,Lancé,41,,,41107000ZB0190,,,,,,,,,,,,,0,1,Maison,87,4,,,,,,1.082387,47.698005
2021-715601,2021-12-13,000002,Vente,80000,85,,LA TROISNE,B162,41310,41107,Lancé,41,,,41107000ZB0190,,,,,,,,,,,,,0,3,Dépendance,,0,,,,,,1.082387,47.698005
2021-716231,2021-12-30,000001,Vente,100000,193,,LA CROIX ROUGE,B041,41310,41107,Lancé,41,,,41107000ZP0072,,,,,,,,,,,,,0,1,Maison,160,7,S,sols,,,1500,1.067574,47.699688
2021-716231,2021-12-30,000001,Vente,100000,193,,LA CROIX ROUGE,B041,41310,41107,Lancé,41,,,41107000ZP0072,,,,,,,,,,,,,0,3,Dépendance,,0,S,sols,,,1500,1.067574,47.699688
2021-716231,2021-12-30,000001,Vente,100000,193,,LA CROIX ROUGE,B041,41310,41107,Lancé,41,,,41107000ZP0072,,,,,,,,,,,,,0,3,Dépendance,,0,S,sols,,,1500,1.067574,47.699688
