id_mutation,date_mutation,numero_disposition,nature_mutation,valeur_fonciere,adresse_numero,adresse_suffixe,adresse_nom_voie,adresse_code_voie,code_postal,code_commune,nom_commune,code_departement,ancien_code_commune,ancien_nom_commune,id_parcelle,ancien_id_parcelle,numero_volume,lot1_numero,lot1_surface_carrez,lot2_numero,lot2_surface_carrez,lot3_numero,lot3_surface_carrez,lot4_numero,lot4_surface_carrez,lot5_numero,lot5_surface_carrez,nombre_lots,code_type_local,type_local,surface_reelle_bati,nombre_pieces_principales,code_nature_culture,nature_culture,code_nature_culture_speciale,nature_culture_speciale,surface_terrain,longitude,latitude
2021-706394,2021-01-09,000001,Vente,230000,5,,RUE GABRIEL CHARRIER,0095,41000,41206,Saint-Denis-sur-Loire,41,,,412060000G0304,,,,,,,,,,,,,0,1,Maison,127,7,S,sols,,,526,1.37604,47.634385
2021-706394,2021-01-09,000001,Vente,230000,5,,RUE GABRIEL CHARRIER,0095,41000,41206,Saint-Denis-sur-Loire,41,,,412060000G0310,,,,,,,,,,,,,0,,,,,S,sols,,,474,1.376105,47.634269
2021-706776,2021-02-11,000001,Vente,138500,6,,RUE GABRIEL CHARRIER,0095,41000,41206,Saint-Denis-sur-Loire,41,,,412060000G0495,,,,,,,,,,,,,0,1,Maison,85,4,S,sols,,,479,1.375998,47.634568
2021-706776,2021-02-11,000001,Vente,138500,,,LA CROIX BARREAU,B032,41000,41206,Saint-Denis-sur-Loire,41,,,412060000G0552,,,,,,,,,,,,,0,,,,,AG,terrains d'agrément,,,356,1.375812,47.634674
2021-707222,2021-03-08,000001,Vente,6300,,,LA MOUEE,B063,41000,41206,Saint-Denis-sur-Loire,41,,,41206000ZH0037,,,,,,,,,,,,,0,,,,,T,terres,,,15768,1.356045,47.639443
2021-707710,2021-03-08,000002,Vente,60000,,,VILLEFOLET,B122,41000,41206,Saint-Denis-sur-Loire,41,,,412060000B0255,,,,,,,,,,,,,0,,,,,T,terres,,,191,1.374093,47.633552
2021-707710,2021-03-08,000002,Vente,60000,,,VILLEFOLET,B122,41000,41206,Saint-Denis-sur-Loire,41,,,412060000B0256,,,,,,,,,,,,,0,,,,,T,terres,,,97,1.374814,47.63363
2021-707710,2021-03-08,000002,Vente,60000,1,,RUE DES MOISSONS,0140,41000,41206,Saint-Denis-sur-Loire,41,,,412060000B0263,,,,,,,,,,,,,0,,,,,S,sols,,,243,1.374323,47.633412
2021-707710,2021-03-08,000002,Vente,60000,1,,RUE DES MOISSONS,0140,41000,41206,Saint-Denis-sur-Loire,41,,,412060000B0265,,,,,,,,,,,,,0,,,,,S,sols,,,210,1.374618,47.633488
2021-707710,2021-03-08,000002,Vente,60000,,,VILLEFOLET,B122,41000,41206,Saint-Denis-sur-Loire,41,,,412060000B0267,,,,,,,,,,,,,0,,,,,T,terres,,,122,1.375049,47.633684
2021-707710,2021-03-08,000002,Vente,60000,,,VILLEFOLET,B122,41000,41206,Saint-Denis-sur-Loire,41,,,412060000B0268,,,,,,,,,,,,,0,,,,,T,terres,,,13,1.375226,47.633607
2021-707710,2021-03-08,000002,Vente,60000,,,RUE DES MOISSONS,0140,41000,41206,Saint-Denis-sur-Loire,41,,,412060000B0269,,,,,,,,,,,,,0,,,,,S,sols,,,47,1.375098,47.633659
2021-707710,2021-03-08,000002,Vente,60000,,,RUE DES MOISSONS,0140,41000,41206,Saint-Denis-sur-Loire,41,,,412060000B0270,,,,,,,,,,,,,0,,,,,S,sols,,,8,1.375199,47.633598
2021-707817,2021-03-12,000001,Vente,55000,,,VILLEFOLET,B122,41000,41206,Saint-Denis-sur-Loire,41,,,412060000B0252,,,,,,,,,,,,,0,,,,,T,terres,,,222,1.374499,47.633721
2021-707817,2021-03-12,000001,Vente,55000,,,VILLEFOLET,B122,41000,41206,Saint-Denis-sur-Loire,41,,,412060000B0256,,,,,,,,,,,,,0,,,,,T,terres,,,97,1.374814,47.63363
2021-707817,2021-03-12,000001,Vente,55000,1,,RUE DES MOISSONS,0140,41000,41206,Saint-Denis-sur-Loire,41,,,412060000B0257,,,,,,,,,,,,,0,1,Maison,71,3,S,sols,,,73,1.374646,47.633602
2021-707817,2021-03-12,000001,Vente,55000,1,,RUE DES MOISSONS,0140,41000,41206,Saint-Denis-sur-Loire,41,,,412060000B0257,,,,,,,,,,,,,0,1,Maison,91,3,S,sols,,,73,1.374646,47.633602
2021-707817,2021-03-12,000001,Vente,55000,1,,RUE DES MOISSONS,0140,41000,41206,Saint-Denis-sur-Loire,41,,,412060000B0258,,,,,,,,,,,,,0,,,,,S,sols,,,110,1.374551,47.633634
2021-707817,2021-03-12,000001,Vente,55000,1,,RUE DES MOISSONS,0140,41000,41206,Saint-Denis-sur-Loire,41,,,412060000B0265,,,,,,,,,,,,,0,,,,,S,sols,,,210,1.374618,47.633488
2021-707817,2021-03-12,000001,Vente,55000,,,VILLEFOLET,B122,41000,41206,Saint-Denis-sur-Loire,41,,,412060000B0267,,,,,,,,,,,,,0,,,,,T,terres,,,122,1.375049,47.633684
2021-707817,2021-03-12,000001,Vente,55000,,,VILLEFOLET,B122,41000,41206,Saint-Denis-sur-Loire,41,,,412060000B0268,,,,,,,,,,,,,0,,,,,T,terres,,,13,1.375226,47.633607
2021-707817,2021-03-12,000001,Vente,55000,,,RUE DES MOISSONS,0140,41000,41206,Saint-Denis-sur-Loire,41,,,412060000B0269,,,,,,,,,,,,,0,,,,,S,sols,,,47,1.375098,47.633659
2021-707817,2021-03-12,000001,Vente,55000,,,RUE DES MOISSONS,0140,41000,41206,Saint-Denis-sur-Loire,41,,,412060000B0270,,,,,,,,,,,,,0,,,,,S,sols,,,8,1.375199,47.633598
2021-708086,2021-03-18,000001,Vente,99152.1,,,LES GREVES DE MACE,B045,41000,41206,Saint-Denis-sur-Loire,41,,,412060000K1164,,,,,,,,,,,,,0,,,,,AB,terrains a bâtir,,,419,1.381286,47.622404
2021-708297,2021-04-02,000001,Vente terrain à bâtir,57000,,,PISSE VIN,B068,41000,41206,Saint-Denis-sur-Loire,41,,,412060000K1145,,,,,,,,,,,,,0,,,,,AB,terrains a bâtir,,,664,1.380926,47.624172
2021-708641,2021-04-23,000001,Vente,140000,2,,CHE DE LA MARTINIERE,0127,41000,41206,Saint-Denis-sur-Loire,41,,,412060000A0185,,,,,,,,,,,,,0,1,Maison,85,5,S,sols,,,1177,1.377044,47.622505
2021-708815,2021-04-28,000001,Vente,1500,,,LES GREVES ET LE COTEAU,B046,41000,41206,Saint-Denis-sur-Loire,41,,,412060000I0094,,,,,,,,,,,,,0,,,,,T,terres,,,2580,1.402834,47.634492
2021-709934,2021-06-11,000001,Vente,197000,262,,RUE CAMILLE FAVIER,0022,41000,41206,Saint-Denis-sur-Loire,41,,,412060000K1152,,,,,,,,,,,,,0,1,Maison,104,4,S,sols,,,559,1.379939,47.623652
2021-710247,2021-06-15,000001,Vente,33500,,,LA VOIE DU SAULE,B125,41000,41206,Saint-Denis-sur-Loire,41,,,41206000ZI0015,,,,,,,,,,,,,0,,,,,T,terres,,,28190,1.36829,47.650971
2021-710384,2021-03-31,000001,Vente,,,,VILLEFOLET,B122,41000,41206,Saint-Denis-sur-Loire,41,,,412060000B0221,,,,,,,,,,,,,0,,,,,T,terres,,,6,1.375247,47.633592
2021-710384,2021-03-31,000001,Vente,,,,RUE DES MOISSONS,0140,41000,41206,Saint-Denis-sur-Loire,41,,,412060000B0224,,,,,,,,,,,,,0,,,,,S,sols,,,3,1.375231,47.633576
2021-710384,2021-03-31,000002,Vente,,,,VILLEFOLET,B122,41000,41206,Saint-Denis-sur-Loire,41,,,412060000B0216,,,,,,,,,,,,,0,,,,,S,sols,,,2,1.374983,47.634205
2021-710384,2021-03-31,000002,Vente,,,,VILLEFOLET,B122,41000,41206,Saint-Denis-sur-Loire,41,,,412060000B0219,,,,,,,,,,,,,0,,,,,S,sols,,,17,1.37517,47.634032
2021-710384,2021-03-31,000002,Vente,,,,VILLEFOLET,B122,41000,41206,Saint-Denis-sur-Loire,41,,,412060000B0220,,,,,,,,,,,,,0,,,,,S,sols,,,82,1.375381,47.633721
2021-710821,2021-06-15,000001,Vente,635000,3,,RUE MURATON,0150,41000,41206,Saint-Denis-sur-Loire,41,,,412060000K0349,,,,,,,,,,,,,0,3,Dépendance,,0,S,sols,,,1233,1.377379,47.62144
2021-710821,2021-06-15,000001,Vente,635000,3,,RUE MURATON,0150,41000,41206,Saint-Denis-sur-Loire,41,,,412060000K0349,,,,,,,,,,,,,0,1,Maison,203,6,S,sols,,,1233,1.377379,47.62144
2021-710821,2021-06-15,000001,Vente,635000,3,,RUE MURATON,0150,41000,41206,Saint-Denis-sur-Loire,41,,,412060000K0349,,,,,,,,,,,,,0,3,Dépendance,,0,S,sols,,,1233,1.377379,47.62144
2021-710970,2021-06-30,000001,Vente,393000,2,,RUE MURATON,0150,41000,41206,Saint-Denis-sur-Loire,41,,,412060000K0435,,,,,,,,,,,,,0,1,Maison,180,8,S,sols,,,285,1.377577,47.620845
2021-710970,2021-06-30,000001,Vente,393000,,,RUE MURATON,0150,41000,41206,Saint-Denis-sur-Loire,41,,,412060000K0436,,,,,,,,,,,,,0,,,,,J,jardins,,,680,1.377874,47.620571
2021-711045,2021-06-29,000001,Vente,51000,,,VILLEFOLET,B122,41000,41206,Saint-Denis-sur-Loire,41,,,412060000B0254,,,,,,,,,,,,,0,,,,,T,terres,,,235,1.374216,47.633634
2021-711045,2021-06-29,000001,Vente,51000,,,VILLEFOLET,B122,41000,41206,Saint-Denis-sur-Loire,41,,,412060000B0256,,,,,,,,,,,,,0,,,,,T,terres,,,97,1.374814,47.63363
2021-711045,2021-06-29,000001,Vente,51000,1,,RUE DES MOISSONS,0140,41000,41206,Saint-Denis-sur-Loire,41,,,412060000B0261,,,,,,,,,,,,,0,,,,,S,sols,,,65,1.374443,47.633483
2021-711045,2021-06-29,000001,Vente,51000,1,,RUE DES MOISSONS,0140,41000,41206,Saint-Denis-sur-Loire,41,,,412060000B0262,,1,,,,,,,,,,,0,,,,,,,,,,1.374385,47.633517
2021-711045,2021-06-29,000001,Vente,51000,1,,RUE DES MOISSONS,0140,41000,41206,Saint-Denis-sur-Loire,41,,,412060000B0264,,,,,,,,,,,,,0,,,,,S,sols,,,133,1.374505,47.63337
2021-711045,2021-06-29,000001,Vente,51000,1,,RUE DES MOISSONS,0140,41000,41206,Saint-Denis-sur-Loire,41,,,412060000B0265,,,,,,,,,,,,,0,,,,,S,sols,,,210,1.374618,47.633488
2021-711045,2021-06-29,000001,Vente,51000,,,VILLEFOLET,B122,41000,41206,Saint-Denis-sur-Loire,41,,,412060000B0267,,,,,,,,,,,,,0,,,,,T,terres,,,122,1.375049,47.633684
2021-711045,2021-06-29,000001,Vente,51000,,,VILLEFOLET,B122,41000,41206,Saint-Denis-sur-Loire,41,,,412060000B0268,,,,,,,,,,,,,0,,,,,T,terres,,,13,1.375226,47.633607
2021-711045,2021-06-29,000001,Vente,51000,,,RUE DES MOISSONS,0140,41000,41206,Saint-Denis-sur-Loire,41,,,412060000B0269,,,,,,,,,,,,,0,,,,,S,sols,,,47,1.375098,47.633659
2021-711045,2021-06-29,000001,Vente,51000,,,RUE DES MOISSONS,0140,41000,41206,Saint-Denis-sur-Loire,41,,,412060000B0270,,,,,,,,,,,,,0,,,,,S,sols,,,8,1.375199,47.633598
2021-711286,2021-07-23,000001,Vente,2505,,,LA MARTINIERE,B058,41000,41206,Saint-Denis-sur-Loire,41,,,412060000K0329,,,,,,,,,,,,,0,,,,,L,landes,,,501,1.379443,47.623468
2021-711672,2021-07-23,000001,Vente,346000,,,LA VALLEE DE MACE,B116,41000,41206,Saint-Denis-sur-Loire,41,,,412060000K0417,,,,,,,,,,,,,0,,,,,BT,taillis simples,,,1247,1.375714,47.621023
2021-711672,2021-07-23,000001,Vente,346000,,,LA VALLEE DE MACE,B116,41000,41206,Saint-Denis-sur-Loire,41,,,412060000K0418,,,,,,,,,,,,,0,,,,,BT,taillis simples,,,963,1.375334,47.620826
2021-711672,2021-07-23,000001,Vente,346000,,,LA VALLEE DE MACE,B116,41000,41206,Saint-Denis-sur-Loire,41,,,412060000K0419,,,,,,,,,,,,,0,,,,,AG,terrains d'agrément,,,286,1.375329,47.621096
2021-711672,2021-07-23,000001,Vente,346000,,,LA VALLEE DU MACE,B118,41000,41206,Saint-Denis-sur-Loire,41,,,412060000K0512,,,,,,,,,,,,,0,,,,,S,sols,,,34,1.375403,47.621389
2021-711672,2021-07-23,000001,Vente,346000,,,LA VALLEE DU MACE,B118,41000,41206,Saint-Denis-sur-Loire,41,,,412060000K0512,,,,,,,,,,,,,0,,,,,AG,terrains d'agrément,,,2006,1.375403,47.621389
2021-711672,2021-07-23,000001,Vente,346000,10,,RUE MURATON,0150,41000,41206,Saint-Denis-sur-Loire,41,,,412060000K1240,,,,,,,,,,,,,0,3,Dépendance,,0,S,sols,,,801,1.375544,47.621665
2021-711672,2021-07-23,000001,Vente,346000,10,,RUE MURATON,0150,41000,41206,Saint-Denis-sur-Loire,41,,,412060000K1240,,,,,,,,,,,,,0,1,Maison,201,6,S,sols,,,801,1.375544,47.621665
2021-711672,2021-07-23,000001,Vente,346000,10,,RUE MURATON,0150,41000,41206,Saint-Denis-sur-Loire,41,,,412060000K1240,,,,,,,,,,,,,0,3,Dépendance,,0,S,sols,,,801,1.375544,47.621665
2021-711796,2021-07-20,000001,Vente,595240,2,,RUE DE LA CROIX,0060,41000,41206,Saint-Denis-sur-Loire,41,,,412060000I0455,,,,,,,,,,,,,0,1,Maison,267,8,S,sols,,,56,1.395811,47.630792
2021-711796,2021-07-20,000001,Vente,595240,2,,RUE DE LA CROIX,0060,41000,41206,Saint-Denis-sur-Loire,41,,,412060000I0455,,,,,,,,,,,,,0,1,Maison,267,8,AG,terrains d'agrément,,,1033,1.395811,47.630792
2021-711796,2021-07-20,000001,Vente,595240,2,,RUE DE LA CROIX,0060,41000,41206,Saint-Denis-sur-Loire,41,,,412060000I0455,,,,,,,,,,,,,0,3,Dépendance,,0,AG,terrains d'agrément,,,1033,1.395811,47.630792
2021-711796,2021-07-20,000001,Vente,595240,2,,RUE DE LA CROIX,0060,41000,41206,Saint-Denis-sur-Loire,41,,,412060000I0455,,,,,,,,,,,,,0,3,Dépendance,,0,S,sols,,,56,1.395811,47.630792
2021-711796,2021-07-20,000001,Vente,595240,2,,RUE DE LA CROIX,0060,41000,41206,Saint-Denis-sur-Loire,41,,,412060000I0457,,,,,,,,,,,,,0,,,,,S,sols,,,387,1.395962,47.630558
2021-711977,2021-07-28,000001,Vente,80000,8,,RUE DE LA LOIRE,0120,41000,41206,Saint-Denis-sur-Loire,41,,,412060000K0013,,,,,,,,,,,,,0,1,Maison,34,1,S,sols,,,368,1.386468,47.625169
2021-711977,2021-07-28,000001,Vente,80000,8,,RUE DE LA LOIRE,0120,41000,41206,Saint-Denis-sur-Loire,41,,,412060000K0013,,,,,,,,,,,,,0,3,Dépendance,,0,S,sols,,,368,1.386468,47.625169
2021-711977,2021-07-28,000001,Vente,80000,,,LE BOURG,B012,41000,41206,Saint-Denis-sur-Loire,41,,,412060000K0717,,,,,,,,,,,,,0,,,,,AB,terrains a bâtir,,,93,1.386358,47.625097
2021-712119,2021-08-11,000001,Vente,240000,4,,RUE DES PERCE-NEIGE,0160,41000,41206,Saint-Denis-sur-Loire,41,,,412060000I0293,,,,,,,,,,,,,0,1,Maison,90,3,S,sols,,,338,1.397612,47.630012
2021-712119,2021-08-11,000001,Vente,240000,,,LES MEES,B060,41000,41206,Saint-Denis-sur-Loire,41,,,412060000I0294,,,,,,,,,,,,,0,,,,,J,jardins,,,167,1.397805,47.62985
2021-712119,2021-08-11,000001,Vente,240000,,,LES MEES,B060,41000,41206,Saint-Denis-sur-Loire,41,,,412060000I0295,,,,,,,,,,,,,0,,,,,T,terres,,,61,1.397979,47.62991
2021-712119,2021-08-11,000001,Vente,240000,,,LE VAL,B115,41000,41206,Saint-Denis-sur-Loire,41,,,412060000I0551,,,,,,,,,,,,,0,,,,,BT,taillis simples,,,3670,1.398236,47.629912
2021-713738,2021-10-08,000001,Vente,182000,21,,RUE DU CHATEAU D EAU,0040,41000,41206,Saint-Denis-sur-Loire,41,,,412060000G0147,,,,,,,,,,,,,0,1,Maison,88,2,S,sols,,,284,1.379251,47.635187
2021-713738,2021-10-08,000001,Vente,182000,21,,RUE DU CHATEAU D EAU,0040,41000,41206,Saint-Denis-sur-Loire,41,,,412060000G0147,,,,,,,,,,,,,0,3,Dépendance,,0,S,sols,,,284,1.379251,47.635187
2021-713738,2021-10-08,000001,Vente,182000,,,RUE DU CHATEAU D EAU,0040,41000,41206,Saint-Denis-sur-Loire,41,,,412060000G0148,,,,,,,,,,,,,0,,,,,S,sols,,,135,1.37933,47.635155
2021-713738,2021-10-08,000001,Vente,182000,,,RUE DU CHATEAU D EAU,0040,41000,41206,Saint-Denis-sur-Loire,41,,,412060000G0149,,,,,,,,,,,,,0,,,,,S,sols,,,208,1.379365,47.635046
2021-713738,2021-10-08,000001,Vente,182000,,,RUE DU CHATEAU D EAU,0040,41000,41206,Saint-Denis-sur-Loire,41,,,412060000G0150,,,,,,,,,,,,,0,,,,,S,sols,,,32,1.379414,47.635017
2021-713738,2021-10-08,000001,Vente,182000,,,RUE DU CHATEAU D EAU,0040,41000,41206,Saint-Denis-sur-Loire,41,,,412060000G0150,,,,,,,,,,,,,0,,,,,S,sols,,,32,1.379414,47.635017
2021-713738,2021-10-08,000001,Vente,182000,,,RUE DU CHATEAU D EAU,0040,41000,41206,Saint-Denis-sur-Loire,41,,,412060000G0150,,,,,,,,,,,,,0,,,,,S,sols,,,32,1.379414,47.635017
2021-713846,2021-07-26,000001,Vente,6000,,,LES MASURES,B059,41000,41206,Saint-Denis-sur-Loire,41,,,412060000I0109,,,,,,,,,,,,,0,,,,,L,landes,,,585,1.40442,47.63468
2021-713846,2021-07-26,000001,Vente,6000,,,LES MASURES,B059,41000,41206,Saint-Denis-sur-Loire,41,,,412060000I0445,,,,,,,,,,,,,0,,,,,T,terres,,,256,1.404416,47.63461
2021-714459,2021-10-15,000001,Vente,56000,,,LES CHAMBAUDIERES,B015,41000,41206,Saint-Denis-sur-Loire,41,,,41206000WB0250,,,,,,,,,,,,,0,,,,,T,terres,,,13,,
2021-714459,2021-10-15,000001,Vente,56000,,,LES CHAMBAUDIERES,B015,41000,41206,Saint-Denis-sur-Loire,41,,,41206000WB0251,,,,,,,,,,,,,0,,,,,P,prés,,,813,,
2021-714459,2021-10-15,000001,Vente,56000,,,LES CHAMBAUDIERES,B015,41000,41206,Saint-Denis-sur-Loire,41,,,41206000WB0254,,,,,,,,,,,,,0,,,,,P,prés,,,116,1.382828,47.632419
2021-714975,2021-11-26,000001,Vente,57000,,,VILLEFOLET,B122,41000,41206,Saint-Denis-sur-Loire,41,,,412060000B0252,,,,,,,,,,,,,0,,,,,T,terres,,,222,1.374499,47.633721
2021-714975,2021-11-26,000001,Vente,57000,,,VILLEFOLET,B122,41000,41206,Saint-Denis-sur-Loire,41,,,412060000B0256,,,,,,,,,,,,,0,,,,,T,terres,,,97,1.374814,47.63363
2021-714975,2021-11-26,000001,Vente,57000,1,,RUE DES MOISSONS,0140,41000,41206,Saint-Denis-sur-Loire,41,,,412060000B0257,,,,,,,,,,,,,0,1,Maison,71,3,S,sols,,,73,1.374646,47.633602
2021-714975,2021-11-26,000001,Vente,57000,1,,RUE DES MOISSONS,0140,41000,41206,Saint-Denis-sur-Loire,41,,,412060000B0257,,,,,,,,,,,,,0,3,Dépendance,,0,S,sols,,,73,1.374646,47.633602
2021-714975,2021-11-26,000001,Vente,57000,1,,RUE DES MOISSONS,0140,41000,41206,Saint-Denis-sur-Loire,41,,,412060000B0257,,,,,,,,,,,,,0,3,Dépendance,,0,S,sols,,,73,1.374646,47.633602
2021-714975,2021-11-26,000001,Vente,57000,1,,RUE DES MOISSONS,0140,41000,41206,Saint-Denis-sur-Loire,41,,,412060000B0257,,,,,,,,,,,,,0,1,Maison,91,3,S,sols,,,73,1.374646,47.633602
2021-714975,2021-11-26,000001,Vente,57000,1,,RUE DES MOISSONS,0140,41000,41206,Saint-Denis-sur-Loire,41,,,412060000B0258,,,,,,,,,,,,,0,,,,,S,sols,,,110,1.374551,47.633634
2021-714975,2021-11-26,000001,Vente,57000,1,,RUE DES MOISSONS,0140,41000,41206,Saint-Denis-sur-Loire,41,,,412060000B0265,,,,,,,,,,,,,0,,,,,S,sols,,,210,1.374618,47.633488
2021-714975,2021-11-26,000001,Vente,57000,,,VILLEFOLET,B122,41000,41206,Saint-Denis-sur-Loire,41,,,412060000B0267,,,,,,,,,,,,,0,,,,,T,terres,,,122,1.375049,47.633684
2021-714975,2021-11-26,000001,Vente,57000,,,VILLEFOLET,B122,41000,41206,Saint-Denis-sur-Loire,41,,,412060000B0268,,,,,,,,,,,,,0,,,,,T,terres,,,13,1.375226,47.633607
2021-714975,2021-11-26,000001,Vente,57000,,,RUE DES MOISSONS,0140,41000,41206,Saint-Denis-sur-Loire,41,,,412060000B0269,,,,,,,,,,,,,0,,,,,S,sols,,,47,1.375098,47.633659
2021-714975,2021-11-26,000001,Vente,57000,,,RUE DES MOISSONS,0140,41000,41206,Saint-Denis-sur-Loire,41,,,412060000B0270,,,,,,,,,,,,,0,,,,,S,sols,,,8,1.375199,47.633598
2021-715169,2021-11-25,000001,Vente,300000,16,,RUE DES BOULONNIERES,0031,41000,41206,Saint-Denis-sur-Loire,41,,,41206000WB0230,,,,,,,,,,,,,0,4,Local industriel. commercial ou assimilé,500,0,S,sols,,,2008,1.387281,47.631745
2021-715169,2021-11-25,000001,Vente,300000,,,LES BOULONNIERES,B011,41000,41206,Saint-Denis-sur-Loire,41,,,41206000WB0231,,,,,,,,,,,,,0,,,,,AB,terrains a bâtir,,,251,1.387214,47.631264
2021-715282,2021-11-24,000001,Vente,1847.5,,,LA MOUEE,B063,41000,41206,Saint-Denis-sur-Loire,41,,,41206000ZH0021,,,,,,,,,,,,,0,,,,,T,terres,,,3600,1.353303,47.640415
2021-715527,2021-12-03,000001,Vente,43000,,,PISSE VIN,B068,41000,41206,Saint-Denis-sur-Loire,41,,,412060000K1224,,,,,,,,,,,,,0,,,,,AG,terrains d'agrément,,,11,1.38216,47.623517
2021-715527,2021-12-03,000001,Vente,43000,,,PISSE VIN,B068,41000,41206,Saint-Denis-sur-Loire,41,,,412060000K1226,,,,,,,,,,,,,0,,,,,AG,terrains d'agrément,,,275,1.381958,47.623661
2021-715527,2021-12-03,000001,Vente,43000,,,PISSE VIN,B068,41000,41206,Saint-Denis-sur-Loire,41,,,412060000K1227,,,,,,,,,,,,,0,,,,,AG,terrains d'agrément,,,299,1.381991,47.623707
2021-715527,2021-12-03,000001,Vente,43000,,,PISSE VIN,B068,41000,41206,Saint-Denis-sur-Loire,41,,,412060000K1228,,,,,,,,,,,,,0,,,,,AG,terrains d'agrément,,,17,1.3822,47.62355
2021-715605,2021-12-17,000001,Vente,2978.07,,,LES CHAMBAUDIERES,B015,41000,41206,Saint-Denis-sur-Loire,41,,,41206000WB0013,,,,,,,,,,,,,0,,,,,T,terres,,,3350,1.388446,47.633865
2021-715605,2021-12-17,000001,Vente,2978.07,,,LES CHAMBAUDIERES,B015,41000,41206,Saint-Denis-sur-Loire,41,,,41206000WB0013,,,,,,,,,,,,,0,,,,,T,terres,,,3350,1.388446,47.633865
2021-715606,2021-12-17,000002,Vente,41821.93,,,LES TOURETTES,B113,41000,41206,Saint-Denis-sur-Loire,41,,,412060000A0017,,,,,,,,,,,,,0,,,,,T,terres,,,1070,1.366498,47.623697
2021-715606,2021-12-17,000002,Vente,41821.93,,,LE BAT DE L ANE,B007,41000,41206,Saint-Denis-sur-Loire,41,,,412060000B0140,,,,,,,,,,,,,0,,,,,T,terres,,,7547,1.367682,47.631486
2021-715606,2021-12-17,000002,Vente,41821.93,,,LE BAT DE L ANE,B007,41000,41206,Saint-Denis-sur-Loire,41,,,412060000B0140,,,,,,,,,,,,,0,,,,,T,terres,,,7547,1.367682,47.631486
2021-715606,2021-12-17,000002,Vente,41821.93,,,VILLENEUVE,B124,41000,41206,Saint-Denis-sur-Loire,41,,,412060000G0160,,,,,,,,,,,,,0,,,,,T,terres,,,880,1.381033,47.635389
2021-715606,2021-12-17,000002,Vente,41821.93,,,VILLENEUVE,B124,41000,41206,Saint-Denis-sur-Loire,41,,,412060000G0160,,,,,,,,,,,,,0,,,,,T,terres,,,440,1.381033,47.635389
2021-715606,2021-12-17,000002,Vente,41821.93,,,VILLENEUVE,B124,41000,41206,Saint-Denis-sur-Loire,41,,,412060000G0161,,,,,,,,,,,,,0,,,,,T,terres,,,403,1.380859,47.635164
2021-715606,2021-12-17,000002,Vente,41821.93,,,VILLENEUVE,B124,41000,41206,Saint-Denis-sur-Loire,41,,,412060000G0161,,,,,,,,,,,,,0,,,,,T,terres,,,806,1.380859,47.635164
2021-715606,2021-12-17,000002,Vente,41821.93,,,VILLENEUVE,B124,41000,41206,Saint-Denis-sur-Loire,41,,,412060000G0162,,,,,,,,,,,,,0,,,,,T,terres,,,1233,1.380837,47.635035
2021-715606,2021-12-17,000002,Vente,41821.93,,,VILLENEUVE,B124,41000,41206,Saint-Denis-sur-Loire,41,,,412060000G0162,,,,,,,,,,,,,0,,,,,T,terres,,,617,1.380837,47.635035
2021-715606,2021-12-17,000002,Vente,41821.93,,,VILLENEUVE,B124,41000,41206,Saint-Denis-sur-Loire,41,,,412060000G0216,,,,,,,,,,,,,0,,,,,T,terres,,,773,1.378416,47.633076
2021-715606,2021-12-17,000002,Vente,41821.93,,,VILLENEUVE,B124,41000,41206,Saint-Denis-sur-Loire,41,,,412060000G0341,,,,,,,,,,,,,0,,,,,AB,terrains a bâtir,,,624,1.38028,47.636742
2021-715606,2021-12-17,000002,Vente,41821.93,,,VILLENEUVE,B124,41000,41206,Saint-Denis-sur-Loire,41,,,412060000G0437,,,,,,,,,,,,,0,,,,,T,terres,,,772,1.380349,47.636392
2021-715606,2021-12-17,000002,Vente,41821.93,,,VILLENEUVE,B124,41000,41206,Saint-Denis-sur-Loire,41,,,412060000G0437,,,,,,,,,,,,,0,,,,,T,terres,,,772,1.380349,47.636392
2021-715606,2021-12-17,000002,Vente,41821.93,,,VILLENEUVE,B124,41000,41206,Saint-Denis-sur-Loire,41,,,412060000G0575,,,,,,,,,,,,,0,,,,,T,terres,,,771,1.379527,47.633571
2021-715606,2021-12-17,000002,Vente,41821.93,,,VILLENEUVE,B124,41000,41206,Saint-Denis-sur-Loire,41,,,412060000G0575,,,,,,,,,,,,,0,,,,,T,terres,,,772,1.379527,47.633571
2021-715606,2021-12-17,000002,Vente,41821.93,,,LES SAULAYES,B111,41000,41206,Saint-Denis-sur-Loire,41,,,412060000I0155,,,,,,,,,,,,,0,,,,,BT,taillis simples,,,233,1.403516,47.63217
2021-715606,2021-12-17,000002,Vente,41821.93,,,LES SAULAYES,B111,41000,41206,Saint-Denis-sur-Loire,41,,,412060000I0178,,,,,,,,,,,,,0,,,,,BT,taillis simples,,,355,1.402628,47.631309
2021-715606,2021-12-17,000002,Vente,41821.93,,,LES SAULAYES,B111,41000,41206,Saint-Denis-sur-Loire,41,,,412060000I0192,,,,,,,,,,,,,0,,,,,BT,taillis simples,,,147,1.401505,47.631443
2021-715606,2021-12-17,000002,Vente,41821.93,,,LES SAULAYES,B111,41000,41206,Saint-Denis-sur-Loire,41,,,412060000I0224,,,,,,,,,,,,,0,,,,,BT,taillis simples,,,684,1.400298,47.629912
2021-715606,2021-12-17,000002,Vente,41821.93,,,LES GREVES,B044,41000,41206,Saint-Denis-sur-Loire,41,,,412060000I0367,,,,,,,,,,,,,0,,,,,T,terres,,,812,1.39084,47.627145
2021-715606,2021-12-17,000002,Vente,41821.93,,,LES GREVES,B044,41000,41206,Saint-Denis-sur-Loire,41,,,412060000I0371,,,,,,,,,,,,,0,,,,,T,terres,,,1380,1.390496,47.62702
2021-715606,2021-12-17,000002,Vente,41821.93,,,LES GREVES,B044,41000,41206,Saint-Denis-sur-Loire,41,,,412060000I0372,,,,,,,,,,,,,0,,,,,T,terres,,,292,1.390099,47.627133
2021-715606,2021-12-17,000002,Vente,41821.93,,,LES GREVES,B044,41000,41206,Saint-Denis-sur-Loire,41,,,412060000I0373,,,,,,,,,,,,,0,,,,,T,terres,,,316,1.390593,47.626823
2021-715606,2021-12-17,000002,Vente,41821.93,,,LA VALLEE DE MACE,B116,41000,41206,Saint-Denis-sur-Loire,41,,,412060000K0400,,,,,,,,,,,,,0,,,,,L,landes,,,569,1.374187,47.620511
2021-715606,2021-12-17,000002,Vente,41821.93,,,LES SOLIVAILLES,B112,41000,41206,Saint-Denis-sur-Loire,41,,,41206000WA0069,,,,,,,,,,,,,0,,,,,T,terres,,,360,1.383383,47.645817
2021-715606,2021-12-17,000002,Vente,41821.93,,,LES CHAMBAUDIERES,B015,41000,41206,Saint-Denis-sur-Loire,41,,,41206000WB0012,,,,,,,,,,,,,0,,,,,T,terres,,,10400,1.388712,47.633459
2021-715606,2021-12-17,000002,Vente,41821.93,,,LES CHAMBAUDIERES,B015,41000,41206,Saint-Denis-sur-Loire,41,,,41206000WB0012,,,,,,,,,,,,,0,,,,,T,terres,,,10400,1.388712,47.633459
2021-715606,2021-12-17,000002,Vente,41821.93,,,LES BEAUVAIS,B008,41000,41206,Saint-Denis-sur-Loire,41,,,41206000WB0050,,,,,,,,,,,,,0,,,,,T,terres,,,4000,1.393917,47.637922
2021-715606,2021-12-17,000002,Vente,41821.93,,,LES BEAUVAIS,B008,41000,41206,Saint-Denis-sur-Loire,41,,,41206000WB0050,,,,,,,,,,,,,0,,,,,T,terres,,,2000,1.393917,47.637922
2021-715606,2021-12-17,000002,Vente,41821.93,,,LA VALLEE DE VILLENEUVE,B117,41000,41206,Saint-Denis-sur-Loire,41,,,41206000WB0066,,,,,,,,,,,,,0,,,,,T,terres,,,301,1.382158,47.629796
2021-715606,2021-12-17,000002,Vente,41821.93,,,LA VALLEE DE VILLENEUVE,B117,41000,41206,Saint-Denis-sur-Loire,41,,,41206000WB0067,,,,,,,,,,,,,0,,,,,T,terres,,,1543,1.382459,47.629958