id_mutation,date_mutation,numero_disposition,nature_mutation,valeur_fonciere,adresse_numero,adresse_suffixe,adresse_nom_voie,adresse_code_voie,code_postal,code_commune,nom_commune,code_departement,ancien_code_commune,ancien_nom_commune,id_parcelle,ancien_id_parcelle,numero_volume,lot1_numero,lot1_surface_carrez,lot2_numero,lot2_surface_carrez,lot3_numero,lot3_surface_carrez,lot4_numero,lot4_surface_carrez,lot5_numero,lot5_surface_carrez,nombre_lots,code_type_local,type_local,surface_reelle_bati,nombre_pieces_principales,code_nature_culture,nature_culture,code_nature_culture_speciale,nature_culture_speciale,surface_terrain,longitude,latitude
2021-706227,2021-01-07,000002,Vente,15547.56,,,VOEURS,B126,41300,41241,Selles-Saint-Denis,41,,,41241000AS0040,,,,,,,,,,,,,0,,,,,E,eaux,,,5750,1.875709,47.355589
2021-706227,2021-01-07,000002,Vente,15547.56,,,VOEURS,B126,41300,41241,Selles-Saint-Denis,41,,,41241000AS0231,,,,,,,,,,,,,0,,,,,T,terres,,,12982,1.87575,47.354905
2021-706992,2021-02-09,000001,Vente,75000,6,,CHE DU PAIRET,0221,41300,41241,Selles-Saint-Denis,41,,,41241000AE0051,,,,,,,,,,,,,0,1,Maison,81,5,S,sols,,,665,1.930204,47.388489
2021-706992,2021-02-09,000001,Vente,75000,,,LA MALTOURNEE,B047,41300,41241,Selles-Saint-Denis,41,,,41241000AE0052,,,,,,,,,,,,,0,,,,,J,jardins,,,1235,1.930345,47.388355
2021-707257,2021-02-22,000001,Vente,70000,17,,RUE DU GALOP,0140,41300,41241,Selles-Saint-Denis,41,,,41241000AK0195,,,,,,,,,,,,,0,1,Maison,81,4,S,sols,,,690,1.925903,47.38671
2021-707278,2021-02-12,000001,Vente,133000,59,,RUE DE BOURGOGNE,0030,41300,41241,Selles-Saint-Denis,41,,,41241000AE0222,,,,,,,,,,,,,0,1,Maison,86,4,S,sols,,,1044,1.931133,47.387941
2021-707338,2021-02-22,000001,Vente,120000,12,,RUE DE L AULNE,0010,41300,41241,Selles-Saint-Denis,41,,,41241000AK0054,,,,,,,,,,,,,0,1,Maison,121,5,S,sols,,,570,1.920687,47.386737
2021-707338,2021-02-22,000001,Vente,120000,,,RUE DE L AULNE,0010,41300,41241,Selles-Saint-Denis,41,,,41241000AK0055,,,,,,,,,,,,,0,,,,,S,sols,,,235,1.920786,47.386641
2021-707375,2021-02-23,000001,Vente,107662.75,,,LES LIARDS,B044,41300,41241,Selles-Saint-Denis,41,,,41241000AB0118,,,,,,,,,,,,,0,,,,,T,terres,,,20135,1.92632,47.416167
2021-707375,2021-02-23,000001,Vente,107662.75,,,LES LIARDS,B044,41300,41241,Selles-Saint-Denis,41,,,41241000AB0119,,,,,,,,,,,,,0,,,,,T,terres,,,7275,1.92639,47.415187
2021-707375,2021-02-23,000001,Vente,107662.75,,,LES LIARDS,B044,41300,41241,Selles-Saint-Denis,41,,,41241000AB0120,,,,,,,,,,,,,0,,,,,BS,taillis sous futaie,,,95070,1.930647,47.414256
2021-707375,2021-02-23,000001,Vente,107662.75,,,LES LIARDS,B044,41300,41241,Selles-Saint-Denis,41,,,41241000AB0121,,,,,,,,,,,,,0,,,,,T,terres,,,43155,1.932449,47.412833
2021-707916,2021-03-22,000001,Vente,100,,,PL DE L EGLISE,0120,41300,41241,Selles-Saint-Denis,41,,,41241000AK0829,,,,,,,,,,,,,0,,,,,S,sols,,,3,1.921869,47.383886
2021-707917,2021-03-22,000002,Vente,108900,,,PL DE L EGLISE,0120,41300,41241,Selles-Saint-Denis,41,,,41241000AK0826,,,,,,,,,,,,,0,,,,,S,sols,,,215,1.921834,47.383947
2021-707917,2021-03-22,000002,Vente,108900,10,,PL DE L EGLISE,0120,41300,41241,Selles-Saint-Denis,41,,,41241000AK0830,,,,,,,,,,,,,0,1,Maison,109,3,S,sols,,,208,1.921998,47.383972
2021-708179,2021-03-25,000001,Vente,1,,,LA LANDE,B043,41300,41241,Selles-Saint-Denis,41,,,41241000AD0344,,,,,,,,,,,,,0,,,,,BR,futaies résineuses,,,21,1.916577,47.393458
2021-708341,2021-04-07,000001,Vente,232000,18,,RUE DE LA LANDE,0177,41300,41241,Selles-Saint-Denis,41,,,41241000AD0380,,,,,,,,,,,,,0,1,Maison,98,3,S,sols,,,1005,1.915953,47.392955
2021-708341,2021-04-07,000001,Vente,232000,18,,RUE DE LA LANDE,0177,41300,41241,Selles-Saint-Denis,41,,,41241000AD0380,,,,,,,,,,,,,0,1,Maison,98,3,J,jardins,,,760,1.915953,47.392955
2021-708341,2021-04-07,000001,Vente,232000,18,,RUE DE LA LANDE,0177,41300,41241,Selles-Saint-Denis,41,,,41241000AD0380,,,,,,,,,,,,,0,1,Maison,98,3,BS,taillis sous futaie,,,1772,1.915953,47.392955
2021-708341,2021-04-07,000001,Vente,232000,18,,RUE DE LA LANDE,0177,41300,41241,Selles-Saint-Denis,41,,,41241000AD0381,,,,,,,,,,,,,0,,,,,BS,taillis sous futaie,,,3202,1.916808,47.393141
2021-708606,2021-04-08,000001,Vente,150000,44,A,RUE DES GRAVETTES,0160,41300,41241,Selles-Saint-Denis,41,,,41241000AH0303,,,3,91.36,,,,,,,,,1,1,Maison,153,6,,,,,,1.917541,47.391347
2021-708855,2021-04-23,000001,Vente,22500,3,,IMP GERMAIN - AUGER,0152,41300,41241,Selles-Saint-Denis,41,,,41241000AH0288,,,,,,,,,,,,,0,,,,,AB,terrains a bâtir,,,1166,1.915716,47.389537
2021-708872,2021-05-04,000001,Vente,190000,,,LA MALTOURNEE,B047,41300,41241,Selles-Saint-Denis,41,,,41241000AE0224,,,,,,,,,,,,,0,,,,,T,terres,,,12394,1.931462,47.388445
2021-708872,2021-05-04,000001,Vente,190000,,,LA MALTOURNEE,B047,41300,41241,Selles-Saint-Denis,41,,,41241000AE0225,,,,,,,,,,,,,0,,,,,J,jardins,,,6417,1.930868,47.388793
2021-708872,2021-05-04,000001,Vente,190000,8,,CHE DU PAIRET,0221,41300,41241,Selles-Saint-Denis,41,,,41241000AE0226,,,,,,,,,,,,,0,1,Maison,170,4,S,sols,,,620,1.930516,47.388878
2021-709277,2021-04-30,000001,Vente,108000,18,,RUE DU GALOP,0140,41300,41241,Selles-Saint-Denis,41,,,41241000AK0698,,,,,,,,,,,,,0,1,Maison,60,3,S,sols,,,459,1.925536,47.385926
2021-709277,2021-04-30,000001,Vente,108000,,,RUE DU GALOP,0140,41300,41241,Selles-Saint-Denis,41,,,41241000AK0701,,,,,,,,,,,,,0,,,,,VI,vignes,,,48,1.925632,47.385985
2021-709955,2021-05-21,000001,Vente,115000,1,,RUE DE L AULNE,0010,41300,41241,Selles-Saint-Denis,41,,,41241000AK0823,,,,,,,,,,,,,0,1,Maison,105,4,S,sols,,,207,1.921695,47.386359
2021-709955,2021-05-21,000001,Vente,115000,1,,RUE DE L AULNE,0010,41300,41241,Selles-Saint-Denis,41,,,41241000AK0823,,,,,,,,,,,,,0,3,Dépendance,,0,S,sols,,,207,1.921695,47.386359
2021-710026,2021-05-26,000001,Vente,79500,,,RUE DE BOURGOGNE,0030,41300,41241,Selles-Saint-Denis,41,,,41241000AK0131,,,,,,,,,,,,,0,,,,,J,jardins,,,330,1.923889,47.388023
2021-710026,2021-05-26,000001,Vente,79500,12,,RUE DE LA GARE,0150,41300,41241,Selles-Saint-Denis,41,,,41241000AK0132,,,,,,,,,,,,,0,1,Maison,64,3,S,sols,,,680,1.923719,47.387996
2021-710204,2021-05-31,000001,Vente,40000,8,,PL DU MAIL,0180,41300,41241,Selles-Saint-Denis,41,,,41241000AK0080,,,,,,,,,,,,,0,1,Maison,67,3,S,sols,,,235,1.922446,47.387015
2021-710348,2021-06-22,000001,Vente,47000,,,PLAISANCE,B059,41300,41241,Selles-Saint-Denis,41,,,41241000AD0354,,,,,,,,,,,,,0,,,,,T,terres,,,15,1.908661,47.394824
2021-710348,2021-06-22,000001,Vente,47000,,,PLAISANCE,B059,41300,41241,Selles-Saint-Denis,41,,,41241000AD0357,,,,,,,,,,,,,0,,,,,BR,futaies résineuses,,,4805,1.907569,47.393923
2021-710348,2021-06-22,000001,Vente,47000,,,PLAISANCE,B059,41300,41241,Selles-Saint-Denis,41,,,41241000AD0357,,,,,,,,,,,,,0,,,,,AB,terrains a bâtir,,,2500,1.907569,47.393923
2021-710519,2021-06-03,000001,Vente,165000,63,B,RUE DE PLAISANCE,0222,41300,41241,Selles-Saint-Denis,41,,,41241000AD0371,,,,,,,,,,,,,0,3,Dépendance,,0,S,sols,,,689,1.911886,47.393032
2021-710519,2021-06-03,000001,Vente,165000,63,B,RUE DE PLAISANCE,0222,41300,41241,Selles-Saint-Denis,41,,,41241000AD0371,,,,,,,,,,,,,0,1,Maison,103,6,S,sols,,,689,1.911886,47.393032
2021-710591,2021-07-02,000002,Vente,40000,,,PCE DES VARENNES,B108,41300,41241,Selles-Saint-Denis,41,,,41241000AI0260,,,,,,,,,,,,,0,,,,,S,sols,,,316,1.916592,47.385525
2021-710591,2021-07-02,000002,Vente,40000,,,RUE DES VARENNES,0259,41300,41241,Selles-Saint-Denis,41,,,41241000AI0263,,,,,,,,,,,,,0,,,,,S,sols,,,126,1.916664,47.385439
2021-710650,2021-06-25,000001,Vente,149000,44,,RUE DE L AULNE,0010,41300,41241,Selles-Saint-Denis,41,,,41241000AK0024,,,,,,,,,,,,,0,3,Dépendance,,0,S,sols,,,245,1.918955,47.386339
2021-710650,2021-06-25,000001,Vente,149000,44,,RUE DE L AULNE,0010,41300,41241,Selles-Saint-Denis,41,,,41241000AK0024,,,,,,,,,,,,,0,3,Dépendance,,0,S,sols,,,245,1.918955,47.386339
2021-710650,2021-06-25,000001,Vente,149000,44,,RUE DE L AULNE,0010,41300,41241,Selles-Saint-Denis,41,,,41241000AK0024,,,,,,,,,,,,,0,1,Maison,75,4,S,sols,,,245,1.918955,47.386339
2021-710650,2021-06-25,000001,Vente,149000,42,,RUE DE L AULNE,0010,41300,41241,Selles-Saint-Denis,41,,,41241000AK0025,,,,,,,,,,,,,0,1,Maison,118,3,S,sols,,,515,1.919063,47.3864
2021-710650,2021-06-25,000001,Vente,149000,42,,RUE DE L AULNE,0010,41300,41241,Selles-Saint-Denis,41,,,41241000AK0025,,,,,,,,,,,,,0,3,Dépendance,,0,S,sols,,,515,1.919063,47.3864
2021-710650,2021-06-25,000001,Vente,149000,42,,RUE DE L AULNE,0010,41300,41241,Selles-Saint-Denis,41,,,41241000AK0025,,,,,,,,,,,,,0,3,Dépendance,,0,S,sols,,,515,1.919063,47.3864
2021-711166,2021-06-30,000002,Vente,6270,,,LA LANDE,B043,41300,41241,Selles-Saint-Denis,41,,,41241000AD0425,,,,,,,,,,,,,0,,,,,BT,taillis simples,,,246,1.913232,47.393384
2021-711390,2021-06-29,000001,Vente,80000,3,,RUE DE L AULNE,0010,41300,41241,Selles-Saint-Denis,41,,,41241000AK0377,,,,,,,,,,,,,0,3,Dépendance,,0,S,sols,,,635,1.921554,47.386238
2021-711390,2021-06-29,000001,Vente,80000,3,,RUE DE L AULNE,0010,41300,41241,Selles-Saint-Denis,41,,,41241000AK0377,,,,,,,,,,,,,0,1,Maison,110,5,S,sols,,,635,1.921554,47.386238
2021-711471,2021-07-09,000001,Vente,138000,5,,RUE DE PLAISANCE,0222,41300,41241,Selles-Saint-Denis,41,,,41241000AI0212,,,,,,,,,,,,,0,1,Maison,91,4,S,sols,,,725,1.917741,47.386655
2021-711471,2021-07-09,000001,Vente,138000,5,,RUE DE PLAISANCE,0222,41300,41241,Selles-Saint-Denis,41,,,41241000AI0212,,,,,,,,,,,,,0,3,Dépendance,,0,S,sols,,,725,1.917741,47.386655
2021-711473,2021-07-27,000001,Vente,68000,23,,RUE DE LA GARE,0150,41300,41241,Selles-Saint-Denis,41,,,41241000AH0066,,,,,,,,,,,,,0,3,Dépendance,,0,S,sols,,,705,1.923264,47.389783
2021-711473,2021-07-27,000001,Vente,68000,23,,RUE DE LA GARE,0150,41300,41241,Selles-Saint-Denis,41,,,41241000AH0066,,,,,,,,,,,,,0,1,Maison,67,4,S,sols,,,705,1.923264,47.389783
2021-711473,2021-07-27,000001,Vente,68000,,,RTE DE MARCILLY,0200,41300,41241,Selles-Saint-Denis,41,,,41241000AH0067,,,,,,,,,,,,,0,,,,,J,jardins,,,1580,,
2021-711528,2021-07-26,000001,Vente,67000,18,,PL DE L EGLISE,0120,41300,41241,Selles-Saint-Denis,41,,,41241000AK0274,,,,,,,,,,,,,0,1,Maison,72,2,S,sols,,,215,1.922035,47.383573
2021-711528,2021-07-26,000001,Vente,67000,,,PL DE L EGLISE,0120,41300,41241,Selles-Saint-Denis,41,,,41241000AK0275,,,,,,,,,,,,,0,,,,,J,jardins,,,590,1.921786,47.38357
2021-711808,2021-07-16,000001,Vente,310000,35,,RUE DES GRAVETTES,0160,41300,41241,Selles-Saint-Denis,41,,,41241000AH0309,,,,,,,,,,,,,0,1,Maison,295,6,S,sols,,,1000,1.917759,47.390454
2021-711808,2021-07-16,000001,Vente,310000,35,,RUE DES GRAVETTES,0160,41300,41241,Selles-Saint-Denis,41,,,41241000AH0309,,,,,,,,,,,,,0,1,Maison,295,6,AG,terrains d'agrément,,,500,1.917759,47.390454
2021-711808,2021-07-16,000001,Vente,310000,35,,RUE DES GRAVETTES,0160,41300,41241,Selles-Saint-Denis,41,,,41241000AH0309,,,,,,,,,,,,,0,1,Maison,295,6,T,terres,,,1877,1.917759,47.390454
2021-712254,2021-08-26,000001,Vente,62000,,,RUE DE L AULNE,0010,41300,41241,Selles-Saint-Denis,41,,,41241000AI0076,,,,,,,,,,,,,0,,,,,S,sols,,,80,1.917092,47.385888
2021-712254,2021-08-26,000001,Vente,62000,68,,RUE DE L AULNE,0010,41300,41241,Selles-Saint-Denis,41,,,41241000AI0077,,,,,,,,,,,,,0,3,Dépendance,,0,S,sols,,,720,1.917136,47.385998
2021-712254,2021-08-26,000001,Vente,62000,68,,RUE DE L AULNE,0010,41300,41241,Selles-Saint-Denis,41,,,41241000AI0077,,,,,,,,,,,,,0,3,Dépendance,,0,S,sols,,,720,1.917136,47.385998
2021-712254,2021-08-26,000001,Vente,62000,68,,RUE DE L AULNE,0010,41300,41241,Selles-Saint-Denis,41,,,41241000AI0077,,,,,,,,,,,,,0,3,Dépendance,,0,S,sols,,,720,1.917136,47.385998
2021-712254,2021-08-26,000001,Vente,62000,68,,RUE DE L AULNE,0010,41300,41241,Selles-Saint-Denis,41,,,41241000AI0077,,,,,,,,,,,,,0,3,Dépendance,,0,S,sols,,,720,1.917136,47.385998
2021-712254,2021-08-26,000001,Vente,62000,68,,RUE DE L AULNE,0010,41300,41241,Selles-Saint-Denis,41,,,41241000AI0077,,,,,,,,,,,,,0,1,Maison,68,4,S,sols,,,720,1.917136,47.385998
2021-712254,2021-08-26,000001,Vente,62000,,,RUE DE L AULNE,0010,41300,41241,Selles-Saint-Denis,41,,,41241000AI0078,,,,,,,,,,,,,0,,,,,J,jardins,,,220,1.917284,47.386032
2021-712254,2021-08-26,000001,Vente,62000,,,RUE DE L AULNE,0010,41300,41241,Selles-Saint-Denis,41,,,41241000AI0082,,,,,,,,,,,,,0,,,,,J,jardins,,,475,1.917119,47.386493
2021-712257,2021-08-02,000001,Vente,170700,24,,RUE DES GRAVETTES,0160,41300,41241,Selles-Saint-Denis,41,,,41241000AH0274,,,,,,,,,,,,,0,1,Maison,91,3,S,sols,,,1000,1.920058,47.391485
2021-712257,2021-08-02,000001,Vente,170700,24,,RUE DES GRAVETTES,0160,41300,41241,Selles-Saint-Denis,41,,,41241000AH0274,,,,,,,,,,,,,0,1,Maison,91,3,AG,terrains d'agrément,,,1429,1.920058,47.391485
2021-712315,2021-08-11,000001,Vente,463.73,,,PL DE L EGLISE,0120,41300,41241,Selles-Saint-Denis,41,,,41241000AK0250,,,,,,,,,,,,,0,,,,,J,jardins,,,265,1.924265,47.383994
2021-712897,2021-09-06,000001,Vente,58000,25,,RUE DE L EGLISE,0130,41300,41241,Selles-Saint-Denis,41,,,41241000AK0164,,,,,,,,,,,,,0,3,Dépendance,,0,S,sols,,,630,1.923322,47.385367
2021-712897,2021-09-06,000001,Vente,58000,25,,RUE DE L EGLISE,0130,41300,41241,Selles-Saint-Denis,41,,,41241000AK0164,,,,,,,,,,,,,0,1,Maison,72,3,S,sols,,,630,1.923322,47.385367
2021-712897,2021-09-06,000001,Vente,58000,25,,RUE DE L EGLISE,0130,41300,41241,Selles-Saint-Denis,41,,,41241000AK0164,,,,,,,,,,,,,0,1,Maison,72,2,S,sols,,,630,1.923322,47.385367
2021-712897,2021-09-06,000001,Vente,58000,,,RUE DE L EGLISE,0130,41300,41241,Selles-Saint-Denis,41,,,41241000AK0165,,,,,,,,,,,,,0,,,,,J,jardins,,,1075,1.92353,47.385294
2021-713530,2021-09-16,000001,Vente,87000,2,,RUE DE L AULNE,0010,41300,41241,Selles-Saint-Denis,41,,,41241000AK0719,,,,,,,,,,,,,0,,,,,S,sols,,,54,1.92142,47.386839
2021-713530,2021-09-16,000001,Vente,87000,4,,RUE DE L AULNE,0010,41300,41241,Selles-Saint-Denis,41,,,41241000AK0720,,,,,,,,,,,,,0,3,Dépendance,,0,S,sols,,,213,1.921382,47.386929
2021-713530,2021-09-16,000001,Vente,87000,4,,RUE DE L AULNE,0010,41300,41241,Selles-Saint-Denis,41,,,41241000AK0720,,,,,,,,,,,,,0,1,Maison,75,3,S,sols,,,213,1.921382,47.386929
2021-713530,2021-09-16,000001,Vente,87000,,,PL DU MAIL,0180,41300,41241,Selles-Saint-Denis,41,,,41241000AK0723,,,,,,,,,,,,,0,,,,,J,jardins,,,77,1.921348,47.387056
2021-713728,2021-09-22,000001,Vente,25000,,,MIGERAUX,B100,41300,41241,Selles-Saint-Denis,41,,,41241000AT0379,,,,,,,,,,,,,0,,,,,BP,peupleraies,,,18383,1.877346,47.372663
2021-713742,2021-09-22,000002,Vente,15000,,,MIGERAUX,B100,41300,41241,Selles-Saint-Denis,41,,,41241000AT0380,,,,,,,,,,,,,0,,,,,BP,peupleraies,,,19717,1.87942,47.372994
2021-713958,2021-09-29,000001,Vente,4500,,,LES PRES DE L ILE,B114,41300,41241,Selles-Saint-Denis,41,,,41241000AM0009,,,,,,,,,,,,,0,,,,,P,prés,,,3625,1.917044,47.382749
2021-714058,2021-10-06,000001,Vente,145000,44,,RUE DES GRAVETTES,0160,41300,41241,Selles-Saint-Denis,41,,,41241000AH0303,,,1,96.12,,,,,,,,,1,1,Maison,96,4,,,,,,1.917541,47.391347
2021-714211,2021-10-29,000001,Vente,3225,,,RUE DE BOURGOGNE,0030,41300,41241,Selles-Saint-Denis,41,,,41241000AK0127,,,,,,,,,,,,,0,,,,,J,jardins,,,1075,1.924157,47.387956
2021-714212,2021-10-29,000001,Vente,8200,,,RUE DU GALOP,0140,41300,41241,Selles-Saint-Denis,41,,,41241000AK0771,,,,,,,,,,,,,0,,,,,S,sols,,,1,1.924298,47.385198
2021-714212,2021-10-29,000001,Vente,8200,,,RUE DU GALOP,0140,41300,41241,Selles-Saint-Denis,41,,,41241000AK0772,,,,,,,,,,,,,0,,,,,S,sols,,,11,1.924254,47.385222
2021-714212,2021-10-29,000001,Vente,8200,,,RUE DU GALOP,0140,41300,41241,Selles-Saint-Denis,41,,,41241000AK0774,,,,,,,,,,,,,0,,,,,J,jardins,,,12,1.924389,47.384946
2021-714212,2021-10-29,000001,Vente,8200,,,RUE DU GALOP,0140,41300,41241,Selles-Saint-Denis,41,,,41241000AK0775,,,,,,,,,,,,,0,,,,,J,jardins,,,792,1.924415,47.385113
2021-714368,2021-10-12,000001,Vente,80000,62,,RUE DE L AULNE,0010,41300,41241,Selles-Saint-Denis,41,,,41241000AI0088,,,,,,,,,,,,,0,1,Maison,76,4,S,sols,,,635,1.917744,47.386067
2021-714368,2021-10-12,000001,Vente,80000,62,,RUE DE L AULNE,0010,41300,41241,Selles-Saint-Denis,41,,,41241000AI0088,,,,,,,,,,,,,0,3,Dépendance,,0,S,sols,,,635,1.917744,47.386067
2021-714748,2021-10-21,000001,Vente,150600,,,LA RUE NEUVE,B066,41300,41241,Selles-Saint-Denis,41,,,41241000AB0148,,,,,,,,,,,,,0,,,,,T,terres,,,7065,1.922262,47.407917
2021-714748,2021-10-21,000001,Vente,150600,,,LA RUE NEUVE,B066,41300,41241,Selles-Saint-Denis,41,,,41241000AB0152,,,,,,,,,,,,,0,,,,,P,prés,,,3370,1.920348,47.407764
2021-714748,2021-10-21,000001,Vente,150600,,,LA RUE NEUVE,B066,41300,41241,Selles-Saint-Denis,41,,,41241000AB0345,,,,,,,,,,,,,0,,,,,J,jardins,,,1375,1.921106,47.407877
2021-714748,2021-10-21,000001,Vente,150600,,,LA RUE NEUVE,B066,41300,41241,Selles-Saint-Denis,41,,,41241000AB0345,,,,,,,,,,,,,0,,,,,S,sols,,,330,1.921106,47.407877
2021-714748,2021-10-21,000001,Vente,150600,,,LA RUE NEUVE,B066,41300,41241,Selles-Saint-Denis,41,,,41241000AB0345,,,,,,,,,,,,,0,,,,,T,terres,,,2000,1.921106,47.407877
2021-714748,2021-10-21,000001,Vente,150600,361,,LA RUE NEUVE,B066,41300,41241,Selles-Saint-Denis,41,,,41241000AB0369,,,,,,,,,,,,,0,1,Maison,60,3,S,sols,,,3686,1.92109,47.408063
2021-714748,2021-10-21,000001,Vente,150600,,,LA RUE NEUVE,B066,41300,41241,Selles-Saint-Denis,41,,,41241000AB0372,,,,,,,,,,,,,0,,,,,S,sols,,,4,1.919931,47.407969
2021-714748,2021-10-21,000001,Vente,150600,,,LE GRAND MARAIS,B038,41300,41241,Selles-Saint-Denis,41,,,41241000AC0285,,,,,,,,,,,,,0,,,,,T,terres,,,17949,1.921161,47.407123
2021-714750,2021-10-21,000002,Vente,41400,,,LA RUE NEUVE,B066,41300,41241,Selles-Saint-Denis,41,,,41241000AB0370,,,,,,,,,,,,,0,,,,,S,sols,,,651,1.92054,47.408145
2021-714750,2021-10-21,000002,Vente,41400,,,LA RUE NEUVE,B066,41300,41241,Selles-Saint-Denis,41,,,41241000AB0371,,,,,,,,,,,,,0,,,,,S,sols,,,13,1.919913,47.408035
2021-714937,2021-11-02,000001,Vente,370000,400,,LA BRONZE,B084,41300,41241,Selles-Saint-Denis,41,,,41241000AR0183,,,,,,,,,,,,,0,3,Dépendance,,0,S,sols,,,5295,1.890775,47.333654
2021-714937,2021-11-02,000001,Vente,370000,400,,LA BRONZE,B084,41300,41241,Selles-Saint-Denis,41,,,41241000AR0183,,,,,,,,,,,,,0,1,Maison,147,4,S,sols,,,5295,1.890775,47.333654
2021-714937,2021-11-02,000001,Vente,370000,,,LA BRONZE,B084,41300,41241,Selles-Saint-Denis,41,,,41241000AR0184,,,,,,,,,,,,,0,,,,,P,prés,,,9300,1.890328,47.333275
2021-714937,2021-11-02,000001,Vente,370000,,,LA BRONZE,B084,41300,41241,Selles-Saint-Denis,41,,,41241000AR0235,,,,,,,,,,,,,0,,,,,T,terres,,,11813,1.89061,47.334481
2021-714937,2021-11-02,000001,Vente,370000,,,LA BRONZE,B084,41300,41241,Selles-Saint-Denis,41,,,41241000AR0237,,,,,,,,,,,,,0,,,,,T,terres,,,3805,1.889941,47.333787
2021-714937,2021-11-02,000001,Vente,370000,,,LA BRONZE,B084,41300,41241,Selles-Saint-Denis,41,,,41241000AR0239,,,,,,,,,,,,,0,,,,,T,terres,,,260,1.889753,47.333362
2021-715018,2021-11-05,000001,Vente,285000,,,L AUBRET,B003,41300,41241,Selles-Saint-Denis,41,,,41241000AE0098,,,,,,,,,,,,,0,,,,,S,sols,,,452,1.926546,47.395751
2021-715018,2021-11-05,000001,Vente,285000,18,,RTE DE SAINT VIATRE,0255,41300,41241,Selles-Saint-Denis,41,,,41241000AE0099,,,,,,,,,,,,,0,1,Maison,194,7,AG,terrains d'agrément,,,2708,1.927588,47.395497
2021-715018,2021-11-05,000001,Vente,285000,18,,RTE DE SAINT VIATRE,0255,41300,41241,Selles-Saint-Denis,41,,,41241000AE0099,,,,,,,,,,,,,0,1,Maison,194,7,S,sols,,,800,1.927588,47.395497
2021-715018,2021-11-05,000001,Vente,285000,18,,RTE DE SAINT VIATRE,0255,41300,41241,Selles-Saint-Denis,41,,,41241000AE0099,,,,,,,,,,,,,0,3,Dépendance,,0,S,sols,,,800,1.927588,47.395497
2021-715018,2021-11-05,000001,Vente,285000,18,,RTE DE SAINT VIATRE,0255,41300,41241,Selles-Saint-Denis,41,,,41241000AE0099,,,,,,,,,,,,,0,3,Dépendance,,0,AG,terrains d'agrément,,,2708,1.927588,47.395497
2021-715624,2021-12-16,000001,Vente,5000,,,LE GRAND CLOS,B037,41300,41241,Selles-Saint-Denis,41,,,41241000AE0212,,,,,,,,,,,,,0,,,,,T,terres,,,9,1.927873,47.387955
2021-715624,2021-12-16,000001,Vente,5000,,,LE GRAND CLOS,B037,41300,41241,Selles-Saint-Denis,41,,,41241000AE0218,,,,,,,,,,,,,0,,,,,T,terres,,,9570,1.926773,47.388834
2021-715715,2021-11-29,000001,Vente,9000,,,RUE DES ECOLES,0110,41300,41241,Selles-Saint-Denis,41,,,41241000AK0541,,,,,,,,,,,,,0,,,,,J,jardins,,,29,1.924187,47.385522
2021-715715,2021-11-29,000001,Vente,9000,,,RUE DES ECOLES,0110,41300,41241,Selles-Saint-Denis,41,,,41241000AK0754,,,,,,,,,,,,,0,,,,,J,jardins,,,692,1.924008,47.385563
2021-715735,2021-12-15,000001,Vente,1800000,,,LE LUNEAU,B046,41300,41241,Selles-Saint-Denis,41,,,41241000AR0105,,,,,,,,,,,,,0,,,,,T,terres,,,48475,1.903266,47.334331
2021-715735,2021-12-15,000001,Vente,1800000,,,LE LUNEAU,B046,41300,41241,Selles-Saint-Denis,41,,,41241000AR0106,,,,,,,,,,,,,0,,,,,T,terres,,,30075,1.906544,47.334365
2021-715735,2021-12-15,000001,Vente,1800000,,,LE LUNEAU,B046,41300,41241,Selles-Saint-Denis,41,,,41241000AR0107,,,,,,,,,,,,,0,,,,,T,terres,,,39520,1.908826,47.333946
2021-715735,2021-12-15,000001,Vente,1800000,,,LE LUNEAU,B046,41300,41241,Selles-Saint-Denis,41,,,41241000AR0108,,,,,,,,,,,,,0,,,,,T,terres,,,28750,1.907994,47.335395
2021-715735,2021-12-15,000001,Vente,1800000,,,LE LUNEAU,B046,41300,41241,Selles-Saint-Denis,41,,,41241000AR0109,,,,,,,,,,,,,0,,,,,T,terres,,,59786,1.904332,47.335626
2021-715735,2021-12-15,000001,Vente,1800000,,,LE LUNEAU,B046,41300,41241,Selles-Saint-Denis,41,,,41241000AR0109,,,,,,,,,,,,,0,,,,,E,eaux,,,3926,1.904332,47.335626
2021-715735,2021-12-15,000001,Vente,1800000,,,LE LUNEAU,B046,41300,41241,Selles-Saint-Denis,41,,,41241000AR0109,,,,,,,,,,,,,0,,,,,E,eaux,,,8238,1.904332,47.335626
2021-715735,2021-12-15,000001,Vente,1800000,,,LE LUNEAU,B046,41300,41241,Selles-Saint-Denis,41,,,41241000AR0110,,,,,,,,,,,,,0,,,,,L,landes,,,10075,1.903022,47.336932
2021-715735,2021-12-15,000001,Vente,1800000,,,LE LUNEAU,B046,41300,41241,Selles-Saint-Denis,41,,,41241000AR0111,,,,,,,,,,,,,0,,,,,BS,taillis sous futaie,,,52050,1.902545,47.337643
2021-715735,2021-12-15,000001,Vente,1800000,,,LE LUNEAU,B046,41300,41241,Selles-Saint-Denis,41,,,41241000AR0114,,,,,,,,,,,,,0,,,,,BT,taillis simples,,,4600,1.89814,47.342418
2021-715735,2021-12-15,000001,Vente,1800000,,,LE LUNEAU,B046,41300,41241,Selles-Saint-Denis,41,,,41241000AR0115,,,,,,,,,,,,,0,,,,,L,landes,,,4725,1.900555,47.342064
2021-715735,2021-12-15,000001,Vente,1800000,394,,LE LUNEAU,B046,41300,41241,Selles-Saint-Denis,41,,,41241000AR0116,,,,,,,,,,,,,0,1,Maison,374,11,S,sols,,,995,1.90127,47.34163
2021-715735,2021-12-15,000001,Vente,1800000,,,LE LUNEAU,B046,41300,41241,Selles-Saint-Denis,41,,,41241000AR0117,,,,,,,,,,,,,0,,,,,AG,terrains d'agrément,,,2015,1.901428,47.341477
2021-715735,2021-12-15,000001,Vente,1800000,,,LE LUNEAU,B046,41300,41241,Selles-Saint-Denis,41,,,41241000AR0117,,,,,,,,,,,,,0,,,,,S,sols,,,500,1.901428,47.341477
2021-715735,2021-12-15,000001,Vente,1800000,,,LE LUNEAU,B046,41300,41241,Selles-Saint-Denis,41,,,41241000AR0118,,,,,,,,,,,,,0,,,,,S,sols,,,450,1.901469,47.341145
2021-715735,2021-12-15,000001,Vente,1800000,,,LE LUNEAU,B046,41300,41241,Selles-Saint-Denis,41,,,41241000AR0119,,,,,,,,,,,,,0,,,,,J,jardins,,,2450,1.901103,47.341116
2021-715735,2021-12-15,000001,Vente,1800000,393,,LE LUNEAU,B046,41300,41241,Selles-Saint-Denis,41,,,41241000AR0120,,,,,,,,,,,,,0,1,Maison,67,2,S,sols,,,6175,1.901244,47.340782
2021-715735,2021-12-15,000001,Vente,1800000,393,,LE LUNEAU,B046,41300,41241,Selles-Saint-Denis,41,,,41241000AR0120,,,,,,,,,,,,,0,3,Dépendance,,0,S,sols,,,6175,1.901244,47.340782
2021-715735,2021-12-15,000001,Vente,1800000,393,,LE LUNEAU,B046,41300,41241,Selles-Saint-Denis,41,,,41241000AR0120,,,,,,,,,,,,,0,1,Maison,82,3,S,sols,,,6175,1.901244,47.340782
2021-715735,2021-12-15,000001,Vente,1800000,393,,LE LUNEAU,B046,41300,41241,Selles-Saint-Denis,41,,,41241000AR0120,,,,,,,,,,,,,0,3,Dépendance,,0,S,sols,,,6175,1.901244,47.340782
2021-715735,2021-12-15,000001,Vente,1800000,393,,LE LUNEAU,B046,41300,41241,Selles-Saint-Denis,41,,,41241000AR0120,,,,,,,,,,,,,0,3,Dépendance,,0,S,sols,,,6175,1.901244,47.340782