id_mutation,date_mutation,numero_disposition,nature_mutation,valeur_fonciere,adresse_numero,adresse_suffixe,adresse_nom_voie,adresse_code_voie,code_postal,code_commune,nom_commune,code_departement,ancien_code_commune,ancien_nom_commune,id_parcelle,ancien_id_parcelle,numero_volume,lot1_numero,lot1_surface_carrez,lot2_numero,lot2_surface_carrez,lot3_numero,lot3_surface_carrez,lot4_numero,lot4_surface_carrez,lot5_numero,lot5_surface_carrez,nombre_lots,code_type_local,type_local,surface_reelle_bati,nombre_pieces_principales,code_nature_culture,nature_culture,code_nature_culture_speciale,nature_culture_speciale,surface_terrain,longitude,latitude
2021-706515,2021-01-27,000001,Vente,11000,,,BUISSON RENARD,B015,41600,41251,Souvigny-en-Sologne,41,,,412510000D0196,,,,,,,,,,,,,0,,,,,T,terres,,,8520,2.174084,47.655135
2021-707845,2021-03-15,000001,Vente,392400,,,RUE DE L ETANG,0060,41600,41251,Souvigny-en-Sologne,41,,,412510000E0274,,,,,,,,,,,,,0,,,,,S,sols,,,540,2.16362,47.643416
2021-707845,2021-03-15,000001,Vente,392400,,,RUE DU GATINAIS,0120,41600,41251,Souvigny-en-Sologne,41,,,412510000E0718,,,,,,,,,,,,,0,,,,,S,sols,,,1,2.163737,47.643435
2021-707845,2021-03-15,000001,Vente,392400,,,RUE DE L ETANG,0060,41600,41251,Souvigny-en-Sologne,41,,,412510000E0763,,,,,,,,,,,,,0,,,,,J,jardins,,,442,2.164034,47.643371
2021-707845,2021-03-15,000001,Vente,392400,1,,RUE DE L ETANG,0060,41600,41251,Souvigny-en-Sologne,41,,,412510000E0771,,,,,,,,,,,,,0,,,,,S,sols,,,8,2.16348,47.64346
2021-707845,2021-03-15,000001,Vente,392400,1,,RUE DE L ETANG,0060,41600,41251,Souvigny-en-Sologne,41,,,412510000E0772,,,,,,,,,,,,,0,1,Maison,170,10,S,sols,,,112,2.163405,47.643459
2021-707845,2021-03-15,000001,Vente,392400,,,RUE DU GATINAIS,0120,41600,41251,Souvigny-en-Sologne,41,,,412510000E0775,,,,,,,,,,,,,0,,,,,S,sols,,,33,2.163921,47.643535
2021-707845,2021-03-15,000001,Vente,392400,,,RUE DE L ETANG,0060,41600,41251,Souvigny-en-Sologne,41,,,412510000E0777,,,,,,,,,,,,,0,,,,,S,sols,,,48,2.16379,47.643462
2021-710049,2021-05-31,000001,Vente,84000,,,FONTENOY,B027,41600,41251,Souvigny-en-Sologne,41,,,412510000D0020,,,,,,,,,,,,,0,,,,,P,prés,,,7050,2.183458,47.654221
2021-710049,2021-05-31,000001,Vente,84000,113,,FONTENOY,B027,41600,41251,Souvigny-en-Sologne,41,,,412510000D0021,,,,,,,,,,,,,0,3,Dépendance,,0,S,sols,,,1500,2.18678,47.652061
2021-710049,2021-05-31,000001,Vente,84000,113,,FONTENOY,B027,41600,41251,Souvigny-en-Sologne,41,,,412510000D0021,,,,,,,,,,,,,0,1,Maison,165,7,S,sols,,,1500,2.18678,47.652061
2021-710049,2021-05-31,000001,Vente,84000,113,,FONTENOY,B027,41600,41251,Souvigny-en-Sologne,41,,,412510000D0021,,,,,,,,,,,,,0,3,Dépendance,,0,S,sols,,,1500,2.18678,47.652061
2021-710049,2021-05-31,000001,Vente,84000,,,FONTENOY,B027,41600,41251,Souvigny-en-Sologne,41,,,412510000D0022,,,,,,,,,,,,,0,,,,,T,terres,,,3600,2.187275,47.651796
2021-710049,2021-05-31,000001,Vente,84000,,,FONTENOY,B027,41600,41251,Souvigny-en-Sologne,41,,,412510000D0023,,,,,,,,,,,,,0,,,,,T,terres,,,32290,2.186067,47.652389
2021-710049,2021-05-31,000001,Vente,84000,,,FONTENOY,B027,41600,41251,Souvigny-en-Sologne,41,,,412510000D0023,,,,,,,,,,,,,0,,,,,BR,futaies résineuses,,,14960,2.186067,47.652389
2021-711158,2021-07-12,000001,Vente,180000,,,LE BOURG,B010,41600,41251,Souvigny-en-Sologne,41,,,412510000E0219,,,,,,,,,,,,,0,,,,,J,jardins,,,1300,2.165198,47.645708
2021-711158,2021-07-12,000001,Vente,180000,9,,ALL DE LA CHATAIGNERAIE,0013,41600,41251,Souvigny-en-Sologne,41,,,412510000E0570,,,,,,,,,,,,,0,3,Dépendance,,0,S,sols,,,532,2.16554,47.645788
2021-711158,2021-07-12,000001,Vente,180000,9,,ALL DE LA CHATAIGNERAIE,0013,41600,41251,Souvigny-en-Sologne,41,,,412510000E0570,,,,,,,,,,,,,0,1,Maison,77,5,S,sols,,,532,2.16554,47.645788
2021-711599,2021-06-15,000001,Vente,60000,,,LA VIGNETTE,B057,41600,41251,Souvigny-en-Sologne,41,,,412510000C0159,,,,,,,,,,,,,0,,,,,T,terres,,,16790,2.214204,47.649507
2021-711599,2021-06-15,000001,Vente,60000,,,LA VIGNETTE,B057,41600,41251,Souvigny-en-Sologne,41,,,412510000C0160,,,,,,,,,,,,,0,,,,,BS,taillis sous futaie,,,13600,2.214873,47.649921
2021-711599,2021-06-15,000001,Vente,60000,,,LA VIGNETTE,B057,41600,41251,Souvigny-en-Sologne,41,,,412510000C0224,,,,,,,,,,,,,0,,,,,BT,taillis simples,,,52180,2.213172,47.648731
2021-712053,2021-08-19,000001,Vente,90000,14,,ALL DE LA CHATAIGNERAIE,0013,41600,41251,Souvigny-en-Sologne,41,,,412510000E0586,,,,,,,,,,,,,0,2,Appartement,60,2,S,sols,,,534,2.165653,47.646136
2021-712053,2021-08-19,000001,Vente,90000,14,,ALL DE LA CHATAIGNERAIE,0013,41600,41251,Souvigny-en-Sologne,41,,,412510000E0586,,,,,,,,,,,,,0,3,Dépendance,,0,S,sols,,,534,2.165653,47.646136
2021-712053,2021-08-19,000001,Vente,90000,14,,ALL DE LA CHATAIGNERAIE,0013,41600,41251,Souvigny-en-Sologne,41,,,412510000E0586,,,,,,,,,,,,,0,2,Appartement,60,3,S,sols,,,534,2.165653,47.646136
2021-713203,2021-09-22,000001,Vente,117000,17,,ALL DES FONTAINES,0099,41600,41251,Souvigny-en-Sologne,41,,,412510000E0501,,,,,,,,,,,,,0,1,Maison,102,3,S,sols,,,808,2.159506,47.643304
2021-713454,2021-09-13,000001,Vente,8000,,,LE GATINAIS,B028,41600,41251,Souvigny-en-Sologne,41,,,412510000E0625,,,,,,,,,,,,,0,,,,,T,terres,,,9416,2.175359,47.652131
2021-713457,2021-09-16,000001,Vente,10000,,,BUISSON RENARD,B015,41600,41251,Souvigny-en-Sologne,41,,,412510000D0191,,,,,,,,,,,,,0,,,,,T,terres,,,11978,2.17618,47.653052
2021-713457,2021-09-16,000001,Vente,10000,,,BUISSON RENARD,B015,41600,41251,Souvigny-en-Sologne,41,,,412510000D0192,,,,,,,,,,,,,0,,,,,T,terres,,,10300,2.17523,47.65388
2021-713836,2021-10-01,000002,Vente,38500,,,LA TUILE,B056,41600,41251,Souvigny-en-Sologne,41,,,412510000C0107,,,,,,,,,,,,,0,,,,,BF,futaies feuillues,,,11348,2.226398,47.637872
2021-713836,2021-10-01,000002,Vente,38500,,,LA TUILE,B056,41600,41251,Souvigny-en-Sologne,41,,,412510000C0215,,,,,,,,,,,,,0,,,,,BT,taillis simples,,,16940,2.227166,47.636963
2021-713836,2021-10-01,000002,Vente,38500,,,LA TUILE,B056,41600,41251,Souvigny-en-Sologne,41,,,412510000C0218,,,,,,,,,,,,,0,,,,,B,bois,,,2795,2.225362,47.637
2021-713836,2021-10-01,000002,Vente,38500,,,LA TUILE,B056,41600,41251,Souvigny-en-Sologne,41,,,412510000C0218,,,,,,,,,,,,,0,,,,,BR,futaies résineuses,,,11180,2.225362,47.637
2021-713836,2021-10-01,000002,Vente,38500,,,LA TUILE,B056,41600,41251,Souvigny-en-Sologne,41,,,412510000C0372,,,,,,,,,,,,,0,,,,,BS,taillis sous futaie,,,8774,2.227882,47.638024
2021-714044,2021-10-13,000001,Vente,199000,7,B,RTE DE VANNES,0131,41600,41251,Souvigny-en-Sologne,41,,,412510000E0785,,,,,,,,,,,,,0,1,Maison,121,2,S,sols,,,760,2.16699,47.645754
2021-715357,2021-11-22,000001,Vente,180000,8,,RUE EUGENE LABICHE,0080,41600,41251,Souvigny-en-Sologne,41,,,412510000E0358,,,,,,,,,,,,,0,3,Dépendance,,0,S,sols,,,323,2.1636,47.64474
2021-715357,2021-11-22,000001,Vente,180000,8,,RUE EUGENE LABICHE,0080,41600,41251,Souvigny-en-Sologne,41,,,412510000E0358,,,,,,,,,,,,,0,1,Maison,120,4,S,sols,,,323,2.1636,47.64474
2021-715357,2021-11-22,000001,Vente,180000,12,A,RUE EUGENE LABICHE,0080,41600,41251,Souvigny-en-Sologne,41,,,412510000E0656,,,,,,,,,,,,,0,1,Maison,70,3,S,sols,,,130,2.163541,47.644833
2021-715769,2021-11-29,000001,Vente,40000,5,,RTE DE SENNELY,0126,41600,41251,Souvigny-en-Sologne,41,,,412510000E0369,,,,,,,,,,,,,0,3,Dépendance,,0,S,sols,,,400,2.162167,47.646142
2021-715769,2021-11-29,000001,Vente,40000,5,,RTE DE SENNELY,0126,41600,41251,Souvigny-en-Sologne,41,,,412510000E0369,,,,,,,,,,,,,0,1,Maison,25,2,S,sols,,,400,2.162167,47.646142
2021-715769,2021-11-29,000001,Vente,40000,,,LAUNOY,B037,41600,41251,Souvigny-en-Sologne,41,,,412510000E0373,,,,,,,,,,,,,0,,,,,J,jardins,,,240,2.161988,47.646259
