id_mutation,date_mutation,numero_disposition,nature_mutation,valeur_fonciere,adresse_numero,adresse_suffixe,adresse_nom_voie,adresse_code_voie,code_postal,code_commune,nom_commune,code_departement,ancien_code_commune,ancien_nom_commune,id_parcelle,ancien_id_parcelle,numero_volume,lot1_numero,lot1_surface_carrez,lot2_numero,lot2_surface_carrez,lot3_numero,lot3_surface_carrez,lot4_numero,lot4_surface_carrez,lot5_numero,lot5_surface_carrez,nombre_lots,code_type_local,type_local,surface_reelle_bati,nombre_pieces_principales,code_nature_culture,nature_culture,code_nature_culture_speciale,nature_culture_speciale,surface_terrain,longitude,latitude
2021-706553,2021-01-26,000001,Vente,45000,,,AU DESSUS DE SAINT ANDRE,B060,41100,41294,Villiers-sur-Loir,41,,,41294000AA0181,,,,,,,,,,,,,0,,,,,L,landes,,,496,0.979092,47.812177
2021-706553,2021-01-26,000001,Vente,45000,86,,AV PIERRE ARMAND COLIN,0270,41100,41294,Villiers-sur-Loir,41,,,41294000AA0183,,,,,,,,,,,,,0,1,Maison,40,3,S,sols,,,741,0.978701,47.811571
2021-706553,2021-01-26,000001,Vente,45000,86,,AV PIERRE ARMAND COLIN,0270,41100,41294,Villiers-sur-Loir,41,,,41294000AA0183,,,,,,,,,,,,,0,1,Maison,40,3,BT,taillis simples,,,2951,0.978701,47.811571
2021-706553,2021-01-26,000001,Vente,45000,,,COTEAU DE SAINT-ANDRE,B053,41100,41294,Villiers-sur-Loir,41,,,412940000L0759,,,,,,,,,,,,,0,,,,,BT,taillis simples,,,70,0.9705,47.812385
2021-707112,2021-02-13,000001,Vente,321850,,,CLOS QUAIRI,B049,41100,41294,Villiers-sur-Loir,41,,,41294000AB0095,,,,,,,,,,,,,0,,,,,BT,taillis simples,,,19,0.992607,47.809846
2021-707112,2021-02-13,000001,Vente,321850,54,,RUE DE LA BOISSIERE,0040,41100,41294,Villiers-sur-Loir,41,,,412940000H0053,,,,,,,,,,,,,0,1,Maison,198,6,S,sols,,,814,0.993859,47.813177
2021-707112,2021-02-13,000001,Vente,321850,,,LA BOISSIERE,B020,41100,41294,Villiers-sur-Loir,41,,,412940000H0458,,,,,,,,,,,,,0,,,,,J,jardins,,,314,0.994073,47.812984
2021-707116,2021-02-19,000001,Vente,7645.22,,,LES MARTINEAUX,B116,41100,41294,Villiers-sur-Loir,41,,,41294000ZM0087,,,,,,,,,,,,,0,,,,,T,terres,,,915,1.013454,47.819756
2021-707116,2021-02-19,000001,Vente,7645.22,,,LES MARTINEAUX,B116,41100,41294,Villiers-sur-Loir,41,,,41294000ZM0087,,,,,,,,,,,,,0,,,,,T,terres,,,914,1.013454,47.819756
2021-707120,2021-02-19,000001,Vente,12657.04,,,FOSSE BODINEAU,B066,41100,41294,Villiers-sur-Loir,41,,,41294000ZM0089,,,,,,,,,,,,,0,,,,,T,terres,,,1514,1.0128,47.820281
2021-707120,2021-02-19,000001,Vente,12657.04,,,FOSSE BODINEAU,B066,41100,41294,Villiers-sur-Loir,41,,,41294000ZM0089,,,,,,,,,,,,,0,,,,,T,terres,,,1514,1.0128,47.820281
2021-707467,2021-03-05,000001,Vente,4500,30,,RUE DE LA BOISSIERE,0040,41100,41294,Villiers-sur-Loir,41,,,41294000AC0005,,,,,,,,,,,,,0,1,Maison,44,1,S,sols,,,134,0.992889,47.811042
2021-707648,2021-03-10,000001,Vente,2000,440,,VAUCROIX,B177,41100,41294,Villiers-sur-Loir,41,,,41294000ZE0197,,,,,,,,,,,,,0,3,Dépendance,,0,S,sols,,,920,1.007716,47.804547
2021-707749,2021-03-22,000001,Vente,1000,,,LES PRES DE LA FONTAINE,B199,41100,41294,Villiers-sur-Loir,41,,,41294000ZI0382,,,,,,,,,,,,,0,,,,,P,prés,,,35,0.978429,47.806875
2021-707907,2021-03-17,000001,Vente,30000,,,RUE DE LA COUTURE,0150,41100,41294,Villiers-sur-Loir,41,,,41294000AC0187,,,,,,,,,,,,,0,,,,,S,sols,,,13,0.994099,47.807749
2021-707907,2021-03-17,000001,Vente,30000,14,,AV DU 11 NOVEMBRE,0240,41100,41294,Villiers-sur-Loir,41,,,41294000AC0239,,,,,,,,,,,,,0,,,,,S,sols,,,83,0.993231,47.807036
2021-707907,2021-03-17,000001,Vente,30000,1,B,RUE DE LA COUTURE,0150,41100,41294,Villiers-sur-Loir,41,,,41294000AC0241,,,,,,,,,,,,,0,,,,,AB,terrains a bâtir,,,794,0.993119,47.80726
2021-707907,2021-03-17,000001,Vente,30000,1,B,RUE DE LA COUTURE,0150,41100,41294,Villiers-sur-Loir,41,,,41294000AC0245,,,,,,,,,,,,,0,,,,,S,sols,,,825,0.993657,47.807379
2021-708554,2021-04-27,000001,Vente,42500,4,,RUE DU CLOS QUAIRI,0115,41100,41294,Villiers-sur-Loir,41,,,41294000AB0166,,,,,,,,,,,,,0,3,Dépendance,,0,S,sols,,,636,0.993215,47.809675
2021-709016,2021-05-12,000001,Vente,284500,9,,RUE DU COUDRAY,0140,41100,41294,Villiers-sur-Loir,41,,,41294000AA0224,,,,,,,,,,,,,0,1,Maison,148,6,S,sols,,,927,0.981684,47.811904
2021-709016,2021-05-12,000001,Vente,284500,9,,RUE DU COUDRAY,0140,41100,41294,Villiers-sur-Loir,41,,,41294000AA0224,,,,,,,,,,,,,0,1,Maison,148,6,J,jardins,,,370,0.981684,47.811904
2021-709550,2021-05-06,000001,Vente,1850,,,LE PLATREAU,B142,41100,41294,Villiers-sur-Loir,41,,,41294000ZI0009,,,,,,,,,,,,,0,,,,,J,jardins,,,375,0.977656,47.809689
2021-709848,2021-05-31,000001,Vente,255500,15,,RUE DE LA COULEE,0142,41100,41294,Villiers-sur-Loir,41,,,41294000ZH0111,,,,,,,,,,,,,0,1,Maison,102,5,T,terres,,,1058,1.000316,47.791037
2021-709848,2021-05-31,000001,Vente,255500,15,,RUE DE LA COULEE,0142,41100,41294,Villiers-sur-Loir,41,,,41294000ZH0111,,,,,,,,,,,,,0,3,Dépendance,,0,S,sols,,,945,1.000316,47.791037
2021-709848,2021-05-31,000001,Vente,255500,15,,RUE DE LA COULEE,0142,41100,41294,Villiers-sur-Loir,41,,,41294000ZH0111,,,,,,,,,,,,,0,1,Maison,102,5,J,jardins,,,777,1.000316,47.791037
2021-709848,2021-05-31,000001,Vente,255500,15,,RUE DE LA COULEE,0142,41100,41294,Villiers-sur-Loir,41,,,41294000ZH0111,,,,,,,,,,,,,0,3,Dépendance,,0,T,terres,,,1058,1.000316,47.791037
2021-709848,2021-05-31,000001,Vente,255500,15,,RUE DE LA COULEE,0142,41100,41294,Villiers-sur-Loir,41,,,41294000ZH0111,,,,,,,,,,,,,0,3,Dépendance,,0,J,jardins,,,777,1.000316,47.791037
2021-709848,2021-05-31,000001,Vente,255500,15,,RUE DE LA COULEE,0142,41100,41294,Villiers-sur-Loir,41,,,41294000ZH0111,,,,,,,,,,,,,0,3,Dépendance,,0,S,sols,,,945,1.000316,47.791037
2021-709848,2021-05-31,000001,Vente,255500,15,,RUE DE LA COULEE,0142,41100,41294,Villiers-sur-Loir,41,,,41294000ZH0111,,,,,,,,,,,,,0,1,Maison,102,5,S,sols,,,945,1.000316,47.791037
2021-709848,2021-05-31,000001,Vente,255500,15,,RUE DE LA COULEE,0142,41100,41294,Villiers-sur-Loir,41,,,41294000ZH0111,,,,,,,,,,,,,0,3,Dépendance,,0,J,jardins,,,777,1.000316,47.791037
2021-709848,2021-05-31,000001,Vente,255500,15,,RUE DE LA COULEE,0142,41100,41294,Villiers-sur-Loir,41,,,41294000ZH0111,,,,,,,,,,,,,0,3,Dépendance,,0,T,terres,,,1058,1.000316,47.791037
2021-709998,2021-05-21,000001,Vente,2500,,,LES CROCHETTES,B057,41100,41294,Villiers-sur-Loir,41,,,41294000ZN0098,,,,,,,,,,,,,0,,,,,VE,vergers,,,1290,1.011086,47.803052
2021-710106,2021-05-31,000001,Vente,600,,,PENTES DES REAUX,B129,41100,41294,Villiers-sur-Loir,41,,,41294000AA0013,,,,,,,,,,,,,0,,,,,BT,taillis simples,,,1623,0.984603,47.81251
2021-710149,2021-05-26,000001,Echange,300,,,BOIS DES HOURIS,B018,41100,41294,Villiers-sur-Loir,41,,,412940000P0286,,,,,,,,,,,,,0,,,,,BT,taillis simples,,,3435,1.018568,47.812501
2021-710149,2021-05-26,000002,Echange,300,,,BOIS DES HOURIS,B018,41100,41294,Villiers-sur-Loir,41,,,412940000P0277,,,,,,,,,,,,,0,,,,,BT,taillis simples,,,910,1.017524,47.812957
2021-710258,2021-06-11,000002,Vente,190000,5001,,RUE DU LAVOIR,0210,41100,41294,Villiers-sur-Loir,41,,,41294000ZI0553,,,,,,,,,,,,,0,1,Maison,94,5,,,,,,0.991821,47.803342
2021-710258,2021-06-11,000002,Vente,190000,5001,,RUE DU LAVOIR,0210,41100,41294,Villiers-sur-Loir,41,,,41294000ZI0553,,,,,,,,,,,,,0,3,Dépendance,,0,,,,,,0.991821,47.803342
2021-710304,2021-06-08,000001,Vente,10000,,,RUE DU COUDRAY,0140,41100,41294,Villiers-sur-Loir,41,,,41294000AA0042,,,,,,,,,,,,,0,,,,,S,sols,,,282,0.982105,47.811256
2021-710647,2021-06-24,000001,Vente,89895,6,,RUE DES FOURS A CHAUX,0182,41100,41294,Villiers-sur-Loir,41,,,41294000AB0342,,,,,,,,,,,,,0,1,Maison,73,3,S,sols,,,253,0.991053,47.809254
2021-710648,2021-07-01,000001,Vente,100000,11,,RUE DES CENT ECUS,0075,41100,41294,Villiers-sur-Loir,41,,,41294000AB0345,,,,,,,,,,,,,0,1,Maison,84,4,S,sols,,,264,0.991479,47.809081
2021-710709,2021-06-17,000001,Vente,800,,,PRES DE GRUARD,B146,41100,41294,Villiers-sur-Loir,41,,,41294000ZH0006,,,,,,,,,,,,,0,,,,,BP,peupleraies,,,1705,0.988023,47.793701
2021-711168,2021-06-29,000001,Vente,2000,,,COTEAU DE SAINT-ANDRE,B053,41100,41294,Villiers-sur-Loir,41,,,412940000L0748,,,,,,,,,,,,,0,,,,,P,prés,,,226,0.975698,47.81174
2021-711722,2021-07-30,000001,Vente,140000,,,RUE DE LA COUTURE,0150,41100,41294,Villiers-sur-Loir,41,,,41294000AC0187,,,,,,,,,,,,,0,,,,,S,sols,,,13,0.994099,47.807749
2021-711722,2021-07-30,000001,Vente,140000,,,RUE DE LA RATELERIE,0290,41100,41294,Villiers-sur-Loir,41,,,41294000AC0188,,,,,,,,,,,,,0,,,,,S,sols,,,77,0.994012,47.807855
2021-711722,2021-07-30,000001,Vente,140000,1,,RUE DE LA RATELERIE,0290,41100,41294,Villiers-sur-Loir,41,,,41294000AC0189,,,,,,,,,,,,,0,,,,,S,sols,,,749,0.993695,47.807574
2021-711722,2021-07-30,000001,Vente,140000,5001,,RUE DE LA RATELERIE,0290,41100,41294,Villiers-sur-Loir,41,,,41294000AC0190,,,,,,,,,,,,,0,4,Local industriel. commercial ou assimilé,40,0,S,sols,,,2075,0.993609,47.807826
2021-711722,2021-07-30,000001,Vente,140000,5001,,RUE DE LA RATELERIE,0290,41100,41294,Villiers-sur-Loir,41,,,41294000AC0190,,,,,,,,,,,,,0,4,Local industriel. commercial ou assimilé,900,0,S,sols,,,2075,0.993609,47.807826
2021-711722,2021-07-30,000001,Vente,140000,14,,AV DU 11 NOVEMBRE,0240,41100,41294,Villiers-sur-Loir,41,,,41294000AC0239,,,,,,,,,,,,,0,,,,,S,sols,,,83,0.993231,47.807036
2021-711722,2021-07-30,000001,Vente,140000,1,B,RUE DE LA COUTURE,0150,41100,41294,Villiers-sur-Loir,41,,,41294000AC0242,,,,,,,,,,,,,0,,,,,AB,terrains a bâtir,,,670,0.99356,47.807421
2021-711722,2021-07-30,000001,Vente,140000,1,B,RUE DE LA COUTURE,0150,41100,41294,Villiers-sur-Loir,41,,,41294000AC0245,,,,,,,,,,,,,0,,,,,S,sols,,,825,0.993657,47.807379
2021-711750,2021-07-22,000001,Vente,149300,1,,PL FORTIER,0180,41100,41294,Villiers-sur-Loir,41,,,41294000AD0023,,,,,,,,,,,,,0,,,,,S,sols,,,52,0.994838,47.805976
2021-712078,2021-07-27,000001,Vente,123144,4,,RUE DES FOURS A CHAUX,0182,41100,41294,Villiers-sur-Loir,41,,,41294000AB0343,,,,,,,,,,,,,0,1,Maison,84,4,S,sols,,,303,0.991197,47.80917
2021-712098,2021-08-07,000001,Vente,225000,,,LES CHAILLOUX,B033,41100,41294,Villiers-sur-Loir,41,,,41294000AE0001,,,,,,,,,,,,,0,,,,,BT,taillis simples,,,780,1.003022,47.805403
2021-712098,2021-08-07,000001,Vente,225000,19,,RUE DE LA GARELIERE,0190,41100,41294,Villiers-sur-Loir,41,,,41294000AE0062,,,,,,,,,,,,,0,1,Maison,22,1,S,sols,,,458,1.003524,47.805266
2021-712098,2021-08-07,000001,Vente,225000,19,,RUE DE LA GARELIERE,0190,41100,41294,Villiers-sur-Loir,41,,,41294000AE0062,,,,,,,,,,,,,0,1,Maison,100,4,AG,terrains d'agrément,,,500,1.003524,47.805266
2021-712098,2021-08-07,000001,Vente,225000,19,,RUE DE LA GARELIERE,0190,41100,41294,Villiers-sur-Loir,41,,,41294000AE0062,,,,,,,,,,,,,0,1,Maison,22,1,AG,terrains d'agrément,,,500,1.003524,47.805266
2021-712098,2021-08-07,000001,Vente,225000,19,,RUE DE LA GARELIERE,0190,41100,41294,Villiers-sur-Loir,41,,,41294000AE0062,,,,,,,,,,,,,0,1,Maison,100,4,S,sols,,,458,1.003524,47.805266
2021-712124,2021-07-30,000002,Vente,139700,,,RUE DU COTEAU ST ANDRE,0130,41100,41294,Villiers-sur-Loir,41,,,41294000AA0166,,,,,,,,,,,,,0,,,,,BT,taillis simples,,,75,0.975835,47.812058
2021-712124,2021-07-30,000002,Vente,139700,,,COTEAU DE SAINT-ANDRE,B053,41100,41294,Villiers-sur-Loir,41,,,412940000L0541,,,,,,,,,,,,,0,,,,,L,landes,,,605,0.97483,47.812533
2021-712124,2021-07-30,000002,Vente,139700,18,,RUE DU COTEAU ST ANDRE,0130,41100,41294,Villiers-sur-Loir,41,,,412940000L0542,,,,,,,,,,,,,0,3,Dépendance,,0,S,sols,,,186,0.974756,47.812499
2021-712124,2021-07-30,000002,Vente,139700,18,,RUE DU COTEAU ST ANDRE,0130,41100,41294,Villiers-sur-Loir,41,,,412940000L0542,,,,,,,,,,,,,0,1,Maison,102,5,S,sols,,,186,0.974756,47.812499
2021-712224,2021-08-06,000001,Vente,160000,,,LES CHAILLOUX,B033,41100,41294,Villiers-sur-Loir,41,,,41294000AE0008,,,,,,,,,,,,,0,,,,,P,prés,,,4027,1.001046,47.804169
2021-712224,2021-08-06,000001,Vente,160000,,,LES CHAILLOUX,B033,41100,41294,Villiers-sur-Loir,41,,,41294000AE0008,,,,,,,,,,,,,0,,,,,T,terres,,,18110,1.001046,47.804169
2021-712224,2021-08-06,000001,Vente,160000,,,LES CHAILLOUX,B033,41100,41294,Villiers-sur-Loir,41,,,41294000AE0008,,,,,,,,,,,,,0,,,,,AG,terrains d'agrément,,,408,1.001046,47.804169
2021-712224,2021-08-06,000001,Vente,160000,9,,RUE BESNARD FERRON,0030,41100,41294,Villiers-sur-Loir,41,,,41294000AE0014,,,,,,,,,,,,,0,3,Dépendance,,0,S,sols,,,841,0.99999,47.803656
2021-712224,2021-08-06,000001,Vente,160000,9,,RUE BESNARD FERRON,0030,41100,41294,Villiers-sur-Loir,41,,,41294000AE0014,,,,,,,,,,,,,0,3,Dépendance,,0,S,sols,,,841,0.99999,47.803656
2021-712224,2021-08-06,000001,Vente,160000,9,,RUE BESNARD FERRON,0030,41100,41294,Villiers-sur-Loir,41,,,41294000AE0014,,,,,,,,,,,,,0,1,Maison,108,4,S,sols,,,841,0.99999,47.803656
2021-712224,2021-08-06,000001,Vente,160000,9,,RUE BESNARD FERRON,0030,41100,41294,Villiers-sur-Loir,41,,,41294000AE0014,,,,,,,,,,,,,0,3,Dépendance,,0,J,jardins,,,500,0.99999,47.803656
2021-712224,2021-08-06,000001,Vente,160000,9,,RUE BESNARD FERRON,0030,41100,41294,Villiers-sur-Loir,41,,,41294000AE0014,,,,,,,,,,,,,0,3,Dépendance,,0,J,jardins,,,500,0.99999,47.803656
2021-712224,2021-08-06,000001,Vente,160000,9,,RUE BESNARD FERRON,0030,41100,41294,Villiers-sur-Loir,41,,,41294000AE0014,,,,,,,,,,,,,0,1,Maison,108,4,J,jardins,,,500,0.99999,47.803656
2021-712224,2021-08-06,000001,Vente,160000,,,RUE BESNARD FERRON,0030,41100,41294,Villiers-sur-Loir,41,,,41294000AE0028,,,,,,,,,,,,,0,,,,,S,sols,,,63,1.000141,47.803454
2021-712224,2021-08-06,000001,Vente,160000,,,RUE BESNARD FERRON,0030,41100,41294,Villiers-sur-Loir,41,,,41294000AE0028,,,,,,,,,,,,,0,,,,,S,sols,,,63,1.000141,47.803454
2021-712224,2021-08-06,000001,Vente,160000,,,RUE BESNARD FERRON,0030,41100,41294,Villiers-sur-Loir,41,,,41294000AE0028,,,,,,,,,,,,,0,,,,,S,sols,,,63,1.000141,47.803454
2021-712224,2021-08-06,000001,Vente,160000,,,RUE BESNARD FERRON,0030,41100,41294,Villiers-sur-Loir,41,,,41294000AE0028,,,,,,,,,,,,,0,,,,,S,sols,,,63,1.000141,47.803454
2021-712224,2021-08-06,000001,Vente,160000,,,RUE BESNARD FERRON,0030,41100,41294,Villiers-sur-Loir,41,,,41294000AE0028,,,,,,,,,,,,,0,,,,,S,sols,,,64,1.000141,47.803454
2021-712224,2021-08-06,000001,Vente,160000,,,RUE BESNARD FERRON,0030,41100,41294,Villiers-sur-Loir,41,,,41294000AE0032,,,,,,,,,,,,,0,,,,,AG,terrains d'agrément,,,224,1.000295,47.80344
2021-712224,2021-08-06,000001,Vente,160000,,,LA GARELIERE,B073,41100,41294,Villiers-sur-Loir,41,,,41294000AE0035,,,,,,,,,,,,,0,,,,,P,prés,,,915,1.001015,47.803612
2021-712224,2021-08-06,000001,Vente,160000,,,RUE DE LA GARELIERE,0190,41100,41294,Villiers-sur-Loir,41,,,41294000AE0048,,,,,,,,,,,,,0,,,,,S,sols,,,105,1.001443,47.803454
2021-712278,2021-08-18,000001,Vente,100000,8,,AV DES RONDAIZES,0300,41100,41294,Villiers-sur-Loir,41,,,41294000ZI0417,,,,,,,,,,,,,0,3,Dépendance,,0,S,sols,,,572,0.99416,47.804136
2021-712278,2021-08-18,000001,Vente,100000,8,,AV DES RONDAIZES,0300,41100,41294,Villiers-sur-Loir,41,,,41294000ZI0417,,,,,,,,,,,,,0,1,Maison,65,4,S,sols,,,572,0.99416,47.804136
2021-712458,2021-08-19,000001,Vente,147000,4,,AV PIERRE ARMAND COLIN,0270,41100,41294,Villiers-sur-Loir,41,,,41294000AB0058,,,,,,,,,,,,,0,3,Dépendance,,0,S,sols,,,126,0.988731,47.808316
2021-712458,2021-08-19,000001,Vente,147000,4,,AV PIERRE ARMAND COLIN,0270,41100,41294,Villiers-sur-Loir,41,,,41294000AB0058,,,,,,,,,,,,,0,1,Maison,71,3,S,sols,,,126,0.988731,47.808316
2021-712460,2021-08-25,000001,Vente,35000,457,,CLOS DE PICAVETTE,B042,41100,41294,Villiers-sur-Loir,41,,,41294000ZI0313,,,,,,,,,,,,,0,1,Maison,27,0,AG,terrains d'agrément,,,689,0.981047,47.801611
2021-712460,2021-08-25,000001,Vente,35000,457,,CLOS DE PICAVETTE,B042,41100,41294,Villiers-sur-Loir,41,,,41294000ZI0313,,,,,,,,,,,,,0,1,Maison,27,0,S,sols,,,41,0.981047,47.801611
2021-713135,2021-09-14,000001,Vente,16000,459,C,LE PLATREAU,B142,41100,41294,Villiers-sur-Loir,41,,,41294000ZI0002,,,,,,,,,,,,,0,3,Dépendance,,0,S,sols,,,180,0.976358,47.811359
2021-714188,2021-10-16,000001,Vente,46000,,,RUE DE LA PIERRE PERCEE,0280,41100,41294,Villiers-sur-Loir,41,,,41294000AB0001,,,,,,,,,,,,,0,,,,,T,terres,,,836,0.986578,47.807849
2021-714443,2021-11-04,000001,Vente,900,,,PRES DE GRUARD,B146,41100,41294,Villiers-sur-Loir,41,,,41294000ZH0007,,,,,,,,,,,,,0,,,,,P,prés,,,2910,0.988355,47.793575
2021-714570,2021-10-29,000001,Vente,900,,,LES CHAILLOUX,B033,41100,41294,Villiers-sur-Loir,41,,,41294000AE0006,,,,,,,,,,,,,0,,,,,BT,taillis simples,,,1535,1.002364,47.804741
2021-714636,2021-11-02,000002,Vente,779315.5,,,LES GRANDS CHAMPS,B087,41100,41294,Villiers-sur-Loir,41,,,41294000ZL0030,,,,,,,,,,,,,0,,,,,T,terres,,,19970,1.020247,47.818036
2021-714636,2021-11-02,000002,Vente,779315.5,,,LES GRANDS CHAMPS,B087,41100,41294,Villiers-sur-Loir,41,,,41294000ZL0073,,,,,,,,,,,,,0,,,,,T,terres,,,1444,1.020269,47.818793
2021-714636,2021-11-02,000002,Vente,779315.5,,,LES GRANDS CHAMPS,B087,41100,41294,Villiers-sur-Loir,41,,,41294000ZL0073,,,,,,,,,,,,,0,,,,,BT,taillis simples,,,4755,1.020269,47.818793
2021-714636,2021-11-02,000002,Vente,779315.5,,,LES GRANDS CHAMPS,B087,41100,41294,Villiers-sur-Loir,41,,,41294000ZL0074,,,,,,,,,,,,,0,,,,,BT,taillis simples,,,4214,1.020429,47.819214
2021-714636,2021-11-02,000002,Vente,779315.5,,,LES GRANDS CHAMPS,B087,41100,41294,Villiers-sur-Loir,41,,,41294000ZL0122,,,,,,,,,,,,,0,,,,,BT,taillis simples,,,7003,1.020578,47.819843
2021-715130,2021-11-08,000001,Vente,4500,,,LES PRES DE LA FONTAINE,B199,41100,41294,Villiers-sur-Loir,41,,,41294000ZI0359,,,,,,,,,,,,,0,,,,,P,prés,,,1130,0.979398,47.80471
2021-715133,2021-11-23,000001,Vente,1,,,LES PENTES DE LA BARRE,B197,41100,41294,Villiers-sur-Loir,41,,,41294000ZE0311,,,,,,,,,,,,,0,,,,,AB,terrains a bâtir,,,15,1.001251,47.801147
2021-715133,2021-11-23,000001,Vente,1,,,LES PENTES DE LA BARRE,B197,41100,41294,Villiers-sur-Loir,41,,,41294000ZE0312,,,,,,,,,,,,,0,,,,,AB,terrains a bâtir,,,7,1.00105,47.801265
2021-715133,2021-11-23,000001,Vente,1,,,LES PENTES DE LA BARRE,B197,41100,41294,Villiers-sur-Loir,41,,,41294000ZE0313,,,,,,,,,,,,,0,,,,,AB,terrains a bâtir,,,1,1.000906,47.801348
2021-715133,2021-11-23,000001,Vente,1,,,LES PENTES DE LA BARRE,B197,41100,41294,Villiers-sur-Loir,41,,,41294000ZE0319,,,,,,,,,,,,,0,,,,,AB,terrains a bâtir,,,48,1.00158,47.801896
2021-715133,2021-11-23,000001,Vente,1,,,LES PENTES DE LA BARRE,B197,41100,41294,Villiers-sur-Loir,41,,,41294000ZE0320,,,,,,,,,,,,,0,,,,,AB,terrains a bâtir,,,7,1.001768,47.801756
2021-715133,2021-11-23,000001,Vente,1,,,LES PENTES DE LA BARRE,B197,41100,41294,Villiers-sur-Loir,41,,,41294000ZE0321,,,,,,,,,,,,,0,,,,,AB,terrains a bâtir,,,6,1.001921,47.801648
2021-715145,2021-11-15,000001,Vente,108000,18,,RUE DE LA GARELIERE,0190,41100,41294,Villiers-sur-Loir,41,,,41294000AE0131,,,,,,,,,,,,,0,1,Maison,58,3,S,sols,,,174,1.001774,47.803238
2021-715145,2021-11-15,000001,Vente,108000,18,,RUE DE LA GARELIERE,0190,41100,41294,Villiers-sur-Loir,41,,,41294000AE0131,,,,,,,,,,,,,0,3,Dépendance,,0,S,sols,,,174,1.001774,47.803238
2021-715145,2021-11-15,000001,Vente,108000,,,RUE DE LA GARELIERE,0190,41100,41294,Villiers-sur-Loir,41,,,41294000AE0132,,,,,,,,,,,,,0,,,,,S,sols,,,98,1.001723,47.80318
2021-715296,2021-11-23,000001,Vente,195000,18,,RUE BESNARD FERRON,0030,41100,41294,Villiers-sur-Loir,41,,,41294000ZE0336,,,,,,,,,,,,,0,1,Maison,117,5,S,sols,,,514,1.00177,47.80158
2021-715317,2021-11-29,000001,Vente,5000,5007,,AV PIERRE ARMAND COLIN,0270,41100,41294,Villiers-sur-Loir,41,,,412940000L0596,,,,,,,,,,,,,0,3,Dépendance,,0,S,sols,,,110,0.971647,47.812563
2021-715317,2021-11-29,000001,Vente,5000,5007,,AV PIERRE ARMAND COLIN,0270,41100,41294,Villiers-sur-Loir,41,,,412940000L0596,,,,,,,,,,,,,0,3,Dépendance,,0,S,sols,,,110,0.971647,47.812563
2021-715317,2021-11-29,000001,Vente,5000,5007,,AV PIERRE ARMAND COLIN,0270,41100,41294,Villiers-sur-Loir,41,,,412940000L0596,,,,,,,,,,,,,0,1,Maison,12,0,S,sols,,,110,0.971647,47.812563
2021-715317,2021-11-29,000001,Vente,5000,,,COTEAU DE SAINT-ANDRE,B053,41100,41294,Villiers-sur-Loir,41,,,412940000L0758,,,,,,,,,,,,,0,,,,,S,sols,,,113,0.971691,47.812657
2021-715594,2021-11-27,000001,Vente,138000,,,RUE DU DOCTEUR SILLY,0170,41100,41294,Villiers-sur-Loir,41,,,41294000AC0226,,,,,,,,,,,,,0,,,,,T,terres,,,70,0.993651,47.805542
2021-715594,2021-11-27,000001,Vente,138000,6,,RUE DU DOCTEUR SILLY,0170,41100,41294,Villiers-sur-Loir,41,,,41294000AC0227,,,,,,,,,,,,,0,3,Dépendance,,0,S,sols,,,101,0.993785,47.805648
2021-715594,2021-11-27,000001,Vente,138000,6,,RUE DU DOCTEUR SILLY,0170,41100,41294,Villiers-sur-Loir,41,,,41294000AC0227,,,,,,,,,,,,,0,1,Maison,65,3,S,sols,,,101,0.993785,47.805648
2021-715796,2021-12-20,000001,Vente,150000,38,,RUE DE LA BOISSIERE,0040,41100,41294,Villiers-sur-Loir,41,,,41294000AC0010,,,,,,,,,,,,,0,1,Maison,74,4,S,sols,,,500,0.993067,47.811849
2021-715796,2021-12-20,000001,Vente,150000,38,,RUE DE LA BOISSIERE,0040,41100,41294,Villiers-sur-Loir,41,,,41294000AC0010,,,,,,,,,,,,,0,3,Dépendance,,0,S,sols,,,500,0.993067,47.811849
2021-715796,2021-12-20,000001,Vente,150000,38,,RUE DE LA BOISSIERE,0040,41100,41294,Villiers-sur-Loir,41,,,41294000AC0010,,,,,,,,,,,,,0,3,Dépendance,,0,AG,terrains d'agrément,,,654,0.993067,47.811849
2021-715796,2021-12-20,000001,Vente,150000,38,,RUE DE LA BOISSIERE,0040,41100,41294,Villiers-sur-Loir,41,,,41294000AC0010,,,,,,,,,,,,,0,1,Maison,74,4,AG,terrains d'agrément,,,654,0.993067,47.811849
2021-715924,2021-12-21,000001,Vente,5565,,,LA GARELIERE,B073,41100,41294,Villiers-sur-Loir,41,,,41294000AE0208,,,,,,,,,,,,,0,,,,,J,jardins,,,159,1.003247,47.804055
2021-715999,2021-12-27,000001,Vente,48860,,,RUE DES CENT ECUS,0075,41100,41294,Villiers-sur-Loir,41,,,41294000AB0329,,,,,,,,,,,,,0,,,,,AG,terrains d'agrément,,,941,0.992161,47.809112
2021-715999,2021-12-27,000001,Vente,48860,,,RUE DES CENT ECUS,0075,41100,41294,Villiers-sur-Loir,41,,,41294000AB0336,,,,,,,,,,,,,0,,,,,S,sols,,,450,0.992127,47.808944
2021-716388,2021-12-30,000001,Vente,5000,,,LA GARELIERE,B073,41100,41294,Villiers-sur-Loir,41,,,41294000AD0144,,,,,,,,,,,,,0,,,,,T,terres,,,121,0.999645,47.804542
