id_mutation,date_mutation,numero_disposition,nature_mutation,valeur_fonciere,adresse_numero,adresse_suffixe,adresse_nom_voie,adresse_code_voie,code_postal,code_commune,nom_commune,code_departement,ancien_code_commune,ancien_nom_commune,id_parcelle,ancien_id_parcelle,numero_volume,lot1_numero,lot1_surface_carrez,lot2_numero,lot2_surface_carrez,lot3_numero,lot3_surface_carrez,lot4_numero,lot4_surface_carrez,lot5_numero,lot5_surface_carrez,nombre_lots,code_type_local,type_local,surface_reelle_bati,nombre_pieces_principales,code_nature_culture,nature_culture,code_nature_culture_speciale,nature_culture_speciale,surface_terrain,longitude,latitude
2021-736585,2021-01-07,000001,Vente,38500,,,FONT L ACHA,B042,43160,43035,Bonneval,43,,,43035000AH0208,,,,,,,,,,,,,0,,,,,BR,futaies résineuses,SAPIN,Sapins ou sapinière,4433,3.742825,45.304883
2021-736585,2021-01-07,000001,Vente,38500,,,FONT L ACHA,B042,43160,43035,Bonneval,43,,,43035000AH0208,,,,,,,,,,,,,0,,,,,BR,futaies résineuses,SAPIN,Sapins ou sapinière,20000,3.742825,45.304883
2021-736585,2021-01-07,000001,Vente,38500,,,FONT L ACHA,B042,43160,43035,Bonneval,43,,,43035000AH0209,,,,,,,,,,,,,0,,,,,BR,futaies résineuses,SAPIN,Sapins ou sapinière,24392,3.743046,45.303972
2021-736585,2021-01-07,000001,Vente,38500,,,FONT L ACHA,B042,43160,43035,Bonneval,43,,,43035000AH0224,,,,,,,,,,,,,0,,,,,BR,futaies résineuses,SAPIN,Sapins ou sapinière,25205,3.743233,45.303553
2021-737477,2021-03-10,000001,Vente,1000,,,BUGE DE L EGLISE,B012,43160,43035,Bonneval,43,,,43035000AD0106,,,,,,,,,,,,,0,,,,,BR,futaies résineuses,SAPIN,Sapins ou sapinière,1405,3.762215,45.327039
2021-737477,2021-03-10,000001,Vente,1000,,,BERTRAND,B004,43160,43035,Bonneval,43,,,43035000AD0110,,,,,,,,,,,,,0,,,,,BR,futaies résineuses,SAPIN,Sapins ou sapinière,3150,3.762191,45.326291
2021-738242,2021-04-08,000001,Vente,70000,,,LE GARRET,B051,43160,43035,Bonneval,43,,,43035000AM0041,,,,,,,,,,,,,0,,,,,T,terres,,,6710,3.715095,45.295317
2021-738242,2021-04-08,000001,Vente,70000,,,LE GARRET,B051,43160,43035,Bonneval,43,,,43035000AM0254,,,,,,,,,,,,,0,,,,,T,terres,,,3312,3.713807,45.295689
2021-738242,2021-04-08,000001,Vente,70000,,,LE GARRET,B051,43160,43035,Bonneval,43,,,43035000AM0254,,,,,,,,,,,,,0,,,,,S,sols,,,630,3.713807,45.295689
2021-738242,2021-04-08,000001,Vente,70000,6,,RUE DE LA BERGERIE,0320,43160,43035,Bonneval,43,,,43035000AM0255,,,,,,,,,,,,,0,1,Maison,78,3,S,sols,,,1361,3.715009,45.295077
2021-738242,2021-04-08,000001,Vente,70000,,,L ESPINASSON,B039,43160,43035,Bonneval,43,,,43035000AM0257,,,,,,,,,,,,,0,,,,,L,landes,,,235,3.714776,45.294874
2021-738242,2021-04-08,000001,Vente,70000,,,L ESPINASSON,B039,43160,43035,Bonneval,43,,,43035000AM0259,,,,,,,,,,,,,0,,,,,L,landes,,,46,3.714602,45.294945
2021-738356,2021-04-14,000002,Vente,3000,,,LES BRAYES,B011,43160,43035,Bonneval,43,,,43035000AO0343,,,,,,,,,,,,,0,,,,,PA,pâtures,PATUR,Pâture plantée,1500,3.715368,45.305191
2021-738970,2021-05-28,000001,Vente,360020,,,LES ROGUES,B095,43160,43035,Bonneval,43,,,43035000AN0118,,,,,,,,,,,,,0,,,,,PA,pâtures,PATUR,Pâture plantée,2375,3.711483,45.293376
2021-738970,2021-05-28,000001,Vente,360020,2,,IMP DES ROGUES,0300,43160,43035,Bonneval,43,,,43035000AN0119,,,,,,,,,,,,,0,1,Maison,400,15,S,sols,,,1840,3.711224,45.293105
2021-738970,2021-05-28,000001,Vente,360020,,,LES ROGUES,B095,43160,43035,Bonneval,43,,,43035000AN0132,,,,,,,,,,,,,0,,,,,T,terres,,,8295,3.711112,45.292682
2021-738970,2021-05-28,000001,Vente,360020,,,LES ROGUES,B095,43160,43035,Bonneval,43,,,43035000AN0134,,,,,,,,,,,,,0,,,,,PA,pâtures,PATUR,Pâture plantée,1430,3.710636,45.293059
2021-739989,2021-06-28,000001,Vente,800,,,LE CROIZET,B033,43160,43035,Bonneval,43,,,43035000AE0185,,,,,,,,,,,,,0,,,,,BR,futaies résineuses,SAPIN,Sapins ou sapinière,3383,3.747101,45.315509
2021-739989,2021-06-28,000001,Vente,800,,,LE CROIZET,B033,43160,43035,Bonneval,43,,,43035000AE0186,,,,,,,,,,,,,0,,,,,BR,futaies résineuses,SAPIN,Sapins ou sapinière,2073,3.747935,45.315615
2021-739989,2021-06-28,000001,Vente,800,,,LE CROIZET,B033,43160,43035,Bonneval,43,,,43035000AE0187,,,,,,,,,,,,,0,,,,,BR,futaies résineuses,SAPIN,Sapins ou sapinière,5900,3.748376,45.315176
2021-739995,2021-06-28,000001,Vente,6000,,,LE RASA,B083,43160,43035,Bonneval,43,,,43035000AI0133,,,,,,,,,,,,,0,,,,,BR,futaies résineuses,SAPIN,Sapins ou sapinière,4766,3.742834,45.297159
2021-740052,2021-07-02,000001,Vente,35000,,,FONT L ACHA,B042,43160,43035,Bonneval,43,,,43035000AH0204,,,,,,,,,,,,,0,,,,,BR,futaies résineuses,SAPIN,Sapins ou sapinière,9981,3.744238,45.305966
2021-740052,2021-07-02,000001,Vente,35000,,,FONT L ACHA,B042,43160,43035,Bonneval,43,,,43035000AH0205,,,,,,,,,,,,,0,,,,,BR,futaies résineuses,SAPIN,Sapins ou sapinière,26173,3.744176,45.306928
2021-740216,2021-07-16,000001,Vente,2250,,,LE CODERT,B022,43160,43035,Bonneval,43,,,43035000AO0006,,,,,,,,,,,,,0,,,,,PA,pâtures,PATUR,Pâture plantée,10360,3.711156,45.307477
2021-740216,2021-07-16,000001,Vente,2250,,,LE CODERT,B022,43160,43035,Bonneval,43,,,43035000AO0007,,,,,,,,,,,,,0,,,,,P,prés,,,4604,3.714451,45.305961
2021-740662,2021-07-30,000001,Vente,90500,,,LE PAROUT,B075,43160,43035,Bonneval,43,,,43035000AH0015,,,,,,,,,,,,,0,,,,,BR,futaies résineuses,SAPIN,Sapins ou sapinière,2880,3.731573,45.302477
2021-740662,2021-07-30,000001,Vente,90500,,,LE PAROUT,B075,43160,43035,Bonneval,43,,,43035000AH0016,,,,,,,,,,,,,0,,,,,BR,futaies résineuses,SAPIN,Sapins ou sapinière,62,3.731256,45.302167
2021-740662,2021-07-30,000001,Vente,90500,,,LA ROCHERIE,B093,43160,43035,Bonneval,43,,,43035000AH0069,,,,,,,,,,,,,0,,,,,BR,futaies résineuses,SAPIN,Sapins ou sapinière,2970,3.73509,45.304839
2021-741559,2021-09-13,000001,Vente,1000,,,GARETS DES VISSEYRES,B048,43160,43035,Bonneval,43,,,43035000AC0282,,,,,,,,,,,,,0,,,,,BR,futaies résineuses,SAPIN,Sapins ou sapinière,4625,3.736885,45.325504
2021-741559,2021-09-13,000001,Vente,1000,,,GARETS DES VISSEYRES,B048,43160,43035,Bonneval,43,,,43035000AC0400,,,,,,,,,,,,,0,,,,,J,jardins,,,4453,3.735972,45.325387
2021-743347,2021-12-01,000001,Vente,350,,,MAISON SEULE,B066,43160,43035,Bonneval,43,,,43035000AC0241,,,,,,,,,,,,,0,,,,,L,landes,,,5715,3.74195,45.321983
2021-743349,2021-11-25,000001,Vente,12500,,,LAZENIER,B064,43160,43035,Bonneval,43,,,43035000AI0156,,,,,,,,,,,,,0,,,,,BR,futaies résineuses,SAPIN,Sapins ou sapinière,7883,3.741955,45.292356
2021-743349,2021-11-25,000001,Vente,12500,,,LES GAYTES,B052,43160,43035,Bonneval,43,,,43035000AO0166,,,,,,,,,,,,,0,,,,,BR,futaies résineuses,PIN,Pins,888,3.715494,45.3007
2021-743349,2021-11-25,000001,Vente,12500,,,LES GAYTES,B052,43160,43035,Bonneval,43,,,43035000AO0166,,,,,,,,,,,,,0,,,,,BR,futaies résineuses,SAPIN,Sapins ou sapinière,28732,3.715494,45.3007
2021-743349,2021-11-25,000001,Vente,12500,,,SAC DE BERODE,B099,43160,43035,Bonneval,43,,,43035000AS0020,,,,,,,,,,,,,0,,,,,BR,futaies résineuses,SAPIN,Sapins ou sapinière,15895,3.722303,45.318459
2021-743354,2021-12-01,000001,Vente,50000,2,,RUE DE BOULAND,0290,43160,43035,Bonneval,43,,,43035000AO0024,,,,,,,,,,,,,0,1,Maison,40,4,S,sols,,,206,3.715943,45.305828
2021-743453,2021-11-25,000001,Vente,2400,,,LE PAROUT,B075,43160,43035,Bonneval,43,,,43035000AH0037,,,,,,,,,,,,,0,,,,,BR,futaies résineuses,PIN,Pins,117,3.731923,45.302981
2021-743453,2021-11-25,000001,Vente,2400,,,LE PAROUT,B075,43160,43035,Bonneval,43,,,43035000AH0037,,,,,,,,,,,,,0,,,,,BR,futaies résineuses,SAPIN,Sapins ou sapinière,1848,3.731923,45.302981
2021-743453,2021-11-25,000001,Vente,2400,,,LA ROCHERIE,B093,43160,43035,Bonneval,43,,,43035000AH0064,,,,,,,,,,,,,0,,,,,BR,futaies résineuses,SAPIN,Sapins ou sapinière,762,3.734777,45.30442
2021-743453,2021-11-25,000001,Vente,2400,,,LA ROCHERIE,B093,43160,43035,Bonneval,43,,,43035000AH0064,,,,,,,,,,,,,0,,,,,BR,futaies résineuses,PIN,Pins,66,3.734777,45.30442
2021-743453,2021-11-25,000001,Vente,2400,,,LA ROCHERIE,B093,43160,43035,Bonneval,43,,,43035000AH0065,,,,,,,,,,,,,0,,,,,BR,futaies résineuses,PIN,Pins,42,3.735019,45.304354
2021-743453,2021-11-25,000001,Vente,2400,,,LA ROCHERIE,B093,43160,43035,Bonneval,43,,,43035000AH0065,,,,,,,,,,,,,0,,,,,BR,futaies résineuses,SAPIN,Sapins ou sapinière,487,3.735019,45.304354
2021-743453,2021-11-25,000001,Vente,2400,,,LA ROCHERIE,B093,43160,43035,Bonneval,43,,,43035000AH0066,,,,,,,,,,,,,0,,,,,BR,futaies résineuses,PIN,Pins,679,3.734012,45.304944
2021-743453,2021-11-25,000001,Vente,2400,,,LA ROCHERIE,B093,43160,43035,Bonneval,43,,,43035000AH0066,,,,,,,,,,,,,0,,,,,BR,futaies résineuses,SAPIN,Sapins ou sapinière,7813,3.734012,45.304944
2021-743453,2021-11-25,000001,Vente,2400,,,LE RASA,B083,43160,43035,Bonneval,43,,,43035000AI0131,,,,,,,,,,,,,0,,,,,BR,futaies résineuses,SAPIN,Sapins ou sapinière,6830,3.745579,45.296873
2021-743453,2021-11-25,000001,Vente,2400,,,LE SAGNASSON,B100,43160,43035,Bonneval,43,,,43035000AM0009,,,,,,,,,,,,,0,,,,,BR,futaies résineuses,PIN,Pins,3008,3.713658,45.299532
2021-743453,2021-11-25,000001,Vente,2400,,,LA FAYE,B041,43160,43035,Bonneval,43,,,43035000AO0090,,,,,,,,,,,,,0,,,,,BR,futaies résineuses,SAPIN,Sapins ou sapinière,7695,3.722786,45.302528
2021-743453,2021-11-25,000001,Vente,2400,,,COMBRIOT,B024,43160,43035,Bonneval,43,,,43035000AO0108,,,,,,,,,,,,,0,,,,,BR,futaies résineuses,SAPIN,Sapins ou sapinière,2900,3.723202,45.29925
2021-743453,2021-11-25,000001,Vente,2400,,,LE MOULIN DE GRIS,B070,43160,43035,Bonneval,43,,,43035000AO0121,,,,,,,,,,,,,0,,,,,BR,futaies résineuses,SAPIN,Sapins ou sapinière,2294,3.719774,45.297691
2021-743453,2021-11-25,000001,Vente,2400,,,LE MOULIN DE GRIS,B070,43160,43035,Bonneval,43,,,43035000AO0121,,,,,,,,,,,,,0,,,,,BR,futaies résineuses,PIN,Pins,1529,3.719774,45.297691
2021-743453,2021-11-25,000001,Vente,2400,,,LE MOULIN DE GRIS,B070,43160,43035,Bonneval,43,,,43035000AO0125,,,,,,,,,,,,,0,,,,,BR,futaies résineuses,PIN,Pins,748,3.719199,45.298407
2021-743453,2021-11-25,000001,Vente,2400,,,LE MOULIN DE GRIS,B070,43160,43035,Bonneval,43,,,43035000AO0125,,,,,,,,,,,,,0,,,,,BR,futaies résineuses,SAPIN,Sapins ou sapinière,1123,3.719199,45.298407
2021-743453,2021-11-25,000001,Vente,2400,,,LE MOULIN DE GRIS,B070,43160,43035,Bonneval,43,,,43035000AO0130,,,,,,,,,,,,,0,,,,,BR,futaies résineuses,SAPIN,Sapins ou sapinière,1029,3.720202,45.299794
2021-743453,2021-11-25,000001,Vente,2400,,,LE MOULIN DE GRIS,B070,43160,43035,Bonneval,43,,,43035000AO0130,,,,,,,,,,,,,0,,,,,BR,futaies résineuses,PIN,Pins,685,3.720202,45.299794
2021-743453,2021-11-25,000001,Vente,2400,,,LE MOULIN DE GRIS,B070,43160,43035,Bonneval,43,,,43035000AO0138,,,,,,,,,,,,,0,,,,,BR,futaies résineuses,SAPIN,Sapins ou sapinière,1817,3.721533,45.30272
2021-743453,2021-11-25,000001,Vente,2400,,,LE MOULIN DE GRIS,B070,43160,43035,Bonneval,43,,,43035000AO0141,,,,,,,,,,,,,0,,,,,BR,futaies résineuses,SAPIN,Sapins ou sapinière,4110,3.720611,45.301951
2021-743453,2021-11-25,000001,Vente,2400,,,LES GAYTES,B052,43160,43035,Bonneval,43,,,43035000AO0178,,,,,,,,,,,,,0,,,,,BR,futaies résineuses,SAPIN,Sapins ou sapinière,462,3.720087,45.3023
2021-743683,2021-12-03,000001,Vente,3100,,,SAC DE BERODE,B099,43160,43035,Bonneval,43,,,43035000AS0018,,,,,,,,,,,,,0,,,,,BR,futaies résineuses,SAPIN,Sapins ou sapinière,2133,3.72303,45.316965
2021-743683,2021-12-03,000001,Vente,3100,,,SAC DE BERODE,B099,43160,43035,Bonneval,43,,,43035000AS0018,,,,,,,,,,,,,0,,,,,BR,futaies résineuses,SAPIN,Sapins ou sapinière,2134,3.72303,45.316965
2021-743990,2021-12-21,000001,Vente,23350,,,LAZENIER,B064,43160,43035,Bonneval,43,,,43035000AI0154,,,,,,,,,,,,,0,,,,,BR,futaies résineuses,SAPIN,Sapins ou sapinière,5121,3.740027,45.292836
2021-743990,2021-12-21,000001,Vente,23350,,,LE BOIS NOIR,B006,43160,43035,Bonneval,43,,,43035000AM0145,,,,,,,,,,,,,0,,,,,BR,futaies résineuses,SAPIN,Sapins ou sapinière,3828,3.71594,45.287768
2021-744111,2021-12-24,000001,Vente,2700,,,LA CHAUSSE,B021,43160,43035,Bonneval,43,,,43035000AS0129,,,,,,,,,,,,,0,,,,,PA,pâtures,PATUR,Pâture plantée,418,3.724254,45.315798
2021-744111,2021-12-24,000001,Vente,2700,,,LA CHAUSSE,B021,43160,43035,Bonneval,43,,,43035000AS0134,,,,,,,,,,,,,0,,,,,PA,pâtures,PATUR,Pâture plantée,1569,3.723899,45.316092
