id_mutation,date_mutation,numero_disposition,nature_mutation,valeur_fonciere,adresse_numero,adresse_suffixe,adresse_nom_voie,adresse_code_voie,code_postal,code_commune,nom_commune,code_departement,ancien_code_commune,ancien_nom_commune,id_parcelle,ancien_id_parcelle,numero_volume,lot1_numero,lot1_surface_carrez,lot2_numero,lot2_surface_carrez,lot3_numero,lot3_surface_carrez,lot4_numero,lot4_surface_carrez,lot5_numero,lot5_surface_carrez,nombre_lots,code_type_local,type_local,surface_reelle_bati,nombre_pieces_principales,code_nature_culture,nature_culture,code_nature_culture_speciale,nature_culture_speciale,surface_terrain,longitude,latitude
2021-736716,2021-01-04,000002,Vente,180000,4,,RUE DU FOUR,0150,43320,43233,Sanssac-l'Église,43,,,43233000AN0062,,,,,,,,,,,,,0,1,Maison,134,5,S,sols,,,822,3.804911,45.050446
2021-736716,2021-01-04,000002,Vente,180000,,,COYAC,B044,43320,43233,Sanssac-l'Église,43,,,43233000AN0072,,,,,,,,,,,,,0,,,,,S,sols,,,1334,3.804777,45.050389
2021-736716,2021-01-04,000002,Vente,180000,,,COYAC,B044,43320,43233,Sanssac-l'Église,43,,,43233000AN0072,,,,,,,,,,,,,0,,,,,J,jardins,,,491,3.804777,45.050389
2021-736716,2021-01-04,000002,Vente,180000,5176,A,COYAC,B044,43320,43233,Sanssac-l'Église,43,,,43233000AN0172,,,,,,,,,,,,,0,4,Local industriel. commercial ou assimilé,,0,T,terres,,,33,3.804609,45.050445
2021-736775,2021-02-03,000001,Vente,700,,,PRE DU MOULIN,B104,43320,43233,Sanssac-l'Église,43,,,43233000AM0055,,,,,,,,,,,,,0,,,,,L,landes,,,1855,3.812699,45.052729
2021-736775,2021-02-03,000001,Vente,700,,,PRE DU MOULIN,B104,43320,43233,Sanssac-l'Église,43,,,43233000AM0055,,,,,,,,,,,,,0,,,,,P,prés,,,2391,3.812699,45.052729
2021-737130,2021-02-02,000001,Vente,50000,,,LONNAC,B077,43320,43233,Sanssac-l'Église,43,,,43233000AC0121,,,,,,,,,,,,,0,,,,,L,landes,,,192,3.780076,45.046815
2021-737130,2021-02-02,000001,Vente,50000,,,LONNAC,B077,43320,43233,Sanssac-l'Église,43,,,43233000AC0123,,,,,,,,,,,,,0,,,,,P,prés,,,1399,3.780247,45.046456
2021-737544,2021-03-11,000001,Vente,1000,,,PRE DU MOULIN,B104,43320,43233,Sanssac-l'Église,43,,,43233000AN0118,,,,,,,,,,,,,0,,,,,S,sols,,,1776,3.810478,45.050276
2021-737784,2021-03-24,000001,Vente,6500,,,VOURZAC,B129,43320,43233,Sanssac-l'Église,43,,,43233000AW0027,,,,,,,,,,,,,0,,,,,S,sols,,,277,3.80208,45.037723
2021-738078,2021-03-26,000001,Vente,141550,31,,RTE DU PUY - EN - VELAY,0220,43320,43233,Sanssac-l'Église,43,,,43233000AE0132,,,,,,,,,,,,,0,3,Dépendance,,0,S,sols,,,1068,3.793353,45.054882
2021-738078,2021-03-26,000001,Vente,141550,31,,RTE DU PUY - EN - VELAY,0220,43320,43233,Sanssac-l'Église,43,,,43233000AE0132,,,,,,,,,,,,,0,1,Maison,90,4,S,sols,,,1068,3.793353,45.054882
2021-738141,2021-03-22,000001,Vente,16341,,,PRE NEUF,B106,43320,43233,Sanssac-l'Église,43,,,43233000AO0071,,,,,,,,,,,,,0,,,,,PA,pâtures,PATUR,Pâture plantée,518,3.819131,45.047463
2021-738141,2021-03-22,000001,Vente,16341,,,PRE NEUF,B106,43320,43233,Sanssac-l'Église,43,,,43233000AO0071,,,,,,,,,,,,,0,,,,,P,prés,,,3078,3.819131,45.047463
2021-738236,2021-04-06,000002,Vente,95000,12,,RUE DE LA FONTAINE FAREYROLLES,0142,43320,43233,Sanssac-l'Église,43,,,43233000AP0102,,,,,,,,,,,,,0,3,Dépendance,,0,,,,,,3.817494,45.054527
2021-738236,2021-04-06,000002,Vente,95000,12,,RUE DE LA FONTAINE FAREYROLLES,0142,43320,43233,Sanssac-l'Église,43,,,43233000AP0102,,,,,,,,,,,,,0,1,Maison,165,4,,,,,,3.817494,45.054527
2021-738464,2021-04-29,000001,Vente,9000,,,EYSSAC,B057,43320,43233,Sanssac-l'Église,43,,,432330000B0202,,,,,,,,,,,,,0,,,,,S,sols,,,1187,3.766415,45.034704
2021-738464,2021-04-29,000001,Vente,9000,,,EYSSAC,B057,43320,43233,Sanssac-l'Église,43,,,432330000B0867,,,,,,,,,,,,,0,,,,,S,sols,,,149,3.76629,45.034819
2021-738724,2021-05-17,000001,Vente,42000,,,PRAT GRAND,B103,43320,43233,Sanssac-l'Église,43,,,432330000B0016,,,,,,,,,,,,,0,,,,,T,terres,,,18070,3.762147,45.03992
2021-738724,2021-05-17,000001,Vente,42000,,,PRAT GRAND,B103,43320,43233,Sanssac-l'Église,43,,,432330000B0023,,,,,,,,,,,,,0,,,,,T,terres,,,5558,3.763765,45.038764
2021-738724,2021-05-17,000001,Vente,42000,,,PRAT GRAND,B103,43320,43233,Sanssac-l'Église,43,,,432330000B0024,,,,,,,,,,,,,0,,,,,T,terres,,,2160,3.763751,45.038356
2021-738724,2021-05-17,000001,Vente,42000,,,LES QUIRAUX,B109,43320,43233,Sanssac-l'Église,43,,,432330000B0031,,,,,,,,,,,,,0,,,,,T,terres,,,2814,3.767187,45.03809
2021-738724,2021-05-17,000001,Vente,42000,,,OUCHAIS,B089,43320,43233,Sanssac-l'Église,43,,,432330000B0097,,,,,,,,,,,,,0,,,,,P,prés,,,1929,3.763929,45.037261
2021-738724,2021-05-17,000001,Vente,42000,,,LA CONDAMINE,B040,43320,43233,Sanssac-l'Église,43,,,432330000B0137,,,,,,,,,,,,,0,,,,,P,prés,,,4047,3.770202,45.033015
2021-738724,2021-05-17,000001,Vente,42000,,,LA CONDAMINE,B040,43320,43233,Sanssac-l'Église,43,,,432330000B0138,,,,,,,,,,,,,0,,,,,P,prés,,,4083,3.770933,45.033619
2021-738724,2021-05-17,000001,Vente,42000,,,LE BOIS,B007,43320,43233,Sanssac-l'Église,43,,,432330000B0238,,,,,,,,,,,,,0,,,,,T,terres,,,4619,3.761887,45.034523
2021-738724,2021-05-17,000001,Vente,42000,,,LE BOIS,B007,43320,43233,Sanssac-l'Église,43,,,432330000B0242,,,,,,,,,,,,,0,,,,,T,terres,,,1880,3.762535,45.033679
2021-738724,2021-05-17,000001,Vente,42000,,,FOND DU CHER,B061,43320,43233,Sanssac-l'Église,43,,,432330000B0595,,,,,,,,,,,,,0,,,,,L,landes,,,1565,3.782516,45.033304
2021-738724,2021-05-17,000001,Vente,42000,,,FOND DU CHER,B061,43320,43233,Sanssac-l'Église,43,,,432330000B0596,,,,,,,,,,,,,0,,,,,B,bois,,,4565,3.782776,45.033821
2021-738724,2021-05-17,000001,Vente,42000,,,FOND DU CHER,B061,43320,43233,Sanssac-l'Église,43,,,432330000B0597,,,,,,,,,,,,,0,,,,,T,terres,,,21460,3.782157,45.03403
2021-738724,2021-05-17,000001,Vente,42000,,,LES ENCLAVADES,B055,43320,43233,Sanssac-l'Église,43,,,432330000B0742,,,,,,,,,,,,,0,,,,,L,landes,,,450,3.775917,45.040121
2021-738724,2021-05-17,000001,Vente,42000,,,LES ENCLAVADES,B055,43320,43233,Sanssac-l'Église,43,,,432330000B0743,,,,,,,,,,,,,0,,,,,PA,pâtures,PATUR,Pâture plantée,1010,3.775823,45.04036
2021-738724,2021-05-17,000001,Vente,42000,,,LES ENCLAVADES,B055,43320,43233,Sanssac-l'Église,43,,,432330000B0744,,,,,,,,,,,,,0,,,,,T,terres,,,4960,3.776179,45.040166
2021-738724,2021-05-17,000001,Vente,42000,,,LES SOUTERADES,B119,43320,43233,Sanssac-l'Église,43,,,432330000B0748,,,,,,,,,,,,,0,,,,,PA,pâtures,PATUR,Pâture plantée,1405,3.777053,45.040068
2021-738724,2021-05-17,000001,Vente,42000,,,LES SOUTERADES,B119,43320,43233,Sanssac-l'Église,43,,,432330000B0749,,,,,,,,,,,,,0,,,,,T,terres,,,4920,3.77729,45.040466
2021-738724,2021-05-17,000001,Vente,42000,,,LES SOUTERADES,B119,43320,43233,Sanssac-l'Église,43,,,432330000B0749,,,,,,,,,,,,,0,,,,,T,terres,,,4920,3.77729,45.040466
2021-738724,2021-05-17,000001,Vente,42000,,,LE BOIS,B007,43320,43233,Sanssac-l'Église,43,,,432330000B0826,,,,,,,,,,,,,0,,,,,T,terres,,,5001,3.761243,45.034813
2021-738724,2021-05-17,000001,Vente,42000,,,LE BOIS,B007,43320,43233,Sanssac-l'Église,43,,,432330000B0828,,,,,,,,,,,,,0,,,,,P,prés,,,891,3.761704,45.034069
2021-738724,2021-05-17,000001,Vente,42000,,,LE BOIS,B007,43320,43233,Sanssac-l'Église,43,,,432330000B0829,,,,,,,,,,,,,0,,,,,P,prés,,,462,3.761263,45.033959
2021-738724,2021-05-17,000001,Vente,42000,,,LE BOIS,B007,43320,43233,Sanssac-l'Église,43,,,432330000B0831,,,,,,,,,,,,,0,,,,,T,terres,,,2611,3.762108,45.033779
2021-738724,2021-05-17,000001,Vente,42000,,,LE BOIS,B007,43320,43233,Sanssac-l'Église,43,,,432330000B0832,,,,,,,,,,,,,0,,,,,T,terres,,,2077,3.761316,45.033663
2021-738724,2021-05-17,000001,Vente,42000,,,LES OUPILLIERES,B093,43320,43233,Sanssac-l'Église,43,,,432330000B0839,,,,,,,,,,,,,0,,,,,T,terres,,,81,3.765542,45.031156
2021-738724,2021-05-17,000001,Vente,42000,,,LES OUPILLIERES,B093,43320,43233,Sanssac-l'Église,43,,,432330000B0842,,,,,,,,,,,,,0,,,,,T,terres,,,1993,3.765064,45.030784
2021-739728,2021-06-21,000001,Vente,9093.85,,,LE MARTOURET,B082,43320,43233,Sanssac-l'Église,43,,,43233000AE0159,,,,,,,,,,,,,0,,,,,AB,terrains a bâtir,,,775,3.793137,45.057292
2021-739826,2021-06-26,000001,Vente,215000,7,B,RTE DE LA PLAINE,0309,43320,43233,Sanssac-l'Église,43,,,43233000AO0081,,,,,,,,,,,,,0,1,Maison,87,4,AG,terrains d'agrément,,,1028,3.812654,45.048756
2021-739826,2021-06-26,000001,Vente,215000,7,B,RTE DE LA PLAINE,0309,43320,43233,Sanssac-l'Église,43,,,43233000AO0081,,,,,,,,,,,,,0,1,Maison,87,4,S,sols,,,500,3.812654,45.048756
2021-739827,2021-06-25,000001,Vente,167000,5,,RUE DES CARTALADES,0064,43320,43233,Sanssac-l'Église,43,,,43233000AN0035,,,,,,,,,,,,,0,1,Maison,101,5,S,sols,,,1000,3.807239,45.049528
2021-739827,2021-06-25,000001,Vente,167000,5,,RUE DES CARTALADES,0064,43320,43233,Sanssac-l'Église,43,,,43233000AN0035,,,,,,,,,,,,,0,1,Maison,101,5,J,jardins,,,513,3.807239,45.049528
2021-740020,2021-07-01,000002,Vente,43000,,,COYAC,B044,43320,43233,Sanssac-l'Église,43,,,43233000AN0162,,,,,,,,,,,,,0,,,,,T,terres,,,1167,3.806883,45.050546
2021-740021,2021-07-01,000001,Vente,40500,,,COYAC,B044,43320,43233,Sanssac-l'Église,43,,,43233000AN0161,,,,,,,,,,,,,0,,,,,T,terres,,,1244,3.807327,45.050252
2021-740246,2021-04-02,000001,Vente,205980,24,,IMP CROIX DU VALLAT,0288,43320,43233,Sanssac-l'Église,43,,,43233000AA0187,,,,,,,,,,,,,0,1,Maison,104,4,S,sols,,,689,3.777273,45.049981
2021-740383,2021-07-23,000001,Vente,91000,1,,RUE DU DOCTEUR LOUIS MARTIN,0110,43320,43233,Sanssac-l'Église,43,,,43233000AA0082,,,,,,,,,,,,,0,1,Maison,189,5,S,sols,,,99,3.77977,45.051978
2021-740497,2021-07-21,000001,Vente,40000,,,COYAC,B044,43320,43233,Sanssac-l'Église,43,,,43233000AN0163,,,,,,,,,,,,,0,,,,,T,terres,,,1147,3.806813,45.050262
2021-740602,2021-07-27,000002,Vente,1,,,COYAC,B044,43320,43233,Sanssac-l'Église,43,,,43233000AN0169,,,,,,,,,,,,,0,,,,,T,terres,,,146,3.809239,45.049468
2021-740900,2021-08-06,000001,Vente,239850,3,,RUE DE LA SOURCE DE BARRET,0323,43320,43233,Sanssac-l'Église,43,,,43233000AB0086,,,,,,,,,,,,,0,1,Maison,150,6,S,sols,,,900,3.771954,45.050682
2021-740900,2021-08-06,000001,Vente,239850,3,,RUE DE LA SOURCE DE BARRET,0323,43320,43233,Sanssac-l'Église,43,,,43233000AB0086,,,,,,,,,,,,,0,1,Maison,150,6,P,prés,,,863,3.771954,45.050682
2021-741199,2021-09-01,000001,Vente,73303.39,5072,,LE BOURG,B116,43320,43233,Sanssac-l'Église,43,,,43233000AA0116,,,,,,,,,,,,,0,1,Maison,80,3,S,sols,,,333,3.779374,45.051333
2021-741670,2021-09-03,000001,Vente,166000,5069,,LE BOURG,B116,43320,43233,Sanssac-l'Église,43,,,43233000AA0108,,,,,,,,,,,,,0,1,Maison,90,5,S,sols,,,62,3.779015,45.051464
2021-741670,2021-09-03,000001,Vente,166000,5002,,RUE DES DENTELLIERES,0100,43320,43233,Sanssac-l'Église,43,,,43233000AA0194,,,,,,,,,,,,,0,3,Dépendance,,0,S,sols,,,145,3.77917,45.051446
2021-741670,2021-09-03,000001,Vente,166000,5002,,RUE DES DENTELLIERES,0100,43320,43233,Sanssac-l'Église,43,,,43233000AA0194,,,,,,,,,,,,,0,3,Dépendance,,0,S,sols,,,145,3.77917,45.051446
2021-741670,2021-09-03,000001,Vente,166000,,,RUE DES DENTELLIERES,0100,43320,43233,Sanssac-l'Église,43,,,43233000AA0196,,,,,,,,,,,,,0,,,,,L,landes,,,29,3.779089,45.05145
2021-741757,2021-09-03,000001,Vente,52040,,,BARRET,B005,43320,43233,Sanssac-l'Église,43,,,43233000AB0120,,,,,,,,,,,,,0,,,,,AB,terrains a bâtir,,,1301,3.773179,45.050042
2021-742032,2021-09-30,000001,Vente,264300,11,,RUE DES COURBES,0328,43320,43233,Sanssac-l'Église,43,,,43233000AR0083,,,,,,,,,,,,,0,1,Maison,170,6,J,jardins,,,862,3.818613,45.056657
2021-742032,2021-09-30,000001,Vente,264300,11,,RUE DES COURBES,0328,43320,43233,Sanssac-l'Église,43,,,43233000AR0083,,,,,,,,,,,,,0,1,Maison,170,6,S,sols,,,500,3.818613,45.056657
2021-742087,2021-10-07,000001,Vente,43000,,,OUCHAIS,B089,43320,43233,Sanssac-l'Église,43,,,432330000B0101,,,,,,,,,,,,,0,,,,,P,prés,,,1685,3.765358,45.035466
2021-742219,2021-10-12,000001,Vente,213500,3,,IMP CROIX DU VALLAT,0288,43320,43233,Sanssac-l'Église,43,,,43233000AA0189,,,,,,,,,,,,,0,1,Maison,98,4,S,sols,,,684,3.777816,45.050002
2021-742347,2021-08-20,000001,Vente,54900,,,COYAC,B044,43320,43233,Sanssac-l'Église,43,,,43233000AN0170,,,,,,,,,,,,,0,,,,,T,terres,,,1533,3.809153,45.049328
2021-742375,2021-10-14,000001,Vente,227850,8,,RUE DES PRADEAUX,0332,43320,43233,Sanssac-l'Église,43,,,43233000AA0014,,,,,,,,,,,,,0,1,Maison,128,5,J,jardins,,,1104,3.77526,45.053919
2021-742375,2021-10-14,000001,Vente,227850,8,,RUE DES PRADEAUX,0332,43320,43233,Sanssac-l'Église,43,,,43233000AA0014,,,,,,,,,,,,,0,3,Dépendance,,0,S,sols,,,1000,3.77526,45.053919
2021-742375,2021-10-14,000001,Vente,227850,8,,RUE DES PRADEAUX,0332,43320,43233,Sanssac-l'Église,43,,,43233000AA0014,,,,,,,,,,,,,0,1,Maison,128,5,S,sols,,,1000,3.77526,45.053919
2021-742375,2021-10-14,000001,Vente,227850,8,,RUE DES PRADEAUX,0332,43320,43233,Sanssac-l'Église,43,,,43233000AA0014,,,,,,,,,,,,,0,3,Dépendance,,0,J,jardins,,,1104,3.77526,45.053919
2021-742850,2021-10-28,000001,Vente,4750,,,PRA DE LA ROCHE,B100,43320,43233,Sanssac-l'Église,43,,,43233000AV0010,,,,,,,,,,,,,0,,,,,P,prés,,,9355,3.801588,45.039247
2021-742864,2021-10-29,000001,Vente,57500,,,COYAC,B044,43320,43233,Sanssac-l'Église,43,,,43233000AN0171,,,,,,,,,,,,,0,,,,,T,terres,,,1623,3.808539,45.049222
2021-742999,2021-11-15,000001,Vente,229000,3,,RTE DES VIGNES DE LA BERNARDE,0312,43320,43233,Sanssac-l'Église,43,,,43233000AS0010,,,,,,,,,,,,,0,1,Maison,150,5,S,sols,,,1000,3.825165,45.05843
2021-742999,2021-11-15,000001,Vente,229000,3,,RTE DES VIGNES DE LA BERNARDE,0312,43320,43233,Sanssac-l'Église,43,,,43233000AS0010,,,,,,,,,,,,,0,1,Maison,150,5,B,bois,,,623,3.825165,45.05843
2021-742999,2021-11-15,000001,Vente,229000,3,,RTE DES VIGNES DE LA BERNARDE,0312,43320,43233,Sanssac-l'Église,43,,,43233000AS0010,,,,,,,,,,,,,0,1,Maison,150,5,L,landes,,,264,3.825165,45.05843
2021-742999,2021-11-15,000001,Vente,229000,3,,RTE DES VIGNES DE LA BERNARDE,0312,43320,43233,Sanssac-l'Église,43,,,43233000AS0010,,,,,,,,,,,,,0,1,Maison,150,5,J,jardins,,,840,3.825165,45.05843
2021-742999,2021-11-15,000001,Vente,229000,,,LES ADRETS,B001,43320,43233,Sanssac-l'Église,43,,,43233000AS0012,,,,,,,,,,,,,0,,,,,S,sols,,,94,3.825137,45.05788
2021-742999,2021-11-15,000001,Vente,229000,,,LES ADRETS,B001,43320,43233,Sanssac-l'Église,43,,,43233000AS0013,,,,,,,,,,,,,0,,,,,S,sols,,,12,3.825223,45.057841
2021-743524,2021-12-14,000001,Vente,16000,,,LE GRAIL,B070,43320,43233,Sanssac-l'Église,43,,,432330000A1409,,,,,,,,,,,,,0,,,,,T,terres,,,3090,3.77026,45.047221
2021-743524,2021-12-14,000001,Vente,16000,,,LE GRAIL,B070,43320,43233,Sanssac-l'Église,43,,,432330000A1409,,,,,,,,,,,,,0,,,,,T,terres,,,3090,3.77026,45.047221
2021-743524,2021-12-14,000001,Vente,16000,,,LE GRAIL,B070,43320,43233,Sanssac-l'Église,43,,,432330000A1409,,,,,,,,,,,,,0,,,,,T,terres,,,3090,3.77026,45.047221
2021-743524,2021-12-14,000001,Vente,16000,,,LE GRAIL,B070,43320,43233,Sanssac-l'Église,43,,,432330000A1417,,,,,,,,,,,,,0,,,,,T,terres,,,5062,3.77197,45.048208
2021-743524,2021-12-14,000001,Vente,16000,,,LE GRAIL,B070,43320,43233,Sanssac-l'Église,43,,,432330000A1417,,,,,,,,,,,,,0,,,,,T,terres,,,5062,3.77197,45.048208
2021-743524,2021-12-14,000001,Vente,16000,,,LE GRAIL,B070,43320,43233,Sanssac-l'Église,43,,,432330000A1417,,,,,,,,,,,,,0,,,,,T,terres,,,5062,3.77197,45.048208
2021-743524,2021-12-14,000001,Vente,16000,,,LE GRAIL,B070,43320,43233,Sanssac-l'Église,43,,,432330000A1419,,,,,,,,,,,,,0,,,,,T,terres,,,3080,3.770496,45.046837
2021-743524,2021-12-14,000001,Vente,16000,,,LE GRAIL,B070,43320,43233,Sanssac-l'Église,43,,,432330000A1419,,,,,,,,,,,,,0,,,,,T,terres,,,3080,3.770496,45.046837
2021-743524,2021-12-14,000001,Vente,16000,,,LE GRAIL,B070,43320,43233,Sanssac-l'Église,43,,,432330000A1419,,,,,,,,,,,,,0,,,,,T,terres,,,3081,3.770496,45.046837
2021-743798,2021-12-08,000001,Vente,84000,3,,RUE CENTRALE,0066,43320,43233,Sanssac-l'Église,43,,,43233000AA0128,,,,,,,,,,,,,0,1,Maison,96,5,S,sols,,,78,3.780142,45.050907
2021-743798,2021-12-08,000001,Vente,84000,,,LA CROIX DU VALLAT,B046,43320,43233,Sanssac-l'Église,43,,,43233000AA0211,,,,,,,,,,,,,0,,,,,S,sols,,,100,3.780079,45.050941
2021-743798,2021-12-08,000001,Vente,84000,,,LA CROIX DU VALLAT,B046,43320,43233,Sanssac-l'Église,43,,,43233000AA0212,,,,,,,,,,,,,0,,,,,S,sols,,,17,3.78002,45.050892
2021-743964,2021-12-29,000001,Vente,360000,7,,RUE DU BARRI,0333,43320,43233,Sanssac-l'Église,43,,,43233000AW0096,,,,,,,,,,,,,0,3,Dépendance,,0,S,sols,,,1500,3.801332,45.037682
2021-743964,2021-12-29,000001,Vente,360000,7,,RUE DU BARRI,0333,43320,43233,Sanssac-l'Église,43,,,43233000AW0096,,,,,,,,,,,,,0,1,Maison,198,5,S,sols,,,1500,3.801332,45.037682
2021-743964,2021-12-29,000001,Vente,360000,7,,RUE DU BARRI,0333,43320,43233,Sanssac-l'Église,43,,,43233000AW0096,,,,,,,,,,,,,0,3,Dépendance,,0,AG,terrains d'agrément,,,2734,3.801332,45.037682
2021-743964,2021-12-29,000001,Vente,360000,7,,RUE DU BARRI,0333,43320,43233,Sanssac-l'Église,43,,,43233000AW0096,,,,,,,,,,,,,0,1,Maison,198,5,AG,terrains d'agrément,,,2734,3.801332,45.037682
2021-744061,2021-12-15,000001,Vente,1635,,,LA PRADE,B101,43320,43233,Sanssac-l'Église,43,,,43233000AE0009,,,,,,,,,,,,,0,,,,,S,sols,,,327,3.789515,45.05644
2021-744271,2021-12-23,000001,Vente,150000,9,,PL DE L'EGLISE,0306,43320,43233,Sanssac-l'Église,43,,,43233000AA0087,,,,,,,,,,,,,0,2,Appartement,80,3,S,sols,,,79,3.779342,45.051634
2021-744271,2021-12-23,000001,Vente,150000,9,,PL DE L'EGLISE,0306,43320,43233,Sanssac-l'Église,43,,,43233000AA0087,,,,,,,,,,,,,0,2,Appartement,80,3,S,sols,,,79,3.779342,45.051634
