id_mutation,date_mutation,numero_disposition,nature_mutation,valeur_fonciere,adresse_numero,adresse_suffixe,adresse_nom_voie,adresse_code_voie,code_postal,code_commune,nom_commune,code_departement,ancien_code_commune,ancien_nom_commune,id_parcelle,ancien_id_parcelle,numero_volume,lot1_numero,lot1_surface_carrez,lot2_numero,lot2_surface_carrez,lot3_numero,lot3_surface_carrez,lot4_numero,lot4_surface_carrez,lot5_numero,lot5_surface_carrez,nombre_lots,code_type_local,type_local,surface_reelle_bati,nombre_pieces_principales,code_nature_culture,nature_culture,code_nature_culture_speciale,nature_culture_speciale,surface_terrain,longitude,latitude
2021-806940,2021-02-19,000001,Vente,3000,,,LE BARRY,B004,46360,46079,Cras,46,,,460790000A0621,,,,,,,,,,,,,0,,,,,T,terres,,,255,1.534458,44.567537
2021-806940,2021-02-19,000001,Vente,3000,,,LE BARRY,B004,46360,46079,Cras,46,,,460790000A0630,,,,,,,,,,,,,0,,,,,T,terres,,,2825,1.535143,44.567857
2021-806940,2021-02-19,000001,Vente,3000,,,LE BARRY,B004,46360,46079,Cras,46,,,460790000A0632,,,,,,,,,,,,,0,,,,,L,landes,PACAG,Pacage,460,1.534831,44.568342
2021-807440,2021-03-04,000002,Vente,400,,,LES PLAINES,B071,46360,46079,Cras,46,,,460790000A1157,,,,,,,,,,,,,0,,,,,S,sols,,,35,1.540723,44.569619
2021-807472,2021-03-12,000001,Vente,135500,5032,A,MOULIN DE CRAS,B064,46360,46079,Cras,46,,,460790000B0018,,,,,,,,,,,,,0,1,Maison,100,4,S,sols,,,470,1.552101,44.56161
2021-807472,2021-03-12,000001,Vente,135500,,,MOULIN DE CRAS,B064,46360,46079,Cras,46,,,460790000B0019,,,,,,,,,,,,,0,,,,,E,eaux,LAC,Lac,2750,1.55285,44.563859
2021-807472,2021-03-12,000001,Vente,135500,,,MOULIN DE CRAS,B064,46360,46079,Cras,46,,,460790000B0792,,,,,,,,,,,,,0,,,,,P,prés,,,1390,1.55232,44.56172
2021-807907,2021-04-14,000001,Vente,14500,,,BOUYSSONNADE,B016,46360,46079,Cras,46,,,460790000B0542,,,,,,,,,,,,,0,,,,,L,landes,,,520,1.549061,44.544375
2021-807907,2021-04-14,000001,Vente,14500,,,BOUYSSONNADE,B016,46360,46079,Cras,46,,,460790000B0543,,,,,,,,,,,,,0,,,,,T,terres,,,200,1.549079,44.544247
2021-807907,2021-04-14,000001,Vente,14500,,,BOUYSSONNADE,B016,46360,46079,Cras,46,,,460790000B0544,,,,,,,,,,,,,0,,,,,S,sols,,,16,1.549214,44.544237
2021-807907,2021-04-14,000001,Vente,14500,,,ST JULIEN,B080,46360,46079,Cras,46,,,460790000C0280,,,,,,,,,,,,,0,,,,,T,terres,,,581,1.549406,44.544057
2021-809283,2021-06-22,000001,Vente,500,,,LE BARRY,B004,46360,46079,Cras,46,,,460790000A0622,,,,,,,,,,,,,0,,,,,T,terres,,,190,1.534567,44.567511
2021-809283,2021-06-22,000001,Vente,500,,,LE BARRY,B004,46360,46079,Cras,46,,,460790000A0624,,,,,,,,,,,,,0,,,,,T,terres,,,560,1.534888,44.567497
2021-809292,2021-06-22,000001,Vente,6000,,,MACHINE SERRE,B042,46360,46079,Cras,46,,,460790000C0208,,,,,,,,,,,,,0,,,,,BT,taillis simples,,,11250,1.537903,44.547526
2021-809292,2021-06-22,000001,Vente,6000,,,SOUS MACHINE SERRE,B079,46360,46079,Cras,46,,,460790000C0225,,,,,,,,,,,,,0,,,,,L,landes,,,16285,1.540335,44.548918
2021-809292,2021-06-22,000001,Vente,6000,,,SOUS MACHINE SERRE,B079,46360,46079,Cras,46,,,460790000C0233,,,,,,,,,,,,,0,,,,,BT,taillis simples,,,2060,1.542692,44.547209
2021-809292,2021-06-22,000001,Vente,6000,,,SOUS MACHINE SERRE,B079,46360,46079,Cras,46,,,460790000C0234,,,,,,,,,,,,,0,,,,,T,terres,,,1560,1.542522,44.547576
2021-809292,2021-06-22,000001,Vente,6000,,,SOUS MACHINE SERRE,B079,46360,46079,Cras,46,,,460790000C0235,,,,,,,,,,,,,0,,,,,L,landes,,,13095,1.542888,44.547692
2021-809292,2021-06-22,000001,Vente,6000,,,SOUS MACHINE SERRE,B079,46360,46079,Cras,46,,,460790000C0236,,,,,,,,,,,,,0,,,,,BT,taillis simples,,,2185,1.543844,44.547898
2021-809376,2021-06-25,000001,Vente,261640,,,BOIS DE RUAYRES,B009,46360,46079,Cras,46,,,460790000A0137,,,,,,,,,,,,,0,,,,,BT,taillis simples,,,2670,1.544405,44.574774
2021-809376,2021-06-25,000001,Vente,261640,,,LES PLAINES,B071,46360,46079,Cras,46,,,460790000A0178,,,,,,,,,,,,,0,,,,,L,landes,,,3875,1.538113,44.572756
2021-809376,2021-06-25,000001,Vente,261640,,,LES PLAINES,B071,46360,46079,Cras,46,,,460790000A0179,,,,,,,,,,,,,0,,,,,L,landes,,,1615,1.537605,44.572486
2021-809376,2021-06-25,000001,Vente,261640,,,LA RODE,B074,46360,46079,Cras,46,,,460790000A0498,,,,,,,,,,,,,0,,,,,BT,taillis simples,,,20265,1.525792,44.567566
2021-809376,2021-06-25,000001,Vente,261640,,,LE CAYROU,B020,46360,46079,Cras,46,,,460790000A0789,,,,,,,,,,,,,0,,,,,T,terres,,,4885,1.531531,44.565559
2021-809376,2021-06-25,000001,Vente,261640,5053,,LE CAYROU,B020,46360,46079,Cras,46,,,460790000A0790,,,,,,,,,,,,,0,1,Maison,150,5,S,sols,,,895,1.531661,44.565742
2021-809376,2021-06-25,000001,Vente,261640,5053,,LE CAYROU,B020,46360,46079,Cras,46,,,460790000A0790,,,,,,,,,,,,,0,3,Dépendance,,0,S,sols,,,895,1.531661,44.565742
2021-809376,2021-06-25,000001,Vente,261640,,,LE CAYROU,B020,46360,46079,Cras,46,,,460790000A0791,,,,,,,,,,,,,0,,,,,T,terres,,,780,1.531046,44.565175
2021-809376,2021-06-25,000001,Vente,261640,,,LE CAYROU,B020,46360,46079,Cras,46,,,460790000A0793,,,,,,,,,,,,,0,,,,,T,terres,,,2020,1.530793,44.565192
2021-809376,2021-06-25,000001,Vente,261640,,,LES CARBONIERES,B018,46360,46079,Cras,46,,,460790000A0808,,,,,,,,,,,,,0,,,,,BT,taillis simples,,,25130,1.526887,44.563649
2021-809376,2021-06-25,000001,Vente,261640,,,LES CARBONIERES,B018,46360,46079,Cras,46,,,460790000A0810,,,,,,,,,,,,,0,,,,,L,landes,,,5100,1.529348,44.563197
2021-809376,2021-06-25,000001,Vente,261640,,,LES CARBONIERES,B018,46360,46079,Cras,46,,,460790000A0812,,,,,,,,,,,,,0,,,,,BT,taillis simples,,,13270,1.527586,44.562704
2021-809376,2021-06-25,000001,Vente,261640,,,LES CARBONIERES,B018,46360,46079,Cras,46,,,460790000A0813,,,,,,,,,,,,,0,,,,,BT,taillis simples,,,7200,1.526343,44.56238
2021-809376,2021-06-25,000001,Vente,261640,,,COMBEL DES VIGNES,B030,46360,46079,Cras,46,,,460790000A1031,,,,,,,,,,,,,0,,,,,BT,taillis simples,,,6330,1.524692,44.557499
2021-809376,2021-06-25,000001,Vente,261640,,,COMBEL DE GAILLARD,B026,46360,46079,Cras,46,,,460790000B0100,,,,,,,,,,,,,0,,,,,L,landes,PACAG,Pacage,3425,1.546857,44.559192
2021-809376,2021-06-25,000001,Vente,261640,,,COMBEL DE GAILLARD,B026,46360,46079,Cras,46,,,460790000B0101,,,,,,,,,,,,,0,,,,,L,landes,,,2895,1.548671,44.559725
2021-809376,2021-06-25,000001,Vente,261640,,,PAS DU LOUP ET GINDARME,B068,46360,46079,Cras,46,,,460790000B0708,,,,,,,,,,,,,0,,,,,BT,taillis simples,,,2550,1.555327,44.540583
2021-809376,2021-06-25,000001,Vente,261640,,,MAILLE,B043,46360,46079,Cras,46,,,460790000C0023,,,,,,,,,,,,,0,,,,,BT,taillis simples,,,5150,1.53984,44.560591
2021-809376,2021-06-25,000001,Vente,261640,,,COTE DE ST JULIEN,B034,46360,46079,Cras,46,,,460790000C0265,,,,,,,,,,,,,0,,,,,BT,taillis simples,,,3400,1.543568,44.549507
2021-809449,2021-07-13,000001,Vente,700,,,LE BARRY,B004,46360,46079,Cras,46,,,460790000A0620,,,,,,,,,,,,,0,,,,,T,terres,,,125,1.534334,44.567572
2021-810939,2021-09-30,000001,Vente,280000,5420,F,MURSENS,B065,46360,46079,Cras,46,,,460790000B0420,,,,,,,,,,,,,0,1,Maison,149,4,S,sols,,,1070,1.556727,44.546633
2021-810939,2021-09-30,000001,Vente,280000,5420,F,MURSENS,B065,46360,46079,Cras,46,,,460790000B0420,,,,,,,,,,,,,0,3,Dépendance,,0,S,sols,,,1070,1.556727,44.546633
2021-810939,2021-09-30,000001,Vente,280000,,,MURSENS,B065,46360,46079,Cras,46,,,460790000B0421,,,,,,,,,,,,,0,,,,,L,landes,,,5630,1.557808,44.546582
2021-810939,2021-09-30,000001,Vente,280000,,,MURSENS,B065,46360,46079,Cras,46,,,460790000B0847,,,,,,,,,,,,,0,,,,,L,landes,,,2683,1.557083,44.546907
2021-811152,2021-10-26,000001,Vente,927,,,LE BARRY,B004,46360,46079,Cras,46,,,460790000A0625,,,,,,,,,,,,,0,,,,,T,terres,,,309,1.534946,44.567414
2021-811819,2021-11-25,000001,Vente,130000,5046,,PECH CAFOL,B069,46360,46079,Cras,46,,,460790000A0708,,,,,,,,,,,,,0,1,Maison,55,3,S,sols,,,1245,1.532783,44.558128
2021-811819,2021-11-25,000001,Vente,130000,,,PECH CAFOL,B069,46360,46079,Cras,46,,,460790000A0709,,,,,,,,,,,,,0,,,,,T,terres,,,555,1.532744,44.557597
2021-811819,2021-11-25,000001,Vente,130000,,,PECH CAFOL,B069,46360,46079,Cras,46,,,460790000A1026,,,,,,,,,,,,,0,,,,,T,terres,,,12,1.535342,44.558303
2021-811819,2021-11-25,000001,Vente,130000,,,PECH CAFOL,B069,46360,46079,Cras,46,,,460790000A1027,,,,,,,,,,,,,0,,,,,BR,futaies résineuses,PIN,Pins,15365,1.534393,44.558186
2021-811819,2021-11-25,000001,Vente,130000,,,LE CAYROU,B020,46360,46079,Cras,46,,,460790000A1135,,,,,,,,,,,,,0,,,,,T,terres,,,653,1.532388,44.557816
2021-811819,2021-11-25,000001,Vente,130000,,,LE CAYROU,B020,46360,46079,Cras,46,,,460790000A1137,,,,,,,,,,,,,0,,,,,T,terres,,,2809,1.532415,44.557244
2021-811891,2021-12-01,000001,Vente,82500,,,CRAS,B037,46360,46079,Cras,46,,,460790000A0598,,,,,,,,,,,,,0,,,,,S,sols,,,125,1.532813,44.567309
2021-811891,2021-12-01,000001,Vente,82500,5008,,CRAS,B037,46360,46079,Cras,46,,,460790000A0599,,,,,,,,,,,,,0,1,Maison,74,5,S,sols,,,295,1.532775,44.567373
2021-811891,2021-12-01,000001,Vente,82500,5008,,CRAS,B037,46360,46079,Cras,46,,,460790000A0599,,,,,,,,,,,,,0,3,Dépendance,,0,S,sols,,,295,1.532775,44.567373
